{"text_format":"1","workbook":"xlsx","n_sheets":14,"sheets":["Classements","Classements non-confirmé","Résumé Pilotes","Résumé Passagers","Pilotes Nat","Passagers Nat","Pilotes Inter","Passagers Inter","Feuil1","Membres couples","Membres seuls","Numéro licences 23","Numéro licences","Kilomètre AR"],"not_rendered":{"charts":0,"images":2,"macros":1,"external_links":0,"defined_names":25,"comments":0,"pivot_tables":0},"unopened":[],"bounds":{"document_bytes":16777216,"sheet_cells":100000,"rows_first":2000,"rows_last":500,"rows_between":2000,"halvings":0,"cell_chars":16384,"cell_head_chars":4096},"cells_cut":0,"cells_raw":0,"read":"whole","date_system":"1900"}

{"sheet":"Classements","index":0,"n_rows":51,"n_cols":11,"rows_kept":51,"cut":false,"hidden":false,"merged":[]}
[null,"Pilotes","NAT","INT","SCRATCH",null,null,"Passagers","Nat","Inter","Scratch"]
[1,"MANZANO Pascal",8113,12303,20416,null,1,"GOUGEUL Sophie",7483,12303,19786]
[2,"STRYPSTEIN Nicolas",200,2570,2770,null,2,"PONT Patricia",10021,0,10021]
[3,"VANBELLINGEN Jean-Claude",4150,2203,6353,null,3,"LEROY Laure",3321,2203,5524]
[4,"BRUNEAU Denis-Claude",200,1342,1542,null,4,"MISEUR Carine",5164,0,5164]
[5,"DESCAMPS Geoffrey",200,1250,1450,null,5,"DEL FABBRO Laurence",200,1342,1542]
[6,"FAVRESSSE René",4499,1222,5721,null,6,"LAMIROY Anne",0,1056,1056]
[7,"DONY Marc",360,1220,1580,null,7,"DEFAUX Michèle",884,0,884]
[8,"URBAIN Philippe",0,1194,1194,null,8,"LAMBILLON Anne",360,0,360]
[9,"JAMOTTE Jean",15472,1156,16628,null,9,"BRIATTE Joëlle",0,0,0]
[10,"BALLION Pierre",360,1124,1484,null,10,"FIEVET Nathalie",0,0,0]
[11,"DAVIN Philippe",2533,1076,3609,null,11,"GOFFIN Guillaume",0,0,0]
[12,"MILET Benoit",504,1056,1560,null,12,"GREGORICS Kathy",0,0,0]
[13,"DESMAREE Francis",20260,0,20260,null,13,"MALLIEN Emelyne",0,0,0]
[14,"LESCAL Thierry",10370,0,10370,null,14,"PIERARD Anne-Sophie",0,0,0]
[15,"VAN DER BEETEN Pascal",10166,0,10166,null,15,"ARENZANA Jennifer",0,0,0]
[16,"WOUTERS Olivier",7563,0,7563,null,16,0,0,0,0]
[17,"NIHOUL Dany",6312,0,6312,null,17,0,0,0,0]
[18,"VANDY Rudi",5164,0,5164,null,18,0,0,0,0]
[19,"RAMEAU Didier",3956,0,3956,null,19,0,0,0,0]
[20,"HINYOT Thierry",3197,0,3197,null,20,0,0,0,0]
[21,"MARIEL Didier",1859,0,1859,null,21,0,0,0,0]
[22,"DEWAERSEGHERS Francis",1543,0,1543,null,22,0,0,0,0]
[23,"PARMENTIER Dominique",728,0,728,null,23,0,0,0,0]
[24,"MALLIEN Philippe",360,0,360,null,24,0,0,0,0]
[25,"VANSTEYVOORT André",200,0,200,null,25,0,0,0,0]
[26,"SMEETS Carine",160,0,160,null,26,0,0,0,0]
[27,"BENET Jean-Pol",0,0,0,null,27,0,0,0,0]
[28,"BERDOYES Yannick",0,0,0,null,28,0,0,0,0]
[29,"DHONDT Jerry",0,0,0,null,29,0,0,0,0]
[30,"GOFFIN Amaury",0,0,0,null,null,null,{"$f":"SUM(K2:K30)","v":44337},{"$f":"SUM(J2:J30)","v":16904},{"$f":"SUM(I31:J31)","v":61241}]
[31,"LAMBOTTE Didier",0,0,0,null,null,null,{"$f":"SUM(I31/K31)","v":0.72397576786793161},{"$f":"SUM(J31/K31)","v":0.27602423213206839}]
[32,"THIRIFAYS Vincent",0,0,0,null,null,null,"NAT","INT"]
[33,"LEFRANT Sébastien",0,0,0]
[34,0,0,0,0]
[35,0,0,0,0]
[36,0,0,0,0]
[37,0,0,0,0]
[38,0,0,0,0]
[39,0,0,0,0]
[40,0,0,0,0]
[41,0,0,0,0]
[42,0,0,0,0]
[43,0,0,0,0]
[44,0,0,0,0]
[45,0,0,0,0]
[46,0,0,0,0]
[]
[null,null,{"$f":"SUM(C2:C48)","v":108429},{"$f":"SUM(D2:D48)","v":27716},{"$f":"SUM(E2:E48)","v":136145}]
[null,null,{"$f":"SUM(C49/E49)","v":0.79642293143339826},{"$f":"SUM(D49/E49)","v":0.20357706856660179}]
[null,null,"NAT","INT"]

{"sheet":"Classements non-confirmé","index":1,"n_rows":51,"n_cols":11,"rows_kept":51,"cut":false,"hidden":false,"merged":[]}
[" ","Pilotes","NAT","INT","SCRATCH",null,null,"Passagers","Nat","Inter","Scratch"]
[1,"DESMAREE Francis",20260,0,20260,null,1,"GOUGEUL Sophie",7483,12303,19786]
[2,"JAMOTTE Jean",15472,1156,16628,null,2,"PONT Patricia",10021,0,10021]
[3,"LESCAL Thierry",10370,0,10370,null,3,"LEROY Laure",3321,2203,5524]
[4,"VAN DER BEETEN Pascal",10166,0,10166,null,4,"MISEUR Carine",5164,0,5164]
[5,"MANZANO Pascal",8433,12303,20736,null,5,"DEL FABBRO Laurence",200,1342,1542]
[6,"WOUTERS Olivier",7563,0,7563,null,6,"LAMIROY Anne",0,1056,1056]
[7,"NIHOUL Dany",6312,0,6312,null,7,"DEFAUX Michèle",884,0,884]
[8,"VANSTEYVOORT André",5598,4000,9598,null,8,"GREGORICS Kathy",360,0,360]
[9,"VANDY Rudi",5164,0,5164,null,9,"LAMBILLON Anne",360,0,360]
[10,"DONY Marc",4923,1220,6143,null,10,"BRIATTE Joëlle",0,0,0]
[11,"FAVRESSSE René",4499,1222,5721,null,11,"FIEVET Nathalie",0,0,0]
[12,"VANBELLINGEN Jean-Claude",4150,2203,6353,null,12,"GOFFIN Guillaume",0,0,0]
[13,"RAMEAU Didier",3956,0,3956,null,13,"MALLIEN Emelyne",0,0,0]
[14,"HINYOT Thierry",3197,0,3197,null,14,"PIERARD Anne-Sophie",0,0,0]
[15,"DAVIN Philippe",2533,1076,3609,null,15,"ARENZANA Jennifer",0,0,0]
[16,"MARIEL Didier",1859,0,1859,null,16,0,0,0,0]
[17,"DEWAERSEGHERS Francis",1831,0,1831,null,17,0,0,0,0]
[18,"LEFRANT Sébastien",1457,0,1457,null,18,0,0,0,0]
[19,"DHONDT Jerry",1429,0,1429,null,19,0,0,0,0]
[20,"BALLION Pierre",745,1124,1869,null,20,0,0,0,0]
[21,"PARMENTIER Dominique",728,0,728,null,21,0,0,0,0]
[22,"MALLIEN Philippe",624,0,624,null,22,0,0,0,0]
[23,"BENET Jean-Pol",520,0,520,null,23,0,0,0,0]
[24,"MILET Benoit",504,1056,1560,null,24,0,0,0,0]
[25,"BERDOYES Yannick",385,0,385,null,25,0,0,0,0]
[26,"THIRIFAYS Vincent",385,0,385,null,26,0,0,0,0]
[27,"BRUNEAU Denis-Claude",200,1342,1542,null,27,0,0,0,0]
[28,"DESCAMPS Geoffrey",200,1250,1450,null,28,0,0,0,0]
[29,"STRYPSTEIN Nicolas",200,2570,2770,null,29,0,0,0,0]
[30,"SMEETS Carine",160,0,160,null,null,null,{"$f":"SUM(K2:K30)","v":44697},{"$f":"SUM(J2:J30)","v":16904},{"$f":"SUM(I31:J31)","v":61601}]
[31,"GOFFIN Amaury",0,0,0,null,null,null,{"$f":"SUM(I31/K31)","v":0.72558887031054686},{"$f":"SUM(J31/K31)","v":0.27441112968945308}]
[32,"LAMBOTTE Didier",0,0,0,null,null,null,"NAT","INT"]
[33,"URBAIN Philippe",0,1194,1194]
[34,0,0,0,0]
[35,0,0,0,0]
[36,0,0,0,0]
[37,0,0,0,0]
[38,0,0,0,0]
[39,0,0,0,0]
[40,0,0,0,0]
[41,0,0,0,0]
[42,0,0,0,0]
[43,0,0,0,0]
[44,0,0,0,0]
[45,0,0,0,0]
[46,0,0,0,0]
[]
[null,null,{"$f":"SUM(C2:C48)","v":123823},{"$f":"SUM(D2:D48)","v":31716},{"$f":"SUM(E2:E48)","v":155539}]
[null,null,{"$f":"SUM(C49/E49)","v":0.79608972669234079},{"$f":"SUM(D49/E49)","v":0.20391027330765918}]
[null,null,"NAT","INT"]

{"sheet":"Résumé Pilotes","index":2,"n_rows":246,"n_cols":24,"rows_kept":246,"cut":false,"hidden":false,"merged":[[186,1,189,1],[166,1,169,1],[170,1,173,1],[174,1,177,1],[178,1,181,1],[182,1,185,1],[146,1,149,1],[150,1,153,1],[154,1,157,1],[158,1,161,1],[162,1,165,1],[126,1,129,1],[130,1,133,1],[134,1,137,1],[138,1,141,1],[142,1,145,1],[106,1,109,1],[110,1,113,1],[114,1,117,1],[118,1,121,1],[122,1,125,1],[86,1,89,1],[90,1,93,1],[94,1,97,1],[98,1,101,1],[102,1,105,1],[66,1,69,1],[70,1,73,1],[74,1,77,1],[78,1,81,1],[82,1,85,1],[46,1,49,1],[50,1,53,1],[54,1,57,1],[58,1,61,1],[62,1,65,1],[26,1,29,1],[30,1,33,1],[34,1,37,1],[38,1,41,1],[42,1,45,1],[6,1,9,1],[10,1,13,1],[14,1,17,1],[18,1,21,1],[22,1,25,1],[4,20,5,23],[4,3,4,4],[4,6,4,7],[4,9,4,10],[0,3,0,11],[4,14,5,17]]}
[null,null,null,"PILOTES"]
[]
[]
[null,"Aller-Retour",null,null,null,null,null,null,null,null,null,"Aller-Retour"]
[null,"Ronde",null,"NATIONAL",null,null,"INTERNATIONAL",null,null,"SCRATCH",null,"Ronde",null,null,"Confirmé",null,null,null,null,null,"Non-confirmé"]
[null,null,null,null,"TOTAL",null,null,"TOTAL",null,null,"TOTAL"]
[1,{"$f":"VLOOKUP(A7,'Numéro licences'!$H$4:$I$47,2)","v":"BALLION Pierre"},"Aller-Retour","Km  renseignés",{"$f":"SUM('Pilotes Nat'!CL8)","v":745},null,"Km  renseignés",{"$f":"SUM('Pilotes Inter'!CX7)","v":1124},null,"Km  renseignés",{"$f":"SUM(E7+H7)","v":1869},null,null,"Colonne1","Pilotes","NAT","INT","SCRATCH",null,null,"Pilotes","NAT","INT","SCRATCH"]
[null,null,"Ronde","Km confirmés",{"$f":"SUM('Pilotes Nat'!CL9)","v":360},null,"Km confirmés",{"$f":"SUM('Pilotes Inter'!CX8)","v":1124},null,"Km confirmés",{"$f":"SUM(E8+H8)","v":1484},null,null,1,{"$f":"VLOOKUP(N8,'Numéro licences'!$H$4:$I$47,2)","v":"BALLION Pierre"},{"$f":"SUM(E8)","v":360},{"$f":"SUM(H8)","v":1124},{"$f":"SUM(P8:Q8)","v":1484},null,1,{"$f":"VLOOKUP(T8,'Numéro licences'!$H$4:$I$47,2)","v":"BALLION Pierre"},{"$f":"SUM(E7)","v":745},{"$f":"SUM(H7)","v":1124},{"$f":"SUM(V8:W8)","v":1869}]
[null,null,null,"Rondes confirmées",{"$f":"SUM('Pilotes Nat'!CL10)","v":2},null,"Rondes confirmées",{"$f":"SUM('Pilotes Inter'!CX9)","v":1},null,"Rondes confirmées",3,null,null,2,{"$f":"VLOOKUP(N9,'Numéro licences'!$H$4:$I$47,2)","v":"BENET Jean-Pol"},{"$f":"SUM(E12)","v":0},{"$f":"SUM(H12)","v":0},0,null,2,{"$f":"VLOOKUP(T9,'Numéro licences'!$H$4:$I$47,2)","v":"BENET Jean-Pol"},{"$f":"SUM(E11)","v":520},{"$f":"SUM(H11)","v":0},{"$f":"SUM(V9:W9)","v":520}]
[null,null,null,"Rondes effectuées",{"$f":"SUM('Pilotes Nat'!CL11)","v":1},null,"Rondes effectuées",{"$f":"SUM('Pilotes Inter'!CX10)","v":1},null,"Rondes effectuées",2,null,null,3,{"$f":"VLOOKUP(N10,'Numéro licences'!$H$4:$I$47,2)","v":"BERDOYES Yannick"},{"$f":"SUM(E16)","v":0},{"$f":"SUM(H16)","v":0},0,null,3,{"$f":"VLOOKUP(T10,'Numéro licences'!$H$4:$I$47,2)","v":"BERDOYES Yannick"},{"$f":"SUM(E15)","v":385},{"$f":"SUM(H15)","v":0},385]
[2,{"$f":"VLOOKUP(A11,'Numéro licences'!$H$4:$I$47,2)","v":"BENET Jean-Pol"},"Aller-Retour","Km  renseignés",{"$f":"SUM('Pilotes Nat'!CL12)","v":520},null,"Km  renseignés",{"$f":"SUM('Pilotes Inter'!CX11)","v":0},null,"Km  renseignés",520,null,null,4,{"$f":"VLOOKUP(N11,'Numéro licences'!$H$4:$I$47,2)","v":"BRUNEAU Denis-Claude"},{"$f":"SUM(E20)","v":200},{"$f":"SUM(H20)","v":1342},1542,null,4,{"$f":"VLOOKUP(T11,'Numéro licences'!$H$4:$I$47,2)","v":"BRUNEAU Denis-Claude"},{"$f":"SUM(E19)","v":200},{"$f":"SUM(H19)","v":1342},1542]
[null,null,"Ronde","Km confirmés",{"$f":"SUM('Pilotes Nat'!CL13)","v":0},null,"Km confirmés",{"$f":"SUM('Pilotes Inter'!CX12)","v":0},null,"Km confirmés",0,null,null,5,{"$f":"VLOOKUP(N12,'Numéro licences'!$H$4:$I$47,2)","v":"DAVIN Philippe"},{"$f":"SUM(E24)","v":2533},{"$f":"SUM(H24)","v":1076},3609,null,5,{"$f":"VLOOKUP(T12,'Numéro licences'!$H$4:$I$47,2)","v":"DAVIN Philippe"},{"$f":"SUM(E23)","v":2533},{"$f":"SUM(H23)","v":1076},3609]
[null,null,null,"Rondes confirmées",{"$f":"SUM('Pilotes Nat'!CL14)","v":0},null,"Rondes confirmées",{"$f":"SUM('Pilotes Inter'!CX13)","v":0},null,"Rondes confirmées",0,null,null,6,{"$f":"VLOOKUP(N13,'Numéro licences'!$H$4:$I$47,2)","v":"DESCAMPS Geoffrey"},{"$f":"SUM(E28)","v":200},{"$f":"SUM(H28)","v":1250},1450,null,6,{"$f":"VLOOKUP(T13,'Numéro licences'!$H$4:$I$47,2)","v":"DESCAMPS Geoffrey"},{"$f":"SUM(E27)","v":200},{"$f":"SUM(H27)","v":1250},1450]
[null,null,null,"Rondes effectuées",{"$f":"SUM('Pilotes Nat'!CL15)","v":2},null,"Rondes effectuées",{"$f":"SUM('Pilotes Inter'!CX14)","v":0},null,"Rondes effectuées",2,null,null,7,{"$f":"VLOOKUP(N14,'Numéro licences'!$H$4:$I$47,2)","v":"DESMAREE Francis"},{"$f":"SUM(E32)","v":20260},{"$f":"SUM(H32)","v":0},20260,null,7,{"$f":"VLOOKUP(T14,'Numéro licences'!$H$4:$I$47,2)","v":"DESMAREE Francis"},{"$f":"SUM(E31)","v":20260},{"$f":"SUM(H31)","v":0},20260]
[3,{"$f":"VLOOKUP(A15,'Numéro licences'!$H$4:$I$47,2)","v":"BERDOYES Yannick"},"Aller-Retour","Km  renseignés",{"$f":"SUM('Pilotes Nat'!CL16)","v":385},null,"Km  renseignés",{"$f":"SUM('Pilotes Inter'!CX15)","v":0},null,"Km  renseignés",385,null,null,8,{"$f":"VLOOKUP(N15,'Numéro licences'!$H$4:$I$47,2)","v":"DEWAERSEGHERS Francis"},{"$f":"SUM(E36)","v":1543},{"$f":"SUM(H36)","v":0},1543,null,8,{"$f":"VLOOKUP(T15,'Numéro licences'!$H$4:$I$47,2)","v":"DEWAERSEGHERS Francis"},{"$f":"SUM(E35)","v":1831},{"$f":"SUM(H35)","v":0},1831]
[null,null,"Ronde","Km confirmés",{"$f":"SUM('Pilotes Nat'!CL17)","v":0},null,"Km confirmés",{"$f":"SUM('Pilotes Inter'!CX16)","v":0},null,"Km confirmés",0,null,null,9,{"$f":"VLOOKUP(N16,'Numéro licences'!$H$4:$I$47,2)","v":"DHONDT Jerry"},{"$f":"SUM(E40)","v":0},{"$f":"SUM(H40)","v":0},0,null,9,{"$f":"VLOOKUP(T16,'Numéro licences'!$H$4:$I$47,2)","v":"DHONDT Jerry"},{"$f":"SUM(E39)","v":1429},{"$f":"SUM(H39)","v":0},1429]
[null,null,null,"Rondes confirmées",{"$f":"SUM('Pilotes Nat'!CL18)","v":0},null,"Rondes confirmées",{"$f":"SUM('Pilotes Inter'!CX17)","v":0},null,"Rondes confirmées",0,null,null,10,{"$f":"VLOOKUP(N17,'Numéro licences'!$H$4:$I$47,2)","v":"DONY Marc"},{"$f":"SUM(E44)","v":360},{"$f":"SUM(H44)","v":1220},1580,null,10,{"$f":"VLOOKUP(T17,'Numéro licences'!$H$4:$I$47,2)","v":"DONY Marc"},{"$f":"SUM(E43)","v":4923},{"$f":"SUM(H43)","v":1220},6143]
[null,null,null,"Rondes effectuées",{"$f":"SUM('Pilotes Nat'!CL19)","v":1},null,"Rondes effectuées",{"$f":"SUM('Pilotes Inter'!CX18)","v":0},null,"Rondes effectuées",1,null,null,11,{"$f":"VLOOKUP(N18,'Numéro licences'!$H$4:$I$47,2)","v":"FAVRESSSE René"},{"$f":"SUM(E48)","v":4499},{"$f":"SUM(H48)","v":1222},5721,null,11,{"$f":"VLOOKUP(T18,'Numéro licences'!$H$4:$I$47,2)","v":"FAVRESSSE René"},{"$f":"SUM(E47)","v":4499},{"$f":"SUM(H47)","v":1222},5721]
[4,{"$f":"VLOOKUP(A19,'Numéro licences'!$H$4:$I$47,2)","v":"BRUNEAU Denis-Claude"},"Aller-Retour","Km  renseignés",{"$f":"SUM('Pilotes Nat'!CL20)","v":200},null,"Km  renseignés",{"$f":"SUM('Pilotes Inter'!CX19)","v":1342},null,"Km  renseignés",1542,null,null,12,{"$f":"VLOOKUP(N19,'Numéro licences'!$H$4:$I$47,2)","v":"GOFFIN Amaury"},{"$f":"SUM(E52)","v":0},{"$f":"SUM(H52)","v":0},0,null,12,{"$f":"VLOOKUP(T19,'Numéro licences'!$H$4:$I$47,2)","v":"GOFFIN Amaury"},{"$f":"SUM(E51)","v":0},{"$f":"SUM(H51)","v":0},0]
[null,null,"Ronde","Km confirmés",{"$f":"SUM('Pilotes Nat'!CL21)","v":200},null,"Km confirmés",{"$f":"SUM('Pilotes Inter'!CX20)","v":1342},null,"Km confirmés",1542,null,null,13,{"$f":"VLOOKUP(N20,'Numéro licences'!$H$4:$I$47,2)","v":"HINYOT Thierry"},{"$f":"SUM(E56)","v":3197},{"$f":"SUM(H56)","v":0},3197,null,13,{"$f":"VLOOKUP(T20,'Numéro licences'!$H$4:$I$47,2)","v":"HINYOT Thierry"},{"$f":"SUM(E55)","v":3197},{"$f":"SUM(H55)","v":0},3197]
[null,null,null,"Rondes confirmées",{"$f":"SUM('Pilotes Nat'!CL22)","v":1},null,"Rondes confirmées",{"$f":"SUM('Pilotes Inter'!CX21)","v":1},null,"Rondes confirmées",2,null,null,14,{"$f":"VLOOKUP(N21,'Numéro licences'!$H$4:$I$47,2)","v":"JAMOTTE Jean"},{"$f":"SUM(E60)","v":15472},{"$f":"SUM(H60)","v":1156},16628,null,14,{"$f":"VLOOKUP(T21,'Numéro licences'!$H$4:$I$47,2)","v":"JAMOTTE Jean"},{"$f":"SUM(E59)","v":15472},{"$f":"SUM(H59)","v":1156},16628]
[null,null,null,"Rondes effectuées",{"$f":"SUM('Pilotes Nat'!CL23)","v":0},null,"Rondes effectuées",{"$f":"SUM('Pilotes Inter'!CX22)","v":1},null,"Rondes effectuées",1,null,null,15,{"$f":"VLOOKUP(N22,'Numéro licences'!$H$4:$I$47,2)","v":"LAMBOTTE Didier"},{"$f":"SUM(E64)","v":0},{"$f":"SUM(H64)","v":0},0,null,15,{"$f":"VLOOKUP(T22,'Numéro licences'!$H$4:$I$47,2)","v":"LAMBOTTE Didier"},{"$f":"SUM(E63)","v":0},{"$f":"SUM(H63)","v":0},0]
[5,{"$f":"VLOOKUP(A23,'Numéro licences'!$H$4:$I$47,2)","v":"DAVIN Philippe"},"Aller-Retour","Km  renseignés",{"$f":"SUM('Pilotes Nat'!CL24)","v":2533},null,"Km  renseignés",{"$f":"SUM('Pilotes Inter'!CX23)","v":1076},null,"Km  renseignés",3609,null,null,16,{"$f":"VLOOKUP(N23,'Numéro licences'!$H$4:$I$47,2)","v":"LESCAL Thierry"},{"$f":"SUM(E68)","v":10370},{"$f":"SUM(H68)","v":0},10370,null,16,{"$f":"VLOOKUP(T23,'Numéro licences'!$H$4:$I$47,2)","v":"LESCAL Thierry"},{"$f":"SUM(E67)","v":10370},{"$f":"SUM(H67)","v":0},10370]
[null,null,"Ronde","Km confirmés",{"$f":"SUM('Pilotes Nat'!CL25)","v":2533},null,"Km confirmés",{"$f":"SUM('Pilotes Inter'!CX24)","v":1076},null,"Km confirmés",3609,null,null,17,{"$f":"VLOOKUP(N24,'Numéro licences'!$H$4:$I$47,2)","v":"MALLIEN Philippe"},{"$f":"SUM(E72)","v":360},{"$f":"SUM(H72)","v":0},360,null,17,{"$f":"VLOOKUP(T24,'Numéro licences'!$H$4:$I$47,2)","v":"MALLIEN Philippe"},{"$f":"SUM(E71)","v":624},{"$f":"SUM(H71)","v":0},624]
[null,null,null,"Rondes confirmées",{"$f":"SUM('Pilotes Nat'!CL26)","v":11},null,"Rondes confirmées",{"$f":"SUM('Pilotes Inter'!CX25)","v":1},null,"Rondes confirmées",12,null,null,18,{"$f":"VLOOKUP(N25,'Numéro licences'!$H$4:$I$47,2)","v":"MANZANO Pascal"},{"$f":"SUM(E76)","v":8113},{"$f":"SUM(H76)","v":12303},20416,null,18,{"$f":"VLOOKUP(T25,'Numéro licences'!$H$4:$I$47,2)","v":"MANZANO Pascal"},{"$f":"SUM(E75)","v":8433},{"$f":"SUM(H75)","v":12303},20736]
[null,null,null,"Rondes effectuées",{"$f":"SUM('Pilotes Nat'!CL27)","v":9},null,"Rondes effectuées",{"$f":"SUM('Pilotes Inter'!CX26)","v":1},null,"Rondes effectuées",10,null,null,19,{"$f":"VLOOKUP(N26,'Numéro licences'!$H$4:$I$47,2)","v":"MARIEL Didier"},{"$f":"SUM(E80)","v":1859},{"$f":"SUM(H80)","v":0},1859,null,19,{"$f":"VLOOKUP(T26,'Numéro licences'!$H$4:$I$47,2)","v":"MARIEL Didier"},{"$f":"SUM(E79)","v":1859},{"$f":"SUM(H79)","v":0},1859]
[6,{"$f":"VLOOKUP(A27,'Numéro licences'!$H$4:$I$47,2)","v":"DESCAMPS Geoffrey"},"Aller-Retour","Km  renseignés",{"$f":"SUM('Pilotes Nat'!CL28)","v":200},null,"Km  renseignés",{"$f":"SUM('Pilotes Inter'!CX27)","v":1250},null,"Km  renseignés",1450,null,null,20,{"$f":"VLOOKUP(N27,'Numéro licences'!$H$4:$I$47,2)","v":"MILET Benoit"},{"$f":"SUM(E84)","v":504},{"$f":"SUM(H84)","v":1056},1560,null,20,{"$f":"VLOOKUP(T27,'Numéro licences'!$H$4:$I$47,2)","v":"MILET Benoit"},{"$f":"SUM(E83)","v":504},{"$f":"SUM(H83)","v":1056},1560]
[null,null,"Ronde","Km confirmés",{"$f":"SUM('Pilotes Nat'!CL29)","v":200},null,"Km confirmés",{"$f":"SUM('Pilotes Inter'!CX28)","v":1250},null,"Km confirmés",1450,null,null,21,{"$f":"VLOOKUP(N28,'Numéro licences'!$H$4:$I$47,2)","v":"NIHOUL Dany"},{"$f":"SUM(E88)","v":6312},{"$f":"SUM(H88)","v":0},6312,null,21,{"$f":"VLOOKUP(T28,'Numéro licences'!$H$4:$I$47,2)","v":"NIHOUL Dany"},{"$f":"SUM(E87)","v":6312},{"$f":"SUM(H87)","v":0},6312]
[null,null,null,"Rondes confirmées",{"$f":"SUM('Pilotes Nat'!CL30)","v":1},null,"Rondes confirmées",{"$f":"SUM('Pilotes Inter'!CX29)","v":1},null,"Rondes confirmées",2,null,null,22,{"$f":"VLOOKUP(N29,'Numéro licences'!$H$4:$I$47,2)","v":"PARMENTIER Dominique"},{"$f":"SUM(E92)","v":728},{"$f":"SUM(H92)","v":0},728,null,22,{"$f":"VLOOKUP(T29,'Numéro licences'!$H$4:$I$47,2)","v":"PARMENTIER Dominique"},{"$f":"SUM(E91)","v":728},{"$f":"SUM(H91)","v":0},728]
[null,null,null,"Rondes effectuées",{"$f":"SUM('Pilotes Nat'!CL31)","v":0},null,"Rondes effectuées",{"$f":"SUM('Pilotes Inter'!CX30)","v":1},null,"Rondes effectuées",1,null,null,23,{"$f":"VLOOKUP(N30,'Numéro licences'!$H$4:$I$47,2)","v":"RAMEAU Didier"},{"$f":"SUM(E96)","v":3956},{"$f":"SUM(H96)","v":0},3956,null,23,{"$f":"VLOOKUP(T30,'Numéro licences'!$H$4:$I$47,2)","v":"RAMEAU Didier"},{"$f":"SUM(E95)","v":3956},{"$f":"SUM(H95)","v":0},3956]
[7,{"$f":"VLOOKUP(A31,'Numéro licences'!$H$4:$I$47,2)","v":"DESMAREE Francis"},"Aller-Retour","Km  renseignés",{"$f":"SUM('Pilotes Nat'!CL32)","v":20260},null,"Km  renseignés",{"$f":"SUM('Pilotes Inter'!CX31)","v":0},null,"Km  renseignés",20260,null,null,24,{"$f":"VLOOKUP(N31,'Numéro licences'!$H$4:$I$47,2)","v":"SMEETS Carine"},{"$f":"SUM(E100)","v":160},{"$f":"SUM(H100)","v":0},160,null,24,{"$f":"VLOOKUP(T31,'Numéro licences'!$H$4:$I$47,2)","v":"SMEETS Carine"},{"$f":"SUM(E99)","v":160},{"$f":"SUM(H99)","v":0},160]
[null,null,"Ronde","Km confirmés",{"$f":"SUM('Pilotes Nat'!CL33)","v":20260},null,"Km confirmés",{"$f":"SUM('Pilotes Inter'!CX32)","v":0},null,"Km confirmés",20260,null,null,25,{"$f":"VLOOKUP(N32,'Numéro licences'!$H$4:$I$47,2)","v":"STRYPSTEIN Nicolas"},{"$f":"SUM(E104)","v":200},{"$f":"SUM(H104)","v":2570},2770,null,25,{"$f":"VLOOKUP(T32,'Numéro licences'!$H$4:$I$47,2)","v":"STRYPSTEIN Nicolas"},{"$f":"SUM(E103)","v":200},{"$f":"SUM(H103)","v":2570},2770]
[null,null,null,"Rondes confirmées",{"$f":"SUM('Pilotes Nat'!CL34)","v":56},null,"Rondes confirmées",{"$f":"SUM('Pilotes Inter'!CX33)","v":0},null,"Rondes confirmées",56,null,null,26,{"$f":"VLOOKUP(N33,'Numéro licences'!$H$4:$I$47,2)","v":"URBAIN Philippe"},{"$f":"SUM(E108)","v":0},{"$f":"SUM(H108)","v":1194},1194,null,26,{"$f":"VLOOKUP(T33,'Numéro licences'!$H$4:$I$47,2)","v":"URBAIN Philippe"},{"$f":"SUM(E107)","v":0},{"$f":"SUM(H107)","v":1194},1194]
[null,null,null,"Rondes effectuées",{"$f":"SUM('Pilotes Nat'!CL35)","v":54},null,"Rondes effectuées",{"$f":"SUM('Pilotes Inter'!CX34)","v":0},null,"Rondes effectuées",54,null,null,27,{"$f":"VLOOKUP(N34,'Numéro licences'!$H$4:$I$47,2)","v":"VANBELLINGEN Jean-Claude"},{"$f":"SUM(E112)","v":4150},{"$f":"SUM(H112)","v":2203},6353,null,27,{"$f":"VLOOKUP(T34,'Numéro licences'!$H$4:$I$47,2)","v":"VANBELLINGEN Jean-Claude"},{"$f":"SUM(E111)","v":4150},{"$f":"SUM(H111)","v":2203},6353]
[8,{"$f":"VLOOKUP(A35,'Numéro licences'!$H$4:$I$47,2)","v":"DEWAERSEGHERS Francis"},"Aller-Retour","Km  renseignés",{"$f":"SUM('Pilotes Nat'!CL36)","v":1831},null,"Km  renseignés",{"$f":"SUM('Pilotes Inter'!CX35)","v":0},null,"Km  renseignés",1831,null,null,28,{"$f":"VLOOKUP(N35,'Numéro licences'!$H$4:$I$47,2)","v":"VAN DER BEETEN Pascal"},{"$f":"SUM(E116)","v":10166},{"$f":"SUM(H116)","v":0},10166,null,28,{"$f":"VLOOKUP(T35,'Numéro licences'!$H$4:$I$47,2)","v":"VAN DER BEETEN Pascal"},{"$f":"SUM(E115)","v":10166},{"$f":"SUM(H115)","v":0},10166]
[null,null,"Ronde","Km confirmés",{"$f":"SUM('Pilotes Nat'!CL37)","v":1543},null,"Km confirmés",{"$f":"SUM('Pilotes Inter'!CX36)","v":0},null,"Km confirmés",1543,null,null,29,{"$f":"VLOOKUP(N36,'Numéro licences'!$H$4:$I$47,2)","v":"VANSTEYVOORT André"},{"$f":"SUM(E120)","v":200},{"$f":"SUM(H120)","v":0},200,null,29,{"$f":"VLOOKUP(T36,'Numéro licences'!$H$4:$I$47,2)","v":"VANSTEYVOORT André"},{"$f":"SUM(E119)","v":5598},{"$f":"SUM(H119)","v":4000},9598]
[null,null,null,"Rondes confirmées",{"$f":"SUM('Pilotes Nat'!CL38)","v":5},null,"Rondes confirmées",{"$f":"SUM('Pilotes Inter'!CX37)","v":0},null,"Rondes confirmées",5,null,null,30,{"$f":"VLOOKUP(N37,'Numéro licences'!$H$4:$I$47,2)","v":"WOUTERS Olivier"},{"$f":"SUM(E124)","v":7563},{"$f":"SUM(H124)","v":0},7563,null,30,{"$f":"VLOOKUP(T37,'Numéro licences'!$H$4:$I$47,2)","v":"WOUTERS Olivier"},{"$f":"SUM(E123)","v":7563},{"$f":"SUM(H123)","v":0},7563]
[null,null,null,"Rondes effectuées",{"$f":"SUM('Pilotes Nat'!CL39)","v":6},null,"Rondes effectuées",{"$f":"SUM('Pilotes Inter'!CX38)","v":0},null,"Rondes effectuées",6,null,null,31,{"$f":"VLOOKUP(N38,'Numéro licences'!$H$4:$I$47,2)","v":"THIRIFAYS Vincent"},{"$f":"SUM(E128)","v":0},{"$f":"SUM(H128)","v":0},0,null,31,{"$f":"VLOOKUP(T38,'Numéro licences'!$H$4:$I$47,2)","v":"THIRIFAYS Vincent"},{"$f":"SUM(E127)","v":385},{"$f":"SUM(H127)","v":0},385]
[9,{"$f":"VLOOKUP(A39,'Numéro licences'!$H$4:$I$47,2)","v":"DHONDT Jerry"},"Aller-Retour","Km  renseignés",{"$f":"SUM('Pilotes Nat'!CL40)","v":1429},null,"Km  renseignés",{"$f":"SUM('Pilotes Inter'!CX39)","v":0},null,"Km  renseignés",1429,null,null,32,{"$f":"VLOOKUP(N39,'Numéro licences'!$H$4:$I$47,2)","v":"VANDY Rudi"},{"$f":"SUM(E132)","v":5164},{"$f":"SUM(H132)","v":0},5164,null,32,{"$f":"VLOOKUP(T39,'Numéro licences'!$H$4:$I$47,2)","v":"VANDY Rudi"},{"$f":"SUM(E131)","v":5164},{"$f":"SUM(H131)","v":0},5164]
[null,null,"Ronde","Km confirmés",{"$f":"SUM('Pilotes Nat'!CL41)","v":0},null,"Km confirmés",{"$f":"SUM('Pilotes Inter'!CX40)","v":0},null,"Km confirmés",0,null,null,33,{"$f":"VLOOKUP(N40,'Numéro licences'!$H$4:$I$47,2)","v":"LEFRANT Sébastien"},{"$f":"SUM(E136)","v":0},{"$f":"SUM(H136)","v":0},0,null,33,{"$f":"VLOOKUP(T40,'Numéro licences'!$H$4:$I$47,2)","v":"LEFRANT Sébastien"},{"$f":"SUM(E135)","v":1457},{"$f":"SUM(H135)","v":0},1457]
[null,null,null,"Rondes confirmées",{"$f":"SUM('Pilotes Nat'!CL42)","v":0},null,"Rondes confirmées",{"$f":"SUM('Pilotes Inter'!CX41)","v":0},null,"Rondes confirmées",0,null,null,34,{"$f":"VLOOKUP(N41,'Numéro licences'!$H$4:$I$47,2)","v":0},{"$f":"SUM(E140)","v":0},{"$f":"SUM(H140)","v":0},0,null,34,{"$f":"VLOOKUP(T41,'Numéro licences'!$H$4:$I$47,2)","v":0},{"$f":"SUM(E139)","v":0},{"$f":"SUM(H139)","v":0},0]
[null,null,null,"Rondes effectuées",{"$f":"SUM('Pilotes Nat'!CL43)","v":5},null,"Rondes effectuées",{"$f":"SUM('Pilotes Inter'!CX42)","v":0},null,"Rondes effectuées",5,null,null,35,{"$f":"VLOOKUP(N42,'Numéro licences'!$H$4:$I$47,2)","v":0},{"$f":"SUM(E144)","v":0},{"$f":"SUM(H144)","v":0},0,null,35,{"$f":"VLOOKUP(T42,'Numéro licences'!$H$4:$I$47,2)","v":0},{"$f":"SUM(E143)","v":0},{"$f":"SUM(H143)","v":0},0]
[10,{"$f":"VLOOKUP(A43,'Numéro licences'!$H$4:$I$47,2)","v":"DONY Marc"},"Aller-Retour","Km  renseignés",{"$f":"SUM('Pilotes Nat'!CL44)","v":4923},null,"Km  renseignés",{"$f":"SUM('Pilotes Inter'!CX43)","v":1220},null,"Km  renseignés",6143,null,null,36,{"$f":"VLOOKUP(N43,'Numéro licences'!$H$4:$I$47,2)","v":0},{"$f":"SUM(E148)","v":0},{"$f":"SUM(H148)","v":0},0,null,36,{"$f":"VLOOKUP(T43,'Numéro licences'!$H$4:$I$47,2)","v":0},{"$f":"SUM(E147)","v":0},{"$f":"SUM(H147)","v":0},0]
[null,null,"Ronde","Km confirmés",{"$f":"SUM('Pilotes Nat'!CL45)","v":360},null,"Km confirmés",{"$f":"SUM('Pilotes Inter'!CX44)","v":1220},null,"Km confirmés",1580,null,null,37,{"$f":"VLOOKUP(N44,'Numéro licences'!$H$4:$I$47,2)","v":0},{"$f":"SUM(E152)","v":0},{"$f":"SUM(H152)","v":0},0,null,37,{"$f":"VLOOKUP(T44,'Numéro licences'!$H$4:$I$47,2)","v":0},{"$f":"SUM(E151)","v":0},{"$f":"SUM(H151)","v":0},0]
[null,null,null,"Rondes confirmées",{"$f":"SUM('Pilotes Nat'!CL46)","v":2},null,"Rondes confirmées",{"$f":"SUM('Pilotes Inter'!CX45)","v":1},null,"Rondes confirmées",3,null,null,38,{"$f":"VLOOKUP(N45,'Numéro licences'!$H$4:$I$47,2)","v":0},{"$f":"SUM(E156)","v":0},{"$f":"SUM(H156)","v":0},0,null,38,{"$f":"VLOOKUP(T45,'Numéro licences'!$H$4:$I$47,2)","v":0},{"$f":"SUM(E155)","v":0},{"$f":"SUM(H155)","v":0},0]
[null,null,null,"Rondes effectuées",{"$f":"SUM('Pilotes Nat'!CL47)","v":15},null,"Rondes effectuées",{"$f":"SUM('Pilotes Inter'!CX46)","v":1},null,"Rondes effectuées",16,null,null,39,{"$f":"VLOOKUP(N46,'Numéro licences'!$H$4:$I$47,2)","v":0},{"$f":"SUM(E160)","v":0},{"$f":"SUM(H160)","v":0},0,null,39,{"$f":"VLOOKUP(T46,'Numéro licences'!$H$4:$I$47,2)","v":0},{"$f":"SUM(E159)","v":0},{"$f":"SUM(H159)","v":0},0]
[11,{"$f":"VLOOKUP(A47,'Numéro licences'!$H$4:$I$47,2)","v":"FAVRESSSE René"},"Aller-Retour","Km  renseignés",{"$f":"SUM('Pilotes Nat'!CL48)","v":4499},null,"Km  renseignés",{"$f":"SUM('Pilotes Inter'!CX47)","v":1222},null,"Km  renseignés",5721,null,null,40,{"$f":"VLOOKUP(N47,'Numéro licences'!$H$4:$I$47,2)","v":0},{"$f":"SUM(E164)","v":0},{"$f":"SUM(H164)","v":0},0,null,40,{"$f":"VLOOKUP(T47,'Numéro licences'!$H$4:$I$47,2)","v":0},{"$f":"SUM(E163)","v":0},{"$f":"SUM(H163)","v":0},0]
[null,null,"Ronde","Km confirmés",{"$f":"SUM('Pilotes Nat'!CL49)","v":4499},null,"Km confirmés",{"$f":"SUM('Pilotes Inter'!CX48)","v":1222},null,"Km confirmés",5721,null,null,41,{"$f":"VLOOKUP(N48,'Numéro licences'!$H$4:$I$47,2)","v":0},{"$f":"SUM(E168)","v":0},{"$f":"SUM(H168)","v":0},0,null,41,{"$f":"VLOOKUP(T48,'Numéro licences'!$H$4:$I$47,2)","v":0},{"$f":"SUM(E167)","v":0},{"$f":"SUM(H167)","v":0},0]
[null,null,null,"Rondes confirmées",{"$f":"SUM('Pilotes Nat'!CL50)","v":15},null,"Rondes confirmées",{"$f":"SUM('Pilotes Inter'!CX49)","v":1},null,"Rondes confirmées",16,null,null,42,{"$f":"VLOOKUP(N49,'Numéro licences'!$H$4:$I$47,2)","v":0},{"$f":"SUM(E172)","v":0},{"$f":"SUM(H172)","v":0},0,null,42,{"$f":"VLOOKUP(T49,'Numéro licences'!$H$4:$I$47,2)","v":0},{"$f":"SUM(E171)","v":0},{"$f":"SUM(H171)","v":0},0]
[null,null,null,"Rondes effectuées",{"$f":"SUM('Pilotes Nat'!CL51)","v":13},null,"Rondes effectuées",{"$f":"SUM('Pilotes Inter'!CX50)","v":1},null,"Rondes effectuées",14,null,null,43,{"$f":"VLOOKUP(N50,'Numéro licences'!$H$4:$I$47,2)","v":0},{"$f":"SUM(E176)","v":0},{"$f":"SUM(H176)","v":0},0,null,43,{"$f":"VLOOKUP(T50,'Numéro licences'!$H$4:$I$47,2)","v":0},{"$f":"SUM(E175)","v":0},{"$f":"SUM(H175)","v":0},0]
[12,{"$f":"VLOOKUP(A51,'Numéro licences'!$H$4:$I$47,2)","v":"GOFFIN Amaury"},"Aller-Retour","Km  renseignés",{"$f":"SUM('Pilotes Nat'!CL52)","v":0},null,"Km  renseignés",{"$f":"SUM('Pilotes Inter'!CX51)","v":0},null,"Km  renseignés",0,null,null,44,{"$f":"VLOOKUP(N51,'Numéro licences'!$H$4:$I$47,2)","v":0},{"$f":"SUM(E180)","v":0},{"$f":"SUM(H180)","v":0},0,null,44,{"$f":"VLOOKUP(T51,'Numéro licences'!$H$4:$I$47,2)","v":0},{"$f":"SUM(E179)","v":0},{"$f":"SUM(H179)","v":0},0]
[null,null,"Ronde","Km confirmés",{"$f":"SUM('Pilotes Nat'!CL53)","v":0},null,"Km confirmés",{"$f":"SUM('Pilotes Inter'!CX52)","v":0},null,"Km confirmés",0,null,null,45,{"$f":"VLOOKUP(N52,'Numéro licences'!$H$4:$I$47,2)","v":0},{"$f":"SUM(E184)","v":0},{"$f":"SUM(H184)","v":0},0,null,45,{"$f":"VLOOKUP(T52,'Numéro licences'!$H$4:$I$47,2)","v":0},{"$f":"SUM(E183)","v":0},{"$f":"SUM(H183)","v":0},0]
[null,null,null,"Rondes confirmées",{"$f":"SUM('Pilotes Nat'!CL54)","v":0},null,"Rondes confirmées",{"$f":"SUM('Pilotes Inter'!CX53)","v":0},null,"Rondes confirmées",0,null,null,46,{"$f":"VLOOKUP(N53,'Numéro licences'!$H$4:$I$47,2)","v":0},{"$f":"SUM(E188)","v":0},{"$f":"SUM(H188)","v":0},0,null,46,{"$f":"VLOOKUP(T53,'Numéro licences'!$H$4:$I$47,2)","v":0},{"$f":"SUM(E187)","v":0},{"$f":"SUM(H187)","v":0},0]
[null,null,null,"Rondes effectuées",{"$f":"SUM('Pilotes Nat'!CL55)","v":0},null,"Rondes effectuées",{"$f":"SUM('Pilotes Inter'!CX54)","v":0},null,"Rondes effectuées",0]
[13,{"$f":"VLOOKUP(A55,'Numéro licences'!$H$4:$I$47,2)","v":"HINYOT Thierry"},"Aller-Retour","Km  renseignés",{"$f":"SUM('Pilotes Nat'!CL56)","v":3197},null,"Km  renseignés",{"$f":"SUM('Pilotes Inter'!CX55)","v":0},null,"Km  renseignés",3197]
[null,null,"Ronde","Km confirmés",{"$f":"SUM('Pilotes Nat'!CL57)","v":3197},null,"Km confirmés",{"$f":"SUM('Pilotes Inter'!CX56)","v":0},null,"Km confirmés",3197]
[null,null,null,"Rondes confirmées",{"$f":"SUM('Pilotes Nat'!CL58)","v":12},null,"Rondes confirmées",{"$f":"SUM('Pilotes Inter'!CX57)","v":0},null,"Rondes confirmées",12]
[null,null,null,"Rondes effectuées",{"$f":"SUM('Pilotes Nat'!CL59)","v":11},null,"Rondes effectuées",{"$f":"SUM('Pilotes Inter'!CX58)","v":0},null,"Rondes effectuées",11]
[14,{"$f":"VLOOKUP(A59,'Numéro licences'!$H$4:$I$47,2)","v":"JAMOTTE Jean"},"Aller-Retour","Km  renseignés",{"$f":"SUM('Pilotes Nat'!CL60)","v":15472},null,"Km  renseignés",{"$f":"SUM('Pilotes Inter'!CX59)","v":1156},null,"Km  renseignés",16628,null,null,null,null,{"$f":"SUM(P8:P53)","v":108429},{"$f":"SUM(Q8:Q53)","v":27716},{"$f":"SUM(P59:Q59)","v":136145},null,null,null,{"$f":"SUM(V8:V53)","v":123823},{"$f":"SUM(W8:W53)","v":31716},{"$f":"SUM(V59:W59)","v":155539}]
[null,null,"Ronde","Km confirmés",{"$f":"SUM('Pilotes Nat'!CL61)","v":15472},null,"Km confirmés",{"$f":"SUM('Pilotes Inter'!CX60)","v":1156},null,"Km confirmés",16628,null,null,null,null,{"$f":"SUM(P59/R59)","v":0.79642293143339826},{"$f":"SUM(Q59/R59)","v":0.20357706856660179},null,null,null,null,{"$f":"SUM(V59/X59)","v":0.79608972669234079},{"$f":"SUM(W59/X59)","v":0.20391027330765918}]
[null,null,null,"Rondes confirmées",{"$f":"SUM('Pilotes Nat'!CL62)","v":43},null,"Rondes confirmées",{"$f":"SUM('Pilotes Inter'!CX61)","v":1},null,"Rondes confirmées",44,null,null,null,null,"NAT","INT",null,null,null,null,"NAT","INT"]
[null,null,null,"Rondes effectuées",{"$f":"SUM('Pilotes Nat'!CL63)","v":41},null,"Rondes effectuées",{"$f":"SUM('Pilotes Inter'!CX62)","v":1},null,"Rondes effectuées",42]
[15,{"$f":"VLOOKUP(A63,'Numéro licences'!$H$4:$I$47,2)","v":"LAMBOTTE Didier"},"Aller-Retour","Km  renseignés",{"$f":"SUM('Pilotes Nat'!CL64)","v":0},null,"Km  renseignés",{"$f":"SUM('Pilotes Inter'!CX63)","v":0},null,"Km  renseignés",0]
[null,null,"Ronde","Km confirmés",{"$f":"SUM('Pilotes Nat'!CL65)","v":0},null,"Km confirmés",{"$f":"SUM('Pilotes Inter'!CX64)","v":0},null,"Km confirmés",0]
[null,null,null,"Rondes confirmées",{"$f":"SUM('Pilotes Nat'!CL66)","v":0},null,"Rondes confirmées",{"$f":"SUM('Pilotes Inter'!CX65)","v":0},null,"Rondes confirmées",0]
[null,null,null,"Rondes effectuées",{"$f":"SUM('Pilotes Nat'!CL67)","v":0},null,"Rondes effectuées",{"$f":"SUM('Pilotes Inter'!CX66)","v":0},null,"Rondes effectuées",0]
[16,{"$f":"VLOOKUP(A67,'Numéro licences'!$H$4:$I$47,2)","v":"LESCAL Thierry"},"Aller-Retour","Km  renseignés",{"$f":"SUM('Pilotes Nat'!CL68)","v":10370},null,"Km  renseignés",{"$f":"SUM('Pilotes Inter'!CX67)","v":0},null,"Km  renseignés",10370]
[null,null,"Ronde","Km confirmés",{"$f":"SUM('Pilotes Nat'!CL69)","v":10370},null,"Km confirmés",{"$f":"SUM('Pilotes Inter'!CX68)","v":0},null,"Km confirmés",10370]
[null,null,null,"Rondes confirmées",{"$f":"SUM('Pilotes Nat'!CL70)","v":34},null,"Rondes confirmées",{"$f":"SUM('Pilotes Inter'!CX69)","v":0},null,"Rondes confirmées",34]
[null,null,null,"Rondes effectuées",{"$f":"SUM('Pilotes Nat'!CL71)","v":32},null,"Rondes effectuées",{"$f":"SUM('Pilotes Inter'!CX70)","v":0},null,"Rondes effectuées",32]
[17,{"$f":"VLOOKUP(A71,'Numéro licences'!$H$4:$I$47,2)","v":"MALLIEN Philippe"},"Aller-Retour","Km  renseignés",{"$f":"SUM('Pilotes Nat'!CL72)","v":624},null,"Km  renseignés",{"$f":"SUM('Pilotes Inter'!CX71)","v":0},null,"Km  renseignés",624]
[null,null,"Ronde","Km confirmés",{"$f":"SUM('Pilotes Nat'!CL73)","v":360},null,"Km confirmés",{"$f":"SUM('Pilotes Inter'!CX72)","v":0},null,"Km confirmés",{"$f":"SUM(E72+H72)","v":360}]
[null,null,null,"Rondes confirmées",{"$f":"SUM('Pilotes Nat'!CL74)","v":2},null,"Rondes confirmées",{"$f":"SUM('Pilotes Inter'!CX73)","v":0},null,"Rondes confirmées",2]
[null,null,null,"Rondes effectuées",{"$f":"SUM('Pilotes Nat'!CL75)","v":1},null,"Rondes effectuées",{"$f":"SUM('Pilotes Inter'!CX74)","v":0},null,"Rondes effectuées",1]
[18,{"$f":"VLOOKUP(A75,'Numéro licences'!$H$4:$I$47,2)","v":"MANZANO Pascal"},"Aller-Retour","Km  renseignés",{"$f":"SUM('Pilotes Nat'!CL76)","v":8433},null,"Km  renseignés",{"$f":"SUM('Pilotes Inter'!CX75)","v":12303},null,"Km  renseignés",20736]
[null,null,"Ronde","Km confirmés",{"$f":"SUM('Pilotes Nat'!CL77)","v":8113},null,"Km confirmés",{"$f":"SUM('Pilotes Inter'!CX76)","v":12303},null,"Km confirmés",20416]
[null,null,null,"Rondes confirmées",{"$f":"SUM('Pilotes Nat'!CL78)","v":26},null,"Rondes confirmées",{"$f":"SUM('Pilotes Inter'!CX77)","v":8},null,"Rondes confirmées",34]
[null,null,null,"Rondes effectuées",{"$f":"SUM('Pilotes Nat'!CL79)","v":25},null,"Rondes effectuées",{"$f":"SUM('Pilotes Inter'!CX78)","v":8},null,"Rondes effectuées",33]
[19,{"$f":"VLOOKUP(A79,'Numéro licences'!$H$4:$I$47,2)","v":"MARIEL Didier"},"Aller-Retour","Km  renseignés",{"$f":"SUM('Pilotes Nat'!CL80)","v":1859},null,"Km  renseignés",{"$f":"SUM('Pilotes Inter'!CX79)","v":0},null,"Km  renseignés",1859]
[null,null,"Ronde","Km confirmés",{"$f":"SUM('Pilotes Nat'!CL81)","v":1859},null,"Km confirmés",{"$f":"SUM('Pilotes Inter'!CX80)","v":0},null,"Km confirmés",1859]
[null,null,null,"Rondes confirmées",{"$f":"SUM('Pilotes Nat'!CL82)","v":9},null,"Rondes confirmées",{"$f":"SUM('Pilotes Inter'!CX81)","v":0},null,"Rondes confirmées",9]
[null,null,null,"Rondes effectuées",{"$f":"SUM('Pilotes Nat'!CL83)","v":9},null,"Rondes effectuées",{"$f":"SUM('Pilotes Inter'!CX82)","v":0},null,"Rondes effectuées",9]
[20,{"$f":"VLOOKUP(A83,'Numéro licences'!$H$4:$I$47,2)","v":"MILET Benoit"},"Aller-Retour","Km  renseignés",{"$f":"SUM('Pilotes Nat'!CL84)","v":504},null,"Km  renseignés",{"$f":"SUM('Pilotes Inter'!CX83)","v":1056},null,"Km  renseignés",1560]
[null,null,"Ronde","Km confirmés",{"$f":"SUM('Pilotes Nat'!CL85)","v":504},null,"Km confirmés",{"$f":"SUM('Pilotes Inter'!CX84)","v":1056},null,"Km confirmés",1560]
[null,null,null,"Rondes confirmées",{"$f":"SUM('Pilotes Nat'!CL86)","v":3},null,"Rondes confirmées",{"$f":"SUM('Pilotes Inter'!CX85)","v":1},null,"Rondes confirmées",4]
[null,null,null,"Rondes effectuées",{"$f":"SUM('Pilotes Nat'!CL87)","v":1},null,"Rondes effectuées",{"$f":"SUM('Pilotes Inter'!CX86)","v":1},null,"Rondes effectuées",2]
[21,{"$f":"VLOOKUP(A87,'Numéro licences'!$H$4:$I$47,2)","v":"NIHOUL Dany"},"Aller-Retour","Km  renseignés",{"$f":"SUM('Pilotes Nat'!CL88)","v":6312},null,"Km  renseignés",{"$f":"SUM('Pilotes Inter'!CX87)","v":0},null,"Km  renseignés",6312]
[null,null,"Ronde","Km confirmés",{"$f":"SUM('Pilotes Nat'!CL89)","v":6312},null,"Km confirmés",{"$f":"SUM('Pilotes Inter'!CX88)","v":0},null,"Km confirmés",6312]
[null,null,null,"Rondes confirmées",{"$f":"SUM('Pilotes Nat'!CL90)","v":19},null,"Rondes confirmées",{"$f":"SUM('Pilotes Inter'!CX89)","v":0},null,"Rondes confirmées",19]
[null,null,null,"Rondes effectuées",{"$f":"SUM('Pilotes Nat'!CL91)","v":17},null,"Rondes effectuées",{"$f":"SUM('Pilotes Inter'!CX90)","v":0},null,"Rondes effectuées",17]
[22,{"$f":"VLOOKUP(A91,'Numéro licences'!$H$4:$I$47,2)","v":"PARMENTIER Dominique"},"Aller-Retour","Km  renseignés",{"$f":"SUM('Pilotes Nat'!CL92)","v":728},null,"Km  renseignés",{"$f":"SUM('Pilotes Inter'!CX91)","v":0},null,"Km  renseignés",728]
[null,null,"Ronde","Km confirmés",{"$f":"SUM('Pilotes Nat'!CL93)","v":728},null,"Km confirmés",{"$f":"SUM('Pilotes Inter'!CX92)","v":0},null,"Km confirmés",728]
[null,null,null,"Rondes confirmées",{"$f":"SUM('Pilotes Nat'!CL94)","v":5},null,"Rondes confirmées",{"$f":"SUM('Pilotes Inter'!CX93)","v":0},null,"Rondes confirmées",5]
[null,null,null,"Rondes effectuées",{"$f":"SUM('Pilotes Nat'!CL95)","v":3},null,"Rondes effectuées",{"$f":"SUM('Pilotes Inter'!CX94)","v":0},null,"Rondes effectuées",3]
[23,{"$f":"VLOOKUP(A95,'Numéro licences'!$H$4:$I$47,2)","v":"RAMEAU Didier"},"Aller-Retour","Km  renseignés",{"$f":"SUM('Pilotes Nat'!CL96)","v":3956},null,"Km  renseignés",{"$f":"SUM('Pilotes Inter'!CX95)","v":0},null,"Km  renseignés",3956]
[null,null,"Ronde","Km confirmés",{"$f":"SUM('Pilotes Nat'!CL97)","v":3956},null,"Km confirmés",{"$f":"SUM('Pilotes Inter'!CX96)","v":0},null,"Km confirmés",3956]
[null,null,null,"Rondes confirmées",{"$f":"SUM('Pilotes Nat'!CL98)","v":13},null,"Rondes confirmées",{"$f":"SUM('Pilotes Inter'!CX97)","v":0},null,"Rondes confirmées",13]
[null,null,null,"Rondes effectuées",{"$f":"SUM('Pilotes Nat'!CL99)","v":12},null,"Rondes effectuées",{"$f":"SUM('Pilotes Inter'!CX98)","v":0},null,"Rondes effectuées",12]
[24,{"$f":"VLOOKUP(A99,'Numéro licences'!$H$4:$I$47,2)","v":"SMEETS Carine"},"Aller-Retour","Km  renseignés",{"$f":"SUM('Pilotes Nat'!CL100)","v":160},null,"Km  renseignés",{"$f":"SUM('Pilotes Inter'!CX99)","v":0},null,"Km  renseignés",160]
[null,null,"Ronde","Km confirmés",{"$f":"SUM('Pilotes Nat'!CL101)","v":160},null,"Km confirmés",{"$f":"SUM('Pilotes Inter'!CX100)","v":0},null,"Km confirmés",160]
[null,null,null,"Rondes confirmées",{"$f":"SUM('Pilotes Nat'!CL102)","v":1},null,"Rondes confirmées",{"$f":"SUM('Pilotes Inter'!CX101)","v":0},null,"Rondes confirmées",1]
[null,null,null,"Rondes effectuées",{"$f":"SUM('Pilotes Nat'!CL103)","v":0},null,"Rondes effectuées",{"$f":"SUM('Pilotes Inter'!CX102)","v":0},null,"Rondes effectuées",0]
[25,{"$f":"VLOOKUP(A103,'Numéro licences'!$H$4:$I$47,2)","v":"STRYPSTEIN Nicolas"},"Aller-Retour","Km  renseignés",{"$f":"SUM('Pilotes Nat'!CL104)","v":200},null,"Km  renseignés",{"$f":"SUM('Pilotes Inter'!CX103)","v":2570},null,"Km  renseignés",2770]
[null,null,"Ronde","Km confirmés",{"$f":"SUM('Pilotes Nat'!CL105)","v":200},null,"Km confirmés",{"$f":"SUM('Pilotes Inter'!CX104)","v":2570},null,"Km confirmés",2770]
[null,null,null,"Rondes confirmées",{"$f":"SUM('Pilotes Nat'!CL106)","v":1},null,"Rondes confirmées",{"$f":"SUM('Pilotes Inter'!CX105)","v":1},null,"Rondes confirmées",2]
[null,null,null,"Rondes effectuées",{"$f":"SUM('Pilotes Nat'!CL107)","v":0},null,"Rondes effectuées",{"$f":"SUM('Pilotes Inter'!CX106)","v":1},null,"Rondes effectuées",1]
[26,{"$f":"VLOOKUP(A107,'Numéro licences'!$H$4:$I$47,2)","v":"URBAIN Philippe"},"Aller-Retour","Km  renseignés",{"$f":"SUM('Pilotes Nat'!CL108)","v":0},null,"Km  renseignés",{"$f":"SUM('Pilotes Inter'!CX107)","v":1194},null,"Km  renseignés",1194]
[null,null,"Ronde","Km confirmés",{"$f":"SUM('Pilotes Nat'!CL109)","v":0},null,"Km confirmés",{"$f":"SUM('Pilotes Inter'!CX108)","v":1194},null,"Km confirmés",1194]
[null,null,null,"Rondes confirmées",{"$f":"SUM('Pilotes Nat'!CL110)","v":0},null,"Rondes confirmées",{"$f":"SUM('Pilotes Inter'!CX109)","v":1},null,"Rondes confirmées",1]
[null,null,null,"Rondes effectuées",{"$f":"SUM('Pilotes Nat'!CL111)","v":0},null,"Rondes effectuées",{"$f":"SUM('Pilotes Inter'!CX110)","v":1},null,"Rondes effectuées",1]
[27,{"$f":"VLOOKUP(A111,'Numéro licences'!$H$4:$I$47,2)","v":"VANBELLINGEN Jean-Claude"},"Aller-Retour","Km  renseignés",{"$f":"SUM('Pilotes Nat'!CL112)","v":4150},null,"Km  renseignés",{"$f":"SUM('Pilotes Inter'!CX111)","v":2203},null,"Km  renseignés",6353]
[null,null,"Ronde","Km confirmés",{"$f":"SUM('Pilotes Nat'!CL113)","v":4150},null,"Km confirmés",{"$f":"SUM('Pilotes Inter'!CX112)","v":2203},null,"Km confirmés",6353]
[null,null,null,"Rondes confirmées",{"$f":"SUM('Pilotes Nat'!CL114)","v":10},null,"Rondes confirmées",{"$f":"SUM('Pilotes Inter'!CX113)","v":1},null,"Rondes confirmées",11]
[null,null,null,"Rondes effectuées",{"$f":"SUM('Pilotes Nat'!CL115)","v":9},null,"Rondes effectuées",{"$f":"SUM('Pilotes Inter'!CX114)","v":1},null,"Rondes effectuées",10]
[28,{"$f":"VLOOKUP(A115,'Numéro licences'!$H$4:$I$47,2)","v":"VAN DER BEETEN Pascal"},"Aller-Retour","Km  renseignés",{"$f":"SUM('Pilotes Nat'!CL116)","v":10166},null,"Km  renseignés",{"$f":"SUM('Pilotes Inter'!CX115)","v":0},null,"Km  renseignés",10166]
[null,null,"Ronde","Km confirmés",{"$f":"SUM('Pilotes Nat'!CL117)","v":10166},null,"Km confirmés",{"$f":"SUM('Pilotes Inter'!CX116)","v":0},null,"Km confirmés",10166]
[null,null,null,"Rondes confirmées",{"$f":"SUM('Pilotes Nat'!CL118)","v":33},null,"Rondes confirmées",{"$f":"SUM('Pilotes Inter'!CX117)","v":0},null,"Rondes confirmées",33]
[null,null,null,"Rondes effectuées",{"$f":"SUM('Pilotes Nat'!CL119)","v":32},null,"Rondes effectuées",{"$f":"SUM('Pilotes Inter'!CX118)","v":0},null,"Rondes effectuées",32]
[29,{"$f":"VLOOKUP(A119,'Numéro licences'!$H$4:$I$47,2)","v":"VANSTEYVOORT André"},"Aller-Retour","Km  renseignés",{"$f":"SUM('Pilotes Nat'!CL120)","v":5598},null,"Km  renseignés",{"$f":"SUM('Pilotes Inter'!CX119)","v":4000},null,"Km  renseignés",9598]
[null,null,"Ronde","Km confirmés",{"$f":"SUM('Pilotes Nat'!CL121)","v":200},null,"Km confirmés",{"$f":"SUM('Pilotes Inter'!CX120)","v":0},null,"Km confirmés",200]
[null,null,null,"Rondes confirmées",{"$f":"SUM('Pilotes Nat'!CL122)","v":1},null,"Rondes confirmées",{"$f":"SUM('Pilotes Inter'!CX121)","v":0},null,"Rondes confirmées",1]
[null,null,null,"Rondes effectuées",{"$f":"SUM('Pilotes Nat'!CL123)","v":16},null,"Rondes effectuées",{"$f":"SUM('Pilotes Inter'!CX122)","v":2},null,"Rondes effectuées",18]
[30,{"$f":"VLOOKUP(A123,'Numéro licences'!$H$4:$I$47,2)","v":"WOUTERS Olivier"},"Aller-Retour","Km  renseignés",{"$f":"SUM('Pilotes Nat'!CL124)","v":7563},null,"Km  renseignés",{"$f":"SUM('Pilotes Inter'!CX123)","v":0},null,"Km  renseignés",7563]
[null,null,"Ronde","Km confirmés",{"$f":"SUM('Pilotes Nat'!CL125)","v":7563},null,"Km confirmés",{"$f":"SUM('Pilotes Inter'!CX124)","v":0},null,"Km confirmés",7563]
[null,null,null,"Rondes confirmées",{"$f":"SUM('Pilotes Nat'!CL126)","v":22},null,"Rondes confirmées",{"$f":"SUM('Pilotes Inter'!CX125)","v":0},null,"Rondes confirmées",22]
[null,null,null,"Rondes effectuées",{"$f":"SUM('Pilotes Nat'!CL127)","v":21},null,"Rondes effectuées",{"$f":"SUM('Pilotes Inter'!CX126)","v":0},null,"Rondes effectuées",21]
[31,{"$f":"VLOOKUP(A127,'Numéro licences'!$H$4:$I$47,2)","v":"THIRIFAYS Vincent"},"Aller-Retour","Km  renseignés",{"$f":"SUM('Pilotes Nat'!CL128)","v":385},null,"Km  renseignés",{"$f":"SUM('Pilotes Inter'!CX127)","v":0},null,"Km  renseignés",385]
[null,null,"Ronde","Km confirmés",{"$f":"SUM('Pilotes Nat'!CL129)","v":0},null,"Km confirmés",{"$f":"SUM('Pilotes Inter'!CX128)","v":0},null,"Km confirmés",0]
[null,null,null,"Rondes confirmées",{"$f":"SUM('Pilotes Nat'!CL130)","v":0},null,"Rondes confirmées",{"$f":"SUM('Pilotes Inter'!CX129)","v":0},null,"Rondes confirmées",0]
[null,null,null,"Rondes effectuées",{"$f":"SUM('Pilotes Nat'!CL131)","v":1},null,"Rondes effectuées",{"$f":"SUM('Pilotes Inter'!CX130)","v":0},null,"Rondes effectuées",1]
[32,{"$f":"VLOOKUP(A131,'Numéro licences'!$H$4:$I$47,2)","v":"VANDY Rudi"},"Aller-Retour","Km  renseignés",{"$f":"SUM('Pilotes Nat'!CL132)","v":5164},null,"Km  renseignés",{"$f":"SUM('Pilotes Inter'!CX131)","v":0},null,"Km  renseignés",5164]
[null,null,"Ronde","Km confirmés",{"$f":"SUM('Pilotes Nat'!CL133)","v":5164},null,"Km confirmés",{"$f":"SUM('Pilotes Inter'!CX132)","v":0},null,"Km confirmés",5164]
[null,null,null,"Rondes confirmées",{"$f":"SUM('Pilotes Nat'!CL134)","v":16},null,"Rondes confirmées",{"$f":"SUM('Pilotes Inter'!CX133)","v":0},null,"Rondes confirmées",16]
[null,null,null,"Rondes effectuées",{"$f":"SUM('Pilotes Nat'!CL135)","v":16},null,"Rondes effectuées",{"$f":"SUM('Pilotes Inter'!CX134)","v":0},null,"Rondes effectuées",16]
[33,{"$f":"VLOOKUP(A135,'Numéro licences'!$H$4:$I$47,2)","v":"LEFRANT Sébastien"},"Aller-Retour","Km  renseignés",{"$f":"SUM('Pilotes Nat'!CL136)","v":1457},null,"Km  renseignés",{"$f":"SUM('Pilotes Inter'!CX135)","v":0},null,"Km  renseignés",1457]
[null,null,"Ronde","Km confirmés",{"$f":"SUM('Pilotes Nat'!CL137)","v":0},null,"Km confirmés",{"$f":"SUM('Pilotes Inter'!CX136)","v":0},null,"Km confirmés",{"$f":"SUM(E136+H136)","v":0}]
[null,null,null,"Rondes confirmées",{"$f":"SUM('Pilotes Nat'!CL138)","v":0},null,"Rondes confirmées",{"$f":"SUM('Pilotes Inter'!CX137)","v":0},null,"Rondes confirmées",0]
[null,null,null,"Rondes effectuées",{"$f":"SUM('Pilotes Nat'!CL139)","v":5},null,"Rondes effectuées",{"$f":"SUM('Pilotes Inter'!CX138)","v":0},null,"Rondes effectuées",5]
[34,{"$f":"VLOOKUP(A139,'Numéro licences'!$H$4:$I$47,2)","v":0},"Aller-Retour","Km  renseignés",{"$f":"SUM('Pilotes Nat'!CL140)","v":0},null,"Km  renseignés",{"$f":"SUM('Pilotes Inter'!CX139)","v":0},null,"Km  renseignés",0]
[null,null,"Ronde","Km confirmés",{"$f":"SUM('Pilotes Nat'!CL141)","v":0},null,"Km confirmés",{"$f":"SUM('Pilotes Inter'!CX140)","v":0},null,"Km confirmés",0]
[null,null,null,"Rondes confirmées",{"$f":"SUM('Pilotes Nat'!CL142)","v":0},null,"Rondes confirmées",{"$f":"SUM('Pilotes Inter'!CX141)","v":0},null,"Rondes confirmées",0]
[null,null,null,"Rondes effectuées",{"$f":"SUM('Pilotes Nat'!CL143)","v":0},null,"Rondes effectuées",{"$f":"SUM('Pilotes Inter'!CX142)","v":0},null,"Rondes effectuées",0]
[35,{"$f":"VLOOKUP(A143,'Numéro licences'!$H$4:$I$47,2)","v":0},"Aller-Retour","Km  renseignés",{"$f":"SUM('Pilotes Nat'!CL144)","v":0},null,"Km  renseignés",{"$f":"SUM('Pilotes Inter'!CX143)","v":0},null,"Km  renseignés",0]
[null,null,"Ronde","Km confirmés",{"$f":"SUM('Pilotes Nat'!CL145)","v":0},null,"Km confirmés",{"$f":"SUM('Pilotes Inter'!CX144)","v":0},null,"Km confirmés",0]
[null,null,null,"Rondes confirmées",{"$f":"SUM('Pilotes Nat'!CL146)","v":0},null,"Rondes confirmées",{"$f":"SUM('Pilotes Inter'!CX145)","v":0},null,"Rondes confirmées",0]
[null,null,null,"Rondes effectuées",{"$f":"SUM('Pilotes Nat'!CL147)","v":0},null,"Rondes effectuées",{"$f":"SUM('Pilotes Inter'!CX146)","v":0},null,"Rondes effectuées",0]
[36,{"$f":"VLOOKUP(A147,'Numéro licences'!$H$4:$I$47,2)","v":0},"Aller-Retour","Km  renseignés",{"$f":"SUM('Pilotes Nat'!CL148)","v":0},null,"Km  renseignés",{"$f":"SUM('Pilotes Inter'!CX147)","v":0},null,"Km  renseignés",0]
[null,null,"Ronde","Km confirmés",{"$f":"SUM('Pilotes Nat'!CL149)","v":0},null,"Km confirmés",{"$f":"SUM('Pilotes Inter'!CX148)","v":0},null,"Km confirmés",0]
[null,null,null,"Rondes confirmées",{"$f":"SUM('Pilotes Nat'!CL150)","v":0},null,"Rondes confirmées",{"$f":"SUM('Pilotes Inter'!CX149)","v":0},null,"Rondes confirmées",0]
[null,null,null,"Rondes effectuées",{"$f":"SUM('Pilotes Nat'!CL151)","v":0},null,"Rondes effectuées",{"$f":"SUM('Pilotes Inter'!CX150)","v":0},null,"Rondes effectuées",0]
[37,{"$f":"VLOOKUP(A151,'Numéro licences'!$H$4:$I$47,2)","v":0},"Aller-Retour","Km  renseignés",{"$f":"SUM('Pilotes Nat'!CL152)","v":0},null,"Km  renseignés",{"$f":"SUM('Pilotes Inter'!CX151)","v":0},null,"Km  renseignés",0]
[null,null,"Ronde","Km confirmés",{"$f":"SUM('Pilotes Nat'!CL153)","v":0},null,"Km confirmés",{"$f":"SUM('Pilotes Inter'!CX152)","v":0},null,"Km confirmés",0]
[null,null,null,"Rondes confirmées",{"$f":"SUM('Pilotes Nat'!CL154)","v":0},null,"Rondes confirmées",{"$f":"SUM('Pilotes Inter'!CX153)","v":0},null,"Rondes confirmées",0]
[null,null,null,"Rondes effectuées",{"$f":"SUM('Pilotes Nat'!CL155)","v":0},null,"Rondes effectuées",{"$f":"SUM('Pilotes Inter'!CX154)","v":0},null,"Rondes effectuées",0]
[38,{"$f":"VLOOKUP(A155,'Numéro licences'!$H$4:$I$47,2)","v":0},"Aller-Retour","Km  renseignés",{"$f":"SUM('Pilotes Nat'!CL156)","v":0},null,"Km  renseignés",{"$f":"SUM('Pilotes Inter'!CX155)","v":0},null,"Km  renseignés",0]
[null,null,"Ronde","Km confirmés",{"$f":"SUM('Pilotes Nat'!CL157)","v":0},null,"Km confirmés",{"$f":"SUM('Pilotes Inter'!CX156)","v":0},null,"Km confirmés",0]
[null,null,null,"Rondes confirmées",{"$f":"SUM('Pilotes Nat'!CL158)","v":0},null,"Rondes confirmées",{"$f":"SUM('Pilotes Inter'!CX157)","v":0},null,"Rondes confirmées",0]
[null,null,null,"Rondes effectuées",{"$f":"SUM('Pilotes Nat'!CL159)","v":0},null,"Rondes effectuées",{"$f":"SUM('Pilotes Inter'!CX158)","v":0},null,"Rondes effectuées",0]
[39,{"$f":"VLOOKUP(A159,'Numéro licences'!$H$4:$I$47,2)","v":0},"Aller-Retour","Km  renseignés",{"$f":"SUM('Pilotes Nat'!CL160)","v":0},null,"Km  renseignés",{"$f":"SUM('Pilotes Inter'!CX159)","v":0},null,"Km  renseignés",0]
[null,null,"Ronde","Km confirmés",{"$f":"SUM('Pilotes Nat'!CL161)","v":0},null,"Km confirmés",{"$f":"SUM('Pilotes Inter'!CX160)","v":0},null,"Km confirmés",0]
[null,null,null,"Rondes confirmées",{"$f":"SUM('Pilotes Nat'!CL162)","v":0},null,"Rondes confirmées",{"$f":"SUM('Pilotes Inter'!CX161)","v":0},null,"Rondes confirmées",0]
[null,null,null,"Rondes effectuées",{"$f":"SUM('Pilotes Nat'!CL163)","v":0},null,"Rondes effectuées",{"$f":"SUM('Pilotes Inter'!CX162)","v":0},null,"Rondes effectuées",0]
[40,{"$f":"VLOOKUP(A163,'Numéro licences'!$H$4:$I$47,2)","v":0},"Aller-Retour","Km  renseignés",{"$f":"SUM('Pilotes Nat'!CL164)","v":0},null,"Km  renseignés",{"$f":"SUM('Pilotes Inter'!CX163)","v":0},null,"Km  renseignés",0]
[null,null,"Ronde","Km confirmés",{"$f":"SUM('Pilotes Nat'!CL165)","v":0},null,"Km confirmés",{"$f":"SUM('Pilotes Inter'!CX164)","v":0},null,"Km confirmés",0]
[null,null,null,"Rondes confirmées",{"$f":"SUM('Pilotes Nat'!CL166)","v":0},null,"Rondes confirmées",{"$f":"SUM('Pilotes Inter'!CX165)","v":0},null,"Rondes confirmées",0]
[null,null,null,"Rondes effectuées",{"$f":"SUM('Pilotes Nat'!CL167)","v":0},null,"Rondes effectuées",{"$f":"SUM('Pilotes Inter'!CX166)","v":0},null,"Rondes effectuées",0]
[41,{"$f":"VLOOKUP(A167,'Numéro licences'!$H$4:$I$47,2)","v":0},"Aller-Retour","Km  renseignés",{"$f":"SUM('Pilotes Nat'!CL168)","v":0},null,"Km  renseignés",{"$f":"SUM('Pilotes Inter'!CX167)","v":0},null,"Km  renseignés",0]
[null,null,"Ronde","Km confirmés",{"$f":"SUM('Pilotes Nat'!CL169)","v":0},null,"Km confirmés",{"$f":"SUM('Pilotes Inter'!CX168)","v":0},null,"Km confirmés",0]
[null,null,null,"Rondes confirmées",{"$f":"SUM('Pilotes Nat'!CL170)","v":0},null,"Rondes confirmées",{"$f":"SUM('Pilotes Inter'!CX169)","v":0},null,"Rondes confirmées",0]
[null,null,null,"Rondes effectuées",{"$f":"SUM('Pilotes Nat'!CL171)","v":0},null,"Rondes effectuées",{"$f":"SUM('Pilotes Inter'!CX170)","v":0},null,"Rondes effectuées",0]
[42,{"$f":"VLOOKUP(A171,'Numéro licences'!$H$4:$I$47,2)","v":0},"Aller-Retour","Km  renseignés",{"$f":"SUM('Pilotes Nat'!CL172)","v":0},null,"Km  renseignés",{"$f":"SUM('Pilotes Inter'!CX171)","v":0},null,"Km  renseignés",0]
[null,null,"Ronde","Km confirmés",{"$f":"SUM('Pilotes Nat'!CL173)","v":0},null,"Km confirmés",{"$f":"SUM('Pilotes Inter'!CX172)","v":0},null,"Km confirmés",0]
[null,null,null,"Rondes confirmées",{"$f":"SUM('Pilotes Nat'!CL174)","v":0},null,"Rondes confirmées",{"$f":"SUM('Pilotes Inter'!CX173)","v":0},null,"Rondes confirmées",0]
[null,null,null,"Rondes effectuées",{"$f":"SUM('Pilotes Nat'!CL175)","v":0},null,"Rondes effectuées",{"$f":"SUM('Pilotes Inter'!CX174)","v":0},null,"Rondes effectuées",0]
[43,{"$f":"VLOOKUP(A175,'Numéro licences'!$H$4:$I$47,2)","v":0},"Aller-Retour","Km  renseignés",{"$f":"SUM('Pilotes Nat'!CL176)","v":0},null,"Km  renseignés",{"$f":"SUM('Pilotes Inter'!CX175)","v":0},null,"Km  renseignés",0]
[null,null,"Ronde","Km confirmés",{"$f":"SUM('Pilotes Nat'!CL177)","v":0},null,"Km confirmés",{"$f":"SUM('Pilotes Inter'!CX176)","v":0},null,"Km confirmés",0]
[null,null,null,"Rondes confirmées",{"$f":"SUM('Pilotes Nat'!CL178)","v":0},null,"Rondes confirmées",{"$f":"SUM('Pilotes Inter'!CX177)","v":0},null,"Rondes confirmées",0]
[null,null,null,"Rondes effectuées",{"$f":"SUM('Pilotes Nat'!CL179)","v":0},null,"Rondes effectuées",{"$f":"SUM('Pilotes Inter'!CX178)","v":0},null,"Rondes effectuées",0]
[44,{"$f":"VLOOKUP(A179,'Numéro licences'!$H$4:$I$47,2)","v":0},"Aller-Retour","Km  renseignés",{"$f":"SUM('Pilotes Nat'!CL180)","v":0},null,"Km  renseignés",{"$f":"SUM('Pilotes Inter'!CX179)","v":0},null,"Km  renseignés",0]
[null,null,"Ronde","Km confirmés",{"$f":"SUM('Pilotes Nat'!CL181)","v":0},null,"Km confirmés",{"$f":"SUM('Pilotes Inter'!CX180)","v":0},null,"Km confirmés",0]
[null,null,null,"Rondes confirmées",{"$f":"SUM('Pilotes Nat'!CL182)","v":0},null,"Rondes confirmées",{"$f":"SUM('Pilotes Inter'!CX181)","v":0},null,"Rondes confirmées",0]
[null,null,null,"Rondes effectuées",{"$f":"SUM('Pilotes Nat'!CL183)","v":0},null,"Rondes effectuées",{"$f":"SUM('Pilotes Inter'!CX182)","v":0},null,"Rondes effectuées",0]
[45,{"$f":"VLOOKUP(A183,'Numéro licences'!$H$4:$I$47,2)","v":0},"Aller-Retour","Km  renseignés",{"$f":"SUM('Pilotes Nat'!CL184)","v":0},null,"Km  renseignés",{"$f":"SUM('Pilotes Inter'!CX183)","v":0},null,"Km  renseignés",0]
[null,null,"Ronde","Km confirmés",{"$f":"SUM('Pilotes Nat'!CL185)","v":0},null,"Km confirmés",{"$f":"SUM('Pilotes Inter'!CX184)","v":0},null,"Km confirmés",0]
[null,null,null,"Rondes confirmées",{"$f":"SUM('Pilotes Nat'!CL186)","v":0},null,"Rondes confirmées",{"$f":"SUM('Pilotes Inter'!CX185)","v":0},null,"Rondes confirmées",0]
[null,null,null,"Rondes effectuées",{"$f":"SUM('Pilotes Nat'!CL187)","v":0},null,"Rondes effectuées",{"$f":"SUM('Pilotes Inter'!CX186)","v":0},null,"Rondes effectuées",0]
[46,{"$f":"VLOOKUP(A187,'Numéro licences'!$H$4:$I$47,2)","v":0},"Aller-Retour","Km  renseignés",{"$f":"SUM('Pilotes Nat'!CL188)","v":0},null,"Km  renseignés",{"$f":"SUM('Pilotes Inter'!CX187)","v":0},null,"Km  renseignés",0]
[null,null,"Ronde","Km confirmés",{"$f":"SUM('Pilotes Nat'!CL189)","v":0},null,"Km confirmés",{"$f":"SUM('Pilotes Inter'!CX188)","v":0},null,"Km confirmés",0]
[null,null,null,"Rondes confirmées",{"$f":"SUM('Pilotes Nat'!CL190)","v":0},null,"Rondes confirmées",{"$f":"SUM('Pilotes Inter'!CX189)","v":0},null,"Rondes confirmées",0]
[null,null,null,"Rondes effectuées",{"$f":"SUM('Pilotes Nat'!CL191)","v":0},null,"Rondes effectuées",{"$f":"SUM('Pilotes Inter'!CX190)","v":0},null,"Rondes effectuées",0]
[]
[]
[null,null,null,"Rondes confirmées",{"$f":"SUM(E9+E13+E17+E21+E25+E29+E33+E37+E41+E45+E49+E53+E57+E61+E65+E69+E73+E77+E81+E85+E89+E93+E97+E101+E105+E109+E113+E117+E121+E125+E129+E133+E137+E141+E145+E149+E153+E157+E161+E165+E169+E173+E177+E181+E185+E189)","v":343},null,"Rondes confirmées",{"$f":"SUM(H9+H13+H17+H21+H25+H29+H33+H37+H41+H45+H49+H53+H57+H61+H65+H69+H73+H77+H81+H85+H89+H93+H97+H101+H105+H109+H113+H117+H121+H125+H129+H133+H137+H141+H145+H149+H153+H157+H161+H165+H169+H173+H177+H181+H185+H189)","v":19},null,"Rondes confirmées",{"$f":"SUM(K9+K13+K17+K21+K25+K29+K33+K37+K41+K45+K49+K53+K57+K61+K65+K69+K73+K77+K81+K85+K89+K93+K97+K101+K105+K109+K113+K117+K121+K125+K129+K133+K137+K141+K145+K149+K153+K157+K161+K165+K169+K173+K177+K181+K185+K189)","v":362}]
[null,null,null,"Rondes effectuées",{"$f":"SUM(E10+E14+E18+E22+E26+E30+E34+E38+E42+E46+E50+E54+E58+E62+E66+E70+E74+E78+E82+E86+E90+E94+E98+E102+E106+E110+E114+E118+E122+E126+E130+E134+E138+E142+E146+E150+E154+E158+E162+E166+E170+E174+E178+E182+E186+E190)","v":358},null,"Rondes effectuées",{"$f":"SUM(H10+H14+H18+H22+H26+H30+H34+H38+H42+H46+H50+H54+H58+H62+H66+H70+H74+H78+H82+H86+H90+H94+H98+H102+H106+H110+H114+H118+H122+H126+H130+H134+H138+H142+H146+H150+H154+H158+H162+H166+H170+H174+H178+H182+H186+H190)","v":21},null,"Rondes effectuées",{"$f":"SUM(K10+K14+K18+K22+K26+K30+K34+K38+K42+K46+K50+K54+K58+K62+K66+K70+K74+K78+K82+K86+K90+K94+K98+K102+K106+K110+K114+K118+K122+K126+K130+K134+K138+K142+K146+K150+K154+K158+K162+K166+K170+K174+K178+K182+K186+K190)","v":379}]
[]
[]
[]
[]
[]
[null,"Colonne1"]
[1,"BALLION Pierre"]
[{"$f":"SUM(A201+1)","v":2},"BERDOYES Yannick"]
[3,"CLAISSE Jean-Luc"]
[4,"DAVIN Philippe"]
[5,"DE BONDT Philippe"]
[6,"DE SCHEPPERS Jean-Claude"]
[7,"DECELLE Hubert"]
[8,"DEHAUT Didier"]
[9,"DELFORGE Patrice"]
[10,"DONY Marc"]
[11,"FAVRESSSE René"]
[12,"FONTAINE Guy"]
[13,"GOOSSENS Joël"]
[14,"LAMBOTTE Didier"]
[15,"LEFEVRE Didier"]
[16,"LEROY Michel"]
[17,"LONDOT Philippe"]
[18,"MALLIEN Philippe"]
[19,"MILET Benoit"]
[20,"MOTTE Albert"]
[21,"NIHOUL Dany"]
[22,"PARMENTIER Dominique"]
[23,"POMPIER Philippe"]
[24,"QUETS Serge"]
[25,"RICHARD Didier"]
[26,"SERGI Gérard"]
[27,"SMETS Rudy"]
[28,"STRYPSTEIN Nicolas"]
[29,"VAN DEN ABBEEL Christian"]
[30,"VANBELLINGEN Jean-Claude"]
[31,"VANDERVELDEN Robert"]
[32]
[33]
[34]
[35]
[36]
[37]
[38]
[39]
[40]
[41]
[42]
[43]
[44]
[45]
[46]

{"sheet":"Résumé Passagers","index":3,"n_rows":178,"n_cols":24,"rows_kept":178,"cut":false,"hidden":false,"merged":[[106,1,109,1],[110,1,113,1],[114,1,117,1],[118,1,121,1],[86,1,89,1],[90,1,93,1],[94,1,97,1],[98,1,101,1],[102,1,105,1],[66,1,69,1],[70,1,73,1],[74,1,77,1],[78,1,81,1],[82,1,85,1],[46,1,49,1],[50,1,53,1],[54,1,57,1],[58,1,61,1],[62,1,65,1],[26,1,29,1],[30,1,33,1],[34,1,37,1],[38,1,41,1],[42,1,45,1],[6,1,9,1],[10,1,13,1],[14,1,17,1],[18,1,21,1],[22,1,25,1],[0,3,0,10],[2,20,3,23],[2,14,3,17],[4,3,4,4],[4,6,4,7],[4,9,4,10]]}
[null,null,null,"PASSAGERS"]
[]
[null,null,null,null,null,null,null,null,null,null,null,null,null,null,"Confirmé",null,null,null,null,null,"Non-confirmé"]
[null,"Aller-Retour"]
[null,"Ronde",null,"NATIONAL",null,null,"INTERNATIONAL",null,null,"SCRATCH",null,null,null,null,"Passager","National","International","Total",null,null,"Passager","National","International","Total"]
[null,null,null,null,"TOTAL",null,null,"TOTAL",null,null,"TOTAL",null,null,1,{"$f":"VLOOKUP(N6,'Numéro licences'!$A$4:$B$32,2)","v":"BRIATTE Joëlle"},{"$f":"SUM(E8)","v":0},{"$f":"SUM(H8)","v":0},{"$f":"SUM(P6:Q6)","v":0},null,1,{"$f":"VLOOKUP(T6,'Numéro licences'!$A$4:$B$32,2)","v":"BRIATTE Joëlle"},{"$f":"SUM(E7)","v":0},{"$f":"SUM(H7)","v":0},{"$f":"SUM(V6:W6)","v":0}]
[1,{"$f":"VLOOKUP(A7,'Numéro licences'!$A$4:$B$32,2)","v":"BRIATTE Joëlle"},"Aller-Retour","Km  renseignés",{"$f":"SUM('Passagers Nat'!CL8)","v":0},null,"Km  renseignés",{"$f":"SUM('Passagers Inter'!CX7)","v":0},null,"Km  renseignés",{"$f":"SUM(E7+H7)","v":0},null,null,2,{"$f":"VLOOKUP(N7,'Numéro licences'!$A$4:$B$32,2)","v":"DEFAUX Michèle"},{"$f":"SUM(E12)","v":884},{"$f":"SUM(H12)","v":0},{"$f":"SUM(P7:Q7)","v":884},null,2,{"$f":"VLOOKUP(T7,'Numéro licences'!$A$4:$B$32,2)","v":"DEFAUX Michèle"},{"$f":"SUM(E11)","v":884},{"$f":"SUM(H11)","v":0},884]
[null,null,"Ronde","Km confirmés",{"$f":"SUM('Passagers Nat'!CL9)","v":0},null,"Km confirmés",{"$f":"SUM('Passagers Inter'!CX8)","v":0},null,"Km confirmés",{"$f":"SUM(E8+H8)","v":0},null,null,3,{"$f":"VLOOKUP(N8,'Numéro licences'!$A$4:$B$32,2)","v":"DEL FABBRO Laurence"},{"$f":"SUM(E16)","v":200},{"$f":"SUM(H16)","v":1342},1542,null,3,{"$f":"VLOOKUP(T8,'Numéro licences'!$A$4:$B$32,2)","v":"DEL FABBRO Laurence"},{"$f":"SUM(E15)","v":200},{"$f":"SUM(H15)","v":1342},1542]
[null,null,null,"Rondes confirmées",{"$f":"SUM('Passagers Nat'!CL10)","v":0},null,"Rondes confirmées",{"$f":"SUM('Passagers Inter'!CX9)","v":0},null,"Rondes confirmées",0,null,null,4,{"$f":"VLOOKUP(N9,'Numéro licences'!$A$4:$B$32,2)","v":"FIEVET Nathalie"},{"$f":"SUM(E20)","v":0},{"$f":"SUM(H20)","v":0},0,null,4,{"$f":"VLOOKUP(T9,'Numéro licences'!$A$4:$B$32,2)","v":"FIEVET Nathalie"},{"$f":"SUM(E19)","v":0},{"$f":"SUM(H19)","v":0},0]
[null,null,null,"Rondes effectuées",{"$f":"SUM('Passagers Nat'!CL11)","v":0},null,"Rondes effectuées",{"$f":"SUM('Passagers Inter'!CX10)","v":0},null,"Rondes effectuées",0,null,null,5,{"$f":"VLOOKUP(N10,'Numéro licences'!$A$4:$B$32,2)","v":"GOFFIN Guillaume"},{"$f":"SUM(E24)","v":0},{"$f":"SUM(H24)","v":0},0,null,5,{"$f":"VLOOKUP(T10,'Numéro licences'!$A$4:$B$32,2)","v":"GOFFIN Guillaume"},{"$f":"SUM(E23)","v":0},{"$f":"SUM(H23)","v":0},0]
[2,{"$f":"VLOOKUP(A11,'Numéro licences'!$A$4:$B$32,2)","v":"DEFAUX Michèle"},"Aller-Retour","Km  renseignés",{"$f":"SUM('Passagers Nat'!CL12)","v":884},null,"Km  renseignés",{"$f":"SUM('Passagers Inter'!CX11)","v":0},null,"Km  renseignés",884,null,null,6,{"$f":"VLOOKUP(N11,'Numéro licences'!$A$4:$B$32,2)","v":"GOUGEUL Sophie"},{"$f":"SUM(E28)","v":7483},{"$f":"SUM(H28)","v":12303},19786,null,6,{"$f":"VLOOKUP(T11,'Numéro licences'!$A$4:$B$32,2)","v":"GOUGEUL Sophie"},{"$f":"SUM(E27)","v":7483},{"$f":"SUM(H27)","v":12303},19786]
[null,null,"Ronde","Km confirmés",{"$f":"SUM('Passagers Nat'!CL13)","v":884},null,"Km confirmés",{"$f":"SUM('Passagers Inter'!CX12)","v":0},null,"Km confirmés",884,null,null,7,{"$f":"VLOOKUP(N12,'Numéro licences'!$A$4:$B$32,2)","v":"GREGORICS Kathy"},{"$f":"SUM(E32)","v":0},{"$f":"SUM(H32)","v":0},0,null,7,{"$f":"VLOOKUP(T12,'Numéro licences'!$A$4:$B$32,2)","v":"GREGORICS Kathy"},{"$f":"SUM(E31)","v":360},{"$f":"SUM(H31)","v":0},360]
[null,null,null,"Rondes confirmées",{"$f":"SUM('Passagers Nat'!CL14)","v":4},null,"Rondes confirmées",{"$f":"SUM('Passagers Inter'!CX13)","v":0},null,"Rondes confirmées",4,null,null,8,{"$f":"VLOOKUP(N13,'Numéro licences'!$A$4:$B$32,2)","v":"LAMBILLON Anne"},{"$f":"SUM(E36)","v":360},{"$f":"SUM(H36)","v":0},360,null,8,{"$f":"VLOOKUP(T13,'Numéro licences'!$A$4:$B$32,2)","v":"LAMBILLON Anne"},{"$f":"SUM(E35)","v":360},{"$f":"SUM(H35)","v":0},360]
[null,null,null,"Rondes effectuées",{"$f":"SUM('Passagers Nat'!CL15)","v":4},null,"Rondes effectuées",{"$f":"SUM('Passagers Inter'!CX14)","v":0},null,"Rondes effectuées",4,null,null,9,{"$f":"VLOOKUP(N14,'Numéro licences'!$A$4:$B$32,2)","v":"LAMIROY Anne"},{"$f":"SUM(E40)","v":0},{"$f":"SUM(H40)","v":1056},1056,null,9,{"$f":"VLOOKUP(T14,'Numéro licences'!$A$4:$B$32,2)","v":"LAMIROY Anne"},{"$f":"SUM(E39)","v":0},{"$f":"SUM(H39)","v":1056},1056]
[3,{"$f":"VLOOKUP(A15,'Numéro licences'!$A$4:$B$32,2)","v":"DEL FABBRO Laurence"},"Aller-Retour","Km  renseignés",{"$f":"SUM('Passagers Nat'!CL16)","v":200},null,"Km  renseignés",{"$f":"SUM('Passagers Inter'!CX15)","v":1342},null,"Km  renseignés",1542,null,null,10,{"$f":"VLOOKUP(N15,'Numéro licences'!$A$4:$B$32,2)","v":"LEROY Laure"},{"$f":"SUM(E44)","v":3321},{"$f":"SUM(H44)","v":2203},5524,null,10,{"$f":"VLOOKUP(T15,'Numéro licences'!$A$4:$B$32,2)","v":"LEROY Laure"},{"$f":"SUM(E43)","v":3321},{"$f":"SUM(H43)","v":2203},5524]
[null,null,"Ronde","Km confirmés",{"$f":"SUM('Passagers Nat'!CL17)","v":200},null,"Km confirmés",{"$f":"SUM('Passagers Inter'!CX16)","v":1342},null,"Km confirmés",1542,null,null,11,{"$f":"VLOOKUP(N16,'Numéro licences'!$A$4:$B$32,2)","v":"MALLIEN Emelyne"},{"$f":"SUM(E48)","v":0},{"$f":"SUM(H48)","v":0},0,null,11,{"$f":"VLOOKUP(T16,'Numéro licences'!$A$4:$B$32,2)","v":"MALLIEN Emelyne"},{"$f":"SUM(E47)","v":0},{"$f":"SUM(H47)","v":0},0]
[null,null,null,"Rondes confirmées",{"$f":"SUM('Passagers Nat'!CL18)","v":1},null,"Rondes confirmées",{"$f":"SUM('Passagers Inter'!CX17)","v":1},null,"Rondes confirmées",2,null,null,12,{"$f":"VLOOKUP(N17,'Numéro licences'!$A$4:$B$32,2)","v":"PIERARD Anne-Sophie"},{"$f":"SUM(E52)","v":0},{"$f":"SUM(H52)","v":0},0,null,12,{"$f":"VLOOKUP(T17,'Numéro licences'!$A$4:$B$32,2)","v":"PIERARD Anne-Sophie"},{"$f":"SUM(E51)","v":0},{"$f":"SUM(H51)","v":0},0]
[null,null,null,"Rondes effectuées",{"$f":"SUM('Passagers Nat'!CL19)","v":0},null,"Rondes effectuées",{"$f":"SUM('Passagers Inter'!CX18)","v":1},null,"Rondes effectuées",1,null,null,13,{"$f":"VLOOKUP(N18,'Numéro licences'!$A$4:$B$32,2)","v":"PONT Patricia"},{"$f":"SUM(E56)","v":10021},{"$f":"SUM(H56)","v":0},10021,null,13,{"$f":"VLOOKUP(T18,'Numéro licences'!$A$4:$B$32,2)","v":"PONT Patricia"},{"$f":"SUM(E55)","v":10021},{"$f":"SUM(H55)","v":0},10021]
[4,{"$f":"VLOOKUP(A19,'Numéro licences'!$A$4:$B$32,2)","v":"FIEVET Nathalie"},"Aller-Retour","Km  renseignés",{"$f":"SUM('Passagers Nat'!CL20)","v":0},null,"Km  renseignés",{"$f":"SUM('Passagers Inter'!CX19)","v":0},null,"Km  renseignés",0,null,null,14,{"$f":"VLOOKUP(N19,'Numéro licences'!$A$4:$B$32,2)","v":"MISEUR Carine"},{"$f":"SUM(E60)","v":5164},{"$f":"SUM(H60)","v":0},5164,null,14,{"$f":"VLOOKUP(T19,'Numéro licences'!$A$4:$B$32,2)","v":"MISEUR Carine"},{"$f":"SUM(E59)","v":5164},{"$f":"SUM(H59)","v":0},5164]
[null,null,"Ronde","Km confirmés",{"$f":"SUM('Passagers Nat'!CL21)","v":0},null,"Km confirmés",{"$f":"SUM('Passagers Inter'!CX20)","v":0},null,"Km confirmés",0,null,null,15,{"$f":"VLOOKUP(N20,'Numéro licences'!$A$4:$B$32,2)","v":"ARENZANA Jennifer"},{"$f":"SUM(E64)","v":0},{"$f":"SUM(H64)","v":0},0,null,15,{"$f":"VLOOKUP(T20,'Numéro licences'!$A$4:$B$32,2)","v":"ARENZANA Jennifer"},{"$f":"SUM(E78)","v":0},{"$f":"SUM(H78)","v":0},0]
[null,null,null,"Rondes confirmées",{"$f":"SUM('Passagers Nat'!CL22)","v":0},null,"Rondes confirmées",{"$f":"SUM('Passagers Inter'!CX21)","v":0},null,"Rondes confirmées",0,null,null,16,{"$f":"VLOOKUP(N21,'Numéro licences'!$A$4:$B$32,2)","v":0},{"$f":"SUM(E68)","v":0},{"$f":"SUM(H68)","v":0},0,null,16,{"$f":"VLOOKUP(T21,'Numéro licences'!$A$4:$B$32,2)","v":0},{"$f":"SUM(E64)","v":0},{"$f":"SUM(H64)","v":0},0]
[null,null,null,"Rondes effectuées",{"$f":"SUM('Passagers Nat'!CL23)","v":0},null,"Rondes effectuées",{"$f":"SUM('Passagers Inter'!CX22)","v":0},null,"Rondes effectuées",0,null,null,17,{"$f":"VLOOKUP(N22,'Numéro licences'!$A$4:$B$32,2)","v":0},{"$f":"SUM(E72)","v":0},{"$f":"SUM(H72)","v":0},0,null,17,{"$f":"VLOOKUP(T22,'Numéro licences'!$A$4:$B$32,2)","v":0},{"$f":"SUM(E68)","v":0},{"$f":"SUM(H68)","v":0},0]
[5,{"$f":"VLOOKUP(A23,'Numéro licences'!$A$4:$B$32,2)","v":"GOFFIN Guillaume"},"Aller-Retour","Km  renseignés",{"$f":"SUM('Passagers Nat'!CL24)","v":0},null,"Km  renseignés",{"$f":"SUM('Passagers Inter'!CX23)","v":0},null,"Km  renseignés",0,null,null,18,{"$f":"VLOOKUP(N23,'Numéro licences'!$A$4:$B$32,2)","v":0},{"$f":"SUM(E76)","v":0},{"$f":"SUM(H76)","v":0},0,null,18,{"$f":"VLOOKUP(T23,'Numéro licences'!$A$4:$B$32,2)","v":0},{"$f":"SUM(E72)","v":0},{"$f":"SUM(H72)","v":0},0]
[null,null,"Ronde","Km confirmés",{"$f":"SUM('Passagers Nat'!CL25)","v":0},null,"Km confirmés",{"$f":"SUM('Passagers Inter'!CX24)","v":0},null,"Km confirmés",0,null,null,19,{"$f":"VLOOKUP(N24,'Numéro licences'!$A$4:$B$32,2)","v":0},{"$f":"SUM(E80)","v":0},{"$f":"SUM(H80)","v":0},0,null,19,{"$f":"VLOOKUP(T24,'Numéro licences'!$A$4:$B$32,2)","v":0},{"$f":"SUM(E76)","v":0},{"$f":"SUM(H76)","v":0},0]
[null,null,null,"Rondes confirmées",{"$f":"SUM('Passagers Nat'!CL26)","v":0},null,"Rondes confirmées",{"$f":"SUM('Passagers Inter'!CX25)","v":0},null,"Rondes confirmées",0,null,null,20,{"$f":"VLOOKUP(N25,'Numéro licences'!$A$4:$B$32,2)","v":0},{"$f":"SUM(E84)","v":0},{"$f":"SUM(H84)","v":0},0,null,20,{"$f":"VLOOKUP(T25,'Numéro licences'!$A$4:$B$32,2)","v":0},{"$f":"SUM(E80)","v":0},{"$f":"SUM(H80)","v":0},0]
[null,null,null,"Rondes effectuées",{"$f":"SUM('Passagers Nat'!CL27)","v":0},null,"Rondes effectuées",{"$f":"SUM('Passagers Inter'!CX26)","v":0},null,"Rondes effectuées",0,null,null,21,{"$f":"VLOOKUP(N26,'Numéro licences'!$A$4:$B$32,2)","v":0},{"$f":"SUM(E88)","v":0},{"$f":"SUM(H88)","v":0},0,null,21,{"$f":"VLOOKUP(T26,'Numéro licences'!$A$4:$B$32,2)","v":0},{"$f":"SUM(E87)","v":0},{"$f":"SUM(H87)","v":0},0]
[6,{"$f":"VLOOKUP(A27,'Numéro licences'!$A$4:$B$32,2)","v":"GOUGEUL Sophie"},"Aller-Retour","Km  renseignés",{"$f":"SUM('Passagers Nat'!CL28)","v":7483},null,"Km  renseignés",{"$f":"SUM('Passagers Inter'!CX27)","v":12303},null,"Km  renseignés",19786,null,null,22,{"$f":"VLOOKUP(N27,'Numéro licences'!$A$4:$B$32,2)","v":0},{"$f":"SUM(E92)","v":0},{"$f":"SUM(H92)","v":0},0,null,22,{"$f":"VLOOKUP(T27,'Numéro licences'!$A$4:$B$32,2)","v":0},{"$f":"SUM(E91)","v":0},{"$f":"SUM(H91)","v":0},0]
[null,null,"Ronde","Km confirmés",{"$f":"SUM('Passagers Nat'!CL29)","v":7483},null,"Km confirmés",{"$f":"SUM('Passagers Inter'!CX28)","v":12303},null,"Km confirmés",19786,null,null,23,{"$f":"VLOOKUP(N28,'Numéro licences'!$A$4:$B$32,2)","v":0},{"$f":"SUM(E96)","v":0},{"$f":"SUM(H96)","v":0},0,null,23,{"$f":"VLOOKUP(T28,'Numéro licences'!$A$4:$B$32,2)","v":0},{"$f":"SUM(E95)","v":0},{"$f":"SUM(H95)","v":0},0]
[null,null,null,"Rondes confirmées",{"$f":"SUM('Passagers Nat'!CL30)","v":24},null,"Rondes confirmées",{"$f":"SUM('Passagers Inter'!CX29)","v":8},null,"Rondes confirmées",32,null,null,24,{"$f":"VLOOKUP(N29,'Numéro licences'!$A$4:$B$32,2)","v":0},{"$f":"SUM(E100)","v":0},{"$f":"SUM(H100)","v":0},0,null,24,{"$f":"VLOOKUP(T29,'Numéro licences'!$A$4:$B$32,2)","v":0},{"$f":"SUM(E99)","v":0},{"$f":"SUM(H99)","v":0},0]
[null,null,null,"Rondes effectuées",{"$f":"SUM('Passagers Nat'!CL31)","v":22},null,"Rondes effectuées",{"$f":"SUM('Passagers Inter'!CX30)","v":8},null,"Rondes effectuées",30,null,null,25,{"$f":"VLOOKUP(N30,'Numéro licences'!$A$4:$B$32,2)","v":0},{"$f":"SUM(E104)","v":0},{"$f":"SUM(H104)","v":0},0,null,25,{"$f":"VLOOKUP(T30,'Numéro licences'!$A$4:$B$32,2)","v":0},{"$f":"SUM(E103)","v":0},{"$f":"SUM(H103)","v":0},0]
[7,{"$f":"VLOOKUP(A31,'Numéro licences'!$A$4:$B$32,2)","v":"GREGORICS Kathy"},"Aller-Retour","Km  renseignés",{"$f":"SUM('Passagers Nat'!CL32)","v":360},null,"Km  renseignés",{"$f":"SUM('Passagers Inter'!CX31)","v":0},null,"Km  renseignés",360,null,null,26,{"$f":"VLOOKUP(N31,'Numéro licences'!$A$4:$B$32,2)","v":0},{"$f":"SUM(E108)","v":0},{"$f":"SUM(H108)","v":0},0,null,26,{"$f":"VLOOKUP(T31,'Numéro licences'!$A$4:$B$32,2)","v":0},{"$f":"SUM(E107)","v":0},{"$f":"SUM(H107)","v":0},0]
[null,null,"Ronde","Km confirmés",{"$f":"SUM('Passagers Nat'!CL33)","v":0},null,"Km confirmés",{"$f":"SUM('Passagers Inter'!CX32)","v":0},null,"Km confirmés",0,null,null,27,{"$f":"VLOOKUP(N32,'Numéro licences'!$A$4:$B$32,2)","v":0},{"$f":"SUM(E112)","v":0},{"$f":"SUM(H112)","v":0},0,null,27,{"$f":"VLOOKUP(T32,'Numéro licences'!$A$4:$B$32,2)","v":0},{"$f":"SUM(E111)","v":0},{"$f":"SUM(H111)","v":0},0]
[null,null,null,"Rondes confirmées",{"$f":"SUM('Passagers Nat'!CL34)","v":0},null,"Rondes confirmées",{"$f":"SUM('Passagers Inter'!CX33)","v":0},null,"Rondes confirmées",0,null,null,28,{"$f":"VLOOKUP(N33,'Numéro licences'!$A$4:$B$32,2)","v":0},{"$f":"SUM(E116)","v":0},{"$f":"SUM(H116)","v":0},0,null,28,{"$f":"VLOOKUP(T33,'Numéro licences'!$A$4:$B$32,2)","v":0},{"$f":"SUM(E115)","v":0},{"$f":"SUM(H115)","v":0},0]
[null,null,null,"Rondes effectuées",{"$f":"SUM('Passagers Nat'!CL35)","v":0},null,"Rondes effectuées",{"$f":"SUM('Passagers Inter'!CX34)","v":0},null,"Rondes effectuées",0,null,null,29,{"$f":"VLOOKUP(N34,'Numéro licences'!$A$4:$B$32,2)","v":0},{"$f":"SUM(E120)","v":0},{"$f":"SUM(H120)","v":0},0,null,29,{"$f":"VLOOKUP(T34,'Numéro licences'!$A$4:$B$32,2)","v":0},{"$f":"SUM(E119)","v":0},{"$f":"SUM(H119)","v":0},0]
[8,{"$f":"VLOOKUP(A35,'Numéro licences'!$A$4:$B$32,2)","v":"LAMBILLON Anne"},"Aller-Retour","Km  renseignés",{"$f":"SUM('Passagers Nat'!CL36)","v":360},null,"Km  renseignés",{"$f":"SUM('Passagers Inter'!CX35)","v":0},null,"Km  renseignés",360,null,null,null,null,{"$f":"SUM(R6:R34)","v":44337},{"$f":"SUM(Q6:Q34)","v":16904},{"$f":"SUM(P35:Q35)","v":61241}]
[null,null,"Ronde","Km confirmés",{"$f":"SUM('Passagers Nat'!CL37)","v":360},null,"Km confirmés",{"$f":"SUM('Passagers Inter'!CX36)","v":0},null,"Km confirmés",360,null,null,null,null,{"$f":"SUM(P35/R35)","v":0.72397576786793161},{"$f":"SUM(Q35/R35)","v":0.27602423213206839}]
[null,null,null,"Rondes confirmées",{"$f":"SUM('Passagers Nat'!CL38)","v":2},null,"Rondes confirmées",{"$f":"SUM('Passagers Inter'!CX37)","v":0},null,"Rondes confirmées",2]
[null,null,null,"Rondes effectuées",{"$f":"SUM('Passagers Nat'!CL39)","v":0},null,"Rondes effectuées",{"$f":"SUM('Passagers Inter'!CX38)","v":0},null,"Rondes effectuées",0,null,null,null,null,null,null,null,null,null,null,{"$f":"SUM(V6:V37)","v":27793},{"$f":"SUM(W6:W37)","v":16904},{"$f":"SUM(V38:W38)","v":44697}]
[9,{"$f":"VLOOKUP(A39,'Numéro licences'!$A$4:$B$32,2)","v":"LAMIROY Anne"},"Aller-Retour","Km  renseignés",{"$f":"SUM('Passagers Nat'!CL40)","v":0},null,"Km  renseignés",{"$f":"SUM('Passagers Inter'!CX39)","v":1056},null,"Km  renseignés",1056,null,null,null,null,null,null,null,null,null,null,{"$f":"SUM(V38/X38)","v":0.62180906995995255},{"$f":"SUM(W38/X38)","v":0.37819093004004745}]
[null,null,"Ronde","Km confirmés",{"$f":"SUM('Passagers Nat'!CL41)","v":0},null,"Km confirmés",{"$f":"SUM('Passagers Inter'!CX40)","v":1056},null,"Km confirmés",1056,null,null,null,null,null,null,null,null,null,null,"NAT","INT"]
[null,null,null,"Rondes confirmées",{"$f":"SUM('Passagers Nat'!CL42)","v":0},null,"Rondes confirmées",{"$f":"SUM('Passagers Inter'!CX41)","v":1},null,"Rondes confirmées",1]
[null,null,null,"Rondes effectuées",{"$f":"SUM('Passagers Nat'!CL43)","v":0},null,"Rondes effectuées",{"$f":"SUM('Passagers Inter'!CX42)","v":1},null,"Rondes effectuées",1]
[10,{"$f":"VLOOKUP(A43,'Numéro licences'!$A$4:$B$32,2)","v":"LEROY Laure"},"Aller-Retour","Km  renseignés",{"$f":"SUM('Passagers Nat'!CL44)","v":3321},null,"Km  renseignés",{"$f":"SUM('Passagers Inter'!CX43)","v":2203},null,"Km  renseignés",5524]
[null,null,"Ronde","Km confirmés",{"$f":"SUM('Passagers Nat'!CL45)","v":3321},null,"Km confirmés",{"$f":"SUM('Passagers Inter'!CX44)","v":2203},null,"Km confirmés",5524]
[null,null,null,"Rondes confirmées",{"$f":"SUM('Passagers Nat'!CL46)","v":9},null,"Rondes confirmées",{"$f":"SUM('Passagers Inter'!CX45)","v":1},null,"Rondes confirmées",10]
[null,null,null,"Rondes effectuées",{"$f":"SUM('Passagers Nat'!CL47)","v":8},null,"Rondes effectuées",{"$f":"SUM('Passagers Inter'!CX46)","v":1},null,"Rondes effectuées",9]
[11,{"$f":"VLOOKUP(A47,'Numéro licences'!$A$4:$B$32,2)","v":"MALLIEN Emelyne"},"Aller-Retour","Km  renseignés",{"$f":"SUM('Passagers Nat'!CL48)","v":0},null,"Km  renseignés",{"$f":"SUM('Passagers Inter'!CX47)","v":0},null,"Km  renseignés",0]
[null,null,"Ronde","Km confirmés",{"$f":"SUM('Passagers Nat'!CL49)","v":0},null,"Km confirmés",{"$f":"SUM('Passagers Inter'!CX48)","v":0},null,"Km confirmés",0]
[null,null,null,"Rondes confirmées",{"$f":"SUM('Passagers Nat'!CL50)","v":0},null,"Rondes confirmées",{"$f":"SUM('Passagers Inter'!CX49)","v":0},null,"Rondes confirmées",0]
[null,null,null,"Rondes effectuées",{"$f":"SUM('Passagers Nat'!CL51)","v":0},null,"Rondes effectuées",{"$f":"SUM('Passagers Inter'!CX50)","v":0},null,"Rondes effectuées",0]
[12,{"$f":"VLOOKUP(A51,'Numéro licences'!$A$4:$B$32,2)","v":"PIERARD Anne-Sophie"},"Aller-Retour","Km  renseignés",{"$f":"SUM('Passagers Nat'!CL52)","v":0},null,"Km  renseignés",{"$f":"SUM('Passagers Inter'!CX51)","v":0},null,"Km  renseignés",0]
[null,null,"Ronde","Km confirmés",{"$f":"SUM('Passagers Nat'!CL53)","v":0},null,"Km confirmés",{"$f":"SUM('Passagers Inter'!CX52)","v":0},null,"Km confirmés",0]
[null,null,null,"Rondes confirmées",{"$f":"SUM('Passagers Nat'!CL54)","v":0},null,"Rondes confirmées",{"$f":"SUM('Passagers Inter'!CX53)","v":0},null,"Rondes confirmées",0]
[null,null,null,"Rondes effectuées",{"$f":"SUM('Passagers Nat'!CL55)","v":0},null,"Rondes effectuées",{"$f":"SUM('Passagers Inter'!CX54)","v":0},null,"Rondes effectuées",0]
[13,{"$f":"VLOOKUP(A55,'Numéro licences'!$A$4:$B$32,2)","v":"PONT Patricia"},"Aller-Retour","Km  renseignés",{"$f":"SUM('Passagers Nat'!CL56)","v":10021},null,"Km  renseignés",{"$f":"SUM('Passagers Inter'!CX55)","v":0},null,"Km  renseignés",10021]
[null,null,"Ronde","Km confirmés",{"$f":"SUM('Passagers Nat'!CL57)","v":10021},null,"Km confirmés",{"$f":"SUM('Passagers Inter'!CX56)","v":0},null,"Km confirmés",10021]
[null,null,null,"Rondes confirmées",{"$f":"SUM('Passagers Nat'!CL58)","v":33},null,"Rondes confirmées",{"$f":"SUM('Passagers Inter'!CX57)","v":0},null,"Rondes confirmées",33]
[null,null,null,"Rondes effectuées",{"$f":"SUM('Passagers Nat'!CL59)","v":31},null,"Rondes effectuées",{"$f":"SUM('Passagers Inter'!CX58)","v":0},null,"Rondes effectuées",31]
[14,{"$f":"VLOOKUP(A59,'Numéro licences'!$A$4:$B$32,2)","v":"MISEUR Carine"},"Aller-Retour","Km  renseignés",{"$f":"SUM('Passagers Nat'!CL60)","v":5164},null,"Km  renseignés",{"$f":"SUM('Passagers Inter'!CX59)","v":0},null,"Km  renseignés",5164]
[null,null,"Ronde","Km confirmés",{"$f":"SUM('Passagers Nat'!CL61)","v":5164},null,"Km confirmés",{"$f":"SUM('Passagers Inter'!CX60)","v":0},null,"Km confirmés",5164]
[null,null,null,"Rondes confirmées",{"$f":"SUM('Passagers Nat'!CL62)","v":16},null,"Rondes confirmées",{"$f":"SUM('Passagers Inter'!CX61)","v":0},null,"Rondes confirmées",16]
[null,null,null,"Rondes effectuées",{"$f":"SUM('Passagers Nat'!CL63)","v":16},null,"Rondes effectuées",{"$f":"SUM('Passagers Inter'!CX62)","v":0},null,"Rondes effectuées",16]
[15,{"$f":"VLOOKUP(A63,'Numéro licences'!$A$4:$B$32,2)","v":"ARENZANA Jennifer"},"Aller-Retour","Km  renseignés",{"$f":"SUM('Passagers Nat'!CL64)","v":779},null,"Km  renseignés",{"$f":"SUM('Passagers Inter'!CX63)","v":0},null,"Km  renseignés",779]
[null,null,"Ronde","Km confirmés",{"$f":"SUM('Passagers Nat'!CL65)","v":0},null,"Km confirmés",{"$f":"SUM('Passagers Inter'!CX64)","v":0},null,"Km confirmés",0]
[null,null,null,"Rondes confirmées",{"$f":"SUM('Passagers Nat'!CL66)","v":0},null,"Rondes confirmées",{"$f":"SUM('Passagers Inter'!CX65)","v":0},null,"Rondes confirmées",0]
[null,null,null,"Rondes effectuées",{"$f":"SUM('Passagers Nat'!CL67)","v":3},null,"Rondes effectuées",{"$f":"SUM('Passagers Inter'!CX66)","v":0},null,"Rondes effectuées",3]
[16,{"$f":"VLOOKUP(A67,'Numéro licences'!$A$4:$B$32,2)","v":0},"Aller-Retour","Km  renseignés",{"$f":"SUM('Passagers Nat'!CL68)","v":0},null,"Km  renseignés",{"$f":"SUM('Passagers Inter'!CX67)","v":0},null,"Km  renseignés",0]
[null,null,"Ronde","Km confirmés",{"$f":"SUM('Passagers Nat'!CL69)","v":0},null,"Km confirmés",{"$f":"SUM('Passagers Inter'!CX68)","v":0},null,"Km confirmés",0]
[null,null,null,"Rondes confirmées",{"$f":"SUM('Passagers Nat'!CL70)","v":0},null,"Rondes confirmées",{"$f":"SUM('Passagers Inter'!CX69)","v":0},null,"Rondes confirmées",0]
[null,null,null,"Rondes effectuées",{"$f":"SUM('Passagers Nat'!CL71)","v":0},null,"Rondes effectuées",{"$f":"SUM('Passagers Inter'!CX70)","v":0},null,"Rondes effectuées",0]
[17,{"$f":"VLOOKUP(A71,'Numéro licences'!$A$4:$B$32,2)","v":0},"Aller-Retour","Km  renseignés",{"$f":"SUM('Passagers Nat'!CL72)","v":0},null,"Km  renseignés",{"$f":"SUM('Passagers Inter'!CX71)","v":0},null,"Km  renseignés",0]
[null,null,"Ronde","Km confirmés",{"$f":"SUM('Passagers Nat'!CL73)","v":0},null,"Km confirmés",{"$f":"SUM('Passagers Inter'!CX72)","v":0},null,"Km confirmés",{"$f":"SUM(E72+H72)","v":0}]
[null,null,null,"Rondes confirmées",{"$f":"SUM('Passagers Nat'!CL74)","v":0},null,"Rondes confirmées",{"$f":"SUM('Passagers Inter'!CX73)","v":0},null,"Rondes confirmées",0]
[null,null,null,"Rondes effectuées",{"$f":"SUM('Passagers Nat'!CL75)","v":0},null,"Rondes effectuées",{"$f":"SUM('Passagers Inter'!CX74)","v":0},null,"Rondes effectuées",0]
[18,{"$f":"VLOOKUP(A75,'Numéro licences'!$A$4:$B$32,2)","v":0},"Aller-Retour","Km  renseignés",{"$f":"SUM('Passagers Nat'!CL76)","v":0},null,"Km  renseignés",{"$f":"SUM('Passagers Inter'!CX75)","v":0},null,"Km  renseignés",0]
[null,null,"Ronde","Km confirmés",{"$f":"SUM('Passagers Nat'!CL77)","v":0},null,"Km confirmés",{"$f":"SUM('Passagers Inter'!CX76)","v":0},null,"Km confirmés",0]
[null,null,null,"Rondes confirmées",{"$f":"SUM('Passagers Nat'!CL78)","v":0},null,"Rondes confirmées",{"$f":"SUM('Passagers Inter'!CX77)","v":0},null,"Rondes confirmées",0]
[null,null,null,"Rondes effectuées",{"$f":"SUM('Passagers Nat'!CL79)","v":0},null,"Rondes effectuées",{"$f":"SUM('Passagers Inter'!CX78)","v":0},null,"Rondes effectuées",0]
[19,{"$f":"VLOOKUP(A79,'Numéro licences'!$A$4:$B$32,2)","v":0},"Aller-Retour","Km  renseignés",{"$f":"SUM('Passagers Nat'!CL80)","v":0},null,"Km  renseignés",{"$f":"SUM('Passagers Inter'!CX79)","v":0},null,"Km  renseignés",0]
[null,null,"Ronde","Km confirmés",{"$f":"SUM('Passagers Nat'!CL81)","v":0},null,"Km confirmés",{"$f":"SUM('Passagers Inter'!CX80)","v":0},null,"Km confirmés",0]
[null,null,null,"Rondes confirmées",{"$f":"SUM('Passagers Nat'!CL82)","v":0},null,"Rondes confirmées",{"$f":"SUM('Passagers Inter'!CX81)","v":0},null,"Rondes confirmées",0]
[null,null,null,"Rondes effectuées",{"$f":"SUM('Passagers Nat'!CL83)","v":0},null,"Rondes effectuées",{"$f":"SUM('Passagers Inter'!CX82)","v":0},null,"Rondes effectuées",0]
[20,{"$f":"VLOOKUP(A83,'Numéro licences'!$A$4:$B$32,2)","v":0},"Aller-Retour","Km  renseignés",{"$f":"SUM('Passagers Nat'!CL84)","v":0},null,"Km  renseignés",{"$f":"SUM('Passagers Inter'!CX83)","v":0},null,"Km  renseignés",0]
[null,null,"Ronde","Km confirmés",{"$f":"SUM('Passagers Nat'!CL85)","v":0},null,"Km confirmés",{"$f":"SUM('Passagers Inter'!CX84)","v":0},null,"Km confirmés",0]
[null,null,null,"Rondes confirmées",{"$f":"SUM('Passagers Nat'!CL86)","v":0},null,"Rondes confirmées",{"$f":"SUM('Passagers Inter'!CX85)","v":0},null,"Rondes confirmées",0]
[null,null,null,"Rondes effectuées",{"$f":"SUM('Passagers Nat'!CL87)","v":0},null,"Rondes effectuées",{"$f":"SUM('Passagers Inter'!CX86)","v":0},null,"Rondes effectuées",0]
[21,{"$f":"VLOOKUP(A87,'Numéro licences'!$A$4:$B$32,2)","v":0},"Aller-Retour","Km  renseignés",{"$f":"SUM('Passagers Nat'!CL88)","v":0},null,"Km  renseignés",{"$f":"SUM('Passagers Inter'!CX87)","v":0},null,"Km  renseignés",0]
[null,null,"Ronde","Km confirmés",{"$f":"SUM('Passagers Nat'!CL89)","v":0},null,"Km confirmés",{"$f":"SUM('Passagers Inter'!CX88)","v":0},null,"Km confirmés",0]
[null,null,null,"Rondes confirmées",{"$f":"SUM('Passagers Nat'!CL90)","v":0},null,"Rondes confirmées",{"$f":"SUM('Passagers Inter'!CX89)","v":0},null,"Rondes confirmées",0]
[null,null,null,"Rondes effectuées",{"$f":"SUM('Passagers Nat'!CL91)","v":0},null,"Rondes effectuées",{"$f":"SUM('Passagers Inter'!CX90)","v":0},null,"Rondes effectuées",0]
[22,{"$f":"VLOOKUP(A91,'Numéro licences'!$A$4:$B$32,2)","v":0},"Aller-Retour","Km  renseignés",{"$f":"SUM('Passagers Nat'!CL92)","v":0},null,"Km  renseignés",{"$f":"SUM('Passagers Inter'!CX91)","v":0},null,"Km  renseignés",0]
[null,null,"Ronde","Km confirmés",{"$f":"SUM('Passagers Nat'!CL93)","v":0},null,"Km confirmés",{"$f":"SUM('Passagers Inter'!CX92)","v":0},null,"Km confirmés",0]
[null,null,null,"Rondes confirmées",{"$f":"SUM('Passagers Nat'!CL94)","v":0},null,"Rondes confirmées",{"$f":"SUM('Passagers Inter'!CX93)","v":0},null,"Rondes confirmées",0]
[null,null,null,"Rondes effectuées",{"$f":"SUM('Passagers Nat'!CL95)","v":0},null,"Rondes effectuées",{"$f":"SUM('Passagers Inter'!CX94)","v":0},null,"Rondes effectuées",0]
[23,{"$f":"VLOOKUP(A95,'Numéro licences'!$A$4:$B$32,2)","v":0},"Aller-Retour","Km  renseignés",{"$f":"SUM('Passagers Nat'!CL96)","v":0},null,"Km  renseignés",{"$f":"SUM('Passagers Inter'!CX95)","v":0},null,"Km  renseignés",0]
[null,null,"Ronde","Km confirmés",{"$f":"SUM('Passagers Nat'!CL97)","v":0},null,"Km confirmés",{"$f":"SUM('Passagers Inter'!CX96)","v":0},null,"Km confirmés",0]
[null,null,null,"Rondes confirmées",{"$f":"SUM('Passagers Nat'!CL98)","v":0},null,"Rondes confirmées",{"$f":"SUM('Passagers Inter'!CX97)","v":0},null,"Rondes confirmées",0]
[null,null,null,"Rondes effectuées",{"$f":"SUM('Passagers Nat'!CL99)","v":0},null,"Rondes effectuées",{"$f":"SUM('Passagers Inter'!CX98)","v":0},null,"Rondes effectuées",0]
[24,{"$f":"VLOOKUP(A99,'Numéro licences'!$A$4:$B$32,2)","v":0},"Aller-Retour","Km  renseignés",{"$f":"SUM('Passagers Nat'!CL100)","v":0},null,"Km  renseignés",{"$f":"SUM('Passagers Inter'!CX99)","v":0},null,"Km  renseignés",0]
[null,null,"Ronde","Km confirmés",{"$f":"SUM('Passagers Nat'!CL101)","v":0},null,"Km confirmés",{"$f":"SUM('Passagers Inter'!CX100)","v":0},null,"Km confirmés",0]
[null,null,null,"Rondes confirmées",{"$f":"SUM('Passagers Nat'!CL102)","v":0},null,"Rondes confirmées",{"$f":"SUM('Passagers Inter'!CX101)","v":0},null,"Rondes confirmées",0]
[null,null,null,"Rondes effectuées",{"$f":"SUM('Passagers Nat'!CL103)","v":0},null,"Rondes effectuées",{"$f":"SUM('Passagers Inter'!CX102)","v":0},null,"Rondes effectuées",0]
[25,{"$f":"VLOOKUP(A103,'Numéro licences'!$A$4:$B$32,2)","v":0},"Aller-Retour","Km  renseignés",{"$f":"SUM('Passagers Nat'!CL104)","v":0},null,"Km  renseignés",{"$f":"SUM('Passagers Inter'!CX103)","v":0},null,"Km  renseignés",0]
[null,null,"Ronde","Km confirmés",{"$f":"SUM('Passagers Nat'!CL105)","v":0},null,"Km confirmés",{"$f":"SUM('Passagers Inter'!CX104)","v":0},null,"Km confirmés",0]
[null,null,null,"Rondes confirmées",{"$f":"SUM('Passagers Nat'!CL106)","v":0},null,"Rondes confirmées",{"$f":"SUM('Passagers Inter'!CX105)","v":0},null,"Rondes confirmées",0]
[null,null,null,"Rondes effectuées",{"$f":"SUM('Passagers Nat'!CL107)","v":0},null,"Rondes effectuées",{"$f":"SUM('Passagers Inter'!CX106)","v":0},null,"Rondes effectuées",0]
[26,{"$f":"VLOOKUP(A107,'Numéro licences'!$A$4:$B$32,2)","v":0},"Aller-Retour","Km  renseignés",{"$f":"SUM('Passagers Nat'!CL108)","v":0},null,"Km  renseignés",{"$f":"SUM('Passagers Inter'!CX107)","v":0},null,"Km  renseignés",0]
[null,null,"Ronde","Km confirmés",{"$f":"SUM('Passagers Nat'!CL109)","v":0},null,"Km confirmés",{"$f":"SUM('Passagers Inter'!CX108)","v":0},null,"Km confirmés",0]
[null,null,null,"Rondes confirmées",{"$f":"SUM('Passagers Nat'!CL110)","v":0},null,"Rondes confirmées",{"$f":"SUM('Passagers Inter'!CX109)","v":0},null,"Rondes confirmées",0]
[null,null,null,"Rondes effectuées",{"$f":"SUM('Passagers Nat'!CL111)","v":0},null,"Rondes effectuées",{"$f":"SUM('Passagers Inter'!CX110)","v":0},null,"Rondes effectuées",0]
[27,{"$f":"VLOOKUP(A111,'Numéro licences'!$A$4:$B$32,2)","v":0},"Aller-Retour","Km  renseignés",{"$f":"SUM('Passagers Nat'!CL112)","v":0},null,"Km  renseignés",{"$f":"SUM('Passagers Inter'!CX111)","v":0},null,"Km  renseignés",0]
[null,null,"Ronde","Km confirmés",{"$f":"SUM('Passagers Nat'!CL113)","v":0},null,"Km confirmés",{"$f":"SUM('Passagers Inter'!CX112)","v":0},null,"Km confirmés",0]
[null,null,null,"Rondes confirmées",{"$f":"SUM('Passagers Nat'!CL114)","v":0},null,"Rondes confirmées",{"$f":"SUM('Passagers Inter'!CX113)","v":0},null,"Rondes confirmées",0]
[null,null,null,"Rondes effectuées",{"$f":"SUM('Passagers Nat'!CL115)","v":0},null,"Rondes effectuées",{"$f":"SUM('Passagers Inter'!CX114)","v":0},null,"Rondes effectuées",0]
[28,{"$f":"VLOOKUP(A115,'Numéro licences'!$A$4:$B$32,2)","v":0},"Aller-Retour","Km  renseignés",{"$f":"SUM('Passagers Nat'!CL116)","v":0},null,"Km  renseignés",{"$f":"SUM('Passagers Inter'!CX115)","v":0},null,"Km  renseignés",0]
[null,null,"Ronde","Km confirmés",{"$f":"SUM('Passagers Nat'!CL117)","v":0},null,"Km confirmés",{"$f":"SUM('Passagers Inter'!CX116)","v":0},null,"Km confirmés",0]
[null,null,null,"Rondes confirmées",{"$f":"SUM('Passagers Nat'!CL118)","v":0},null,"Rondes confirmées",{"$f":"SUM('Passagers Inter'!CX117)","v":0},null,"Rondes confirmées",0]
[null,null,null,"Rondes effectuées",{"$f":"SUM('Passagers Nat'!CL119)","v":0},null,"Rondes effectuées",{"$f":"SUM('Passagers Inter'!CX118)","v":0},null,"Rondes effectuées",0]
[29,{"$f":"VLOOKUP(A119,'Numéro licences'!$A$4:$B$32,2)","v":0},"Aller-Retour","Km  renseignés",{"$f":"SUM('Passagers Nat'!CL120)","v":0},null,"Km  renseignés",{"$f":"SUM('Passagers Inter'!CX119)","v":0},null,"Km  renseignés",0]
[null,null,"Ronde","Km confirmés",{"$f":"SUM('Passagers Nat'!CL121)","v":0},null,"Km confirmés",{"$f":"SUM('Passagers Inter'!CX120)","v":0},null,"Km confirmés",0]
[null,null,null,"Rondes confirmées",{"$f":"SUM('Passagers Nat'!CL122)","v":0},null,"Rondes confirmées",{"$f":"SUM('Passagers Inter'!CX121)","v":0},null,"Rondes confirmées",0]
[null,null,null,"Rondes effectuées",{"$f":"SUM('Passagers Nat'!CL123)","v":0},null,"Rondes effectuées",{"$f":"SUM('Passagers Inter'!CX122)","v":0},null,"Rondes effectuées",0]
[]
[]
[null,null,null,"Rondes confirmées",{"$f":"SUM(E9+E13+E17+E21+E25+E29+E33+E37+E41+E45+E49+E53+E57+E61+E65+E69+E73+E77+E81+E85+E89+E93+E97+E101+E105+E109+E113+E117+E121)","v":89},null,"Rondes confirmées",{"$f":"SUM(H9+H13+H17+H21+H25+H29+H33+H37+H41+H45+H49+H53+H57+H61+H65+H69+H73+H77+H81+H85+H89+H93+H97+H101+H105+H109+H113+H117+H121)","v":11},null,"Rondes confirmées",{"$f":"SUM(K9+K13+K17+K21+K25+K29+K33+K37+K41+K45+K49+K53+K57+K61+K65+K69+K73+K77+K81+K85+K89+K93+K97+K101+K105+K109+K113+K117+K121)","v":100}]
[null,null,null,"Rondes effectuées",{"$f":"SUM(E10+E14+E18+E22+E26+E30+E34+E38+E42+E46+E50+E54+E58+E62+E66+E70+E74+E78+E82+E86+E90+E94+E98+E102+E106+E110+E114+E118+E122)","v":84},null,"Rondes effectuées",{"$f":"SUM(H10+H14+H18+H22+H26+H30+H34+H38+H42+H46+H50+H54+H58+H62+H66+H70+H74+H78+H82+H86+H90+H94+H98+H102+H106+H110+H114+H118+H122)","v":11},null,"Rondes effectuées",{"$f":"SUM(K10+K14+K18+K22+K26+K30+K34+K38+K42+K46+K50+K54+K58+K62+K66+K70+K74+K78+K82+K86+K90+K94+K98+K102+K106+K110+K114+K118+K122)","v":95}]
[]
[]
[]
[]
[]
[null,"Colonne1"]
[1,"ALAIMO Rosa"]
[{"$f":"SUM(A133+1)","v":2},"BRIDOUX Jacqueline"]
[{"$f":"SUM(A134+1)","v":3},"COSYNS Carine"]
[4,"DEHAUT Stéphane"]
[5,"GREGORICS Kathy"]
[6,"INGELS Chantal"]
[7,"LAMBILLON Anne"]
[8,"LAMIROY Anne"]
[9,"LEQUEUX Anne"]
[10,"LEROY Laure"]
[11,"PIROTTE Daisy"]
[12,"THOMAS Isabelle"]
[13]
[14]
[15]
[16]
[17]
[18]
[19]
[20]
[21]
[22]
[23]
[24]
[25]
[26]
[27]
[28]
[29]
[30]
[31]
[32]
[33]
[34]
[35]
[36]
[37]
[38]
[39]
[40]
[41]
[42]
[43]
[{"$f":"SUM(A175+1)","v":44}]
[45]
[46]

{"sheet":"Pilotes Nat","index":4,"n_rows":247,"n_cols":96,"rows_kept":247,"cut":false,"hidden":false,"merged":[[183,1,186,1],[187,1,190,1],[163,1,166,1],[167,1,170,1],[171,1,174,1],[175,1,178,1],[179,1,182,1],[143,1,146,1],[147,1,150,1],[151,1,154,1],[155,1,158,1],[159,1,162,1],[123,1,126,1],[127,1,130,1],[131,1,134,1],[135,1,138,1],[139,1,142,1],[103,1,106,1],[107,1,110,1],[111,1,114,1],[115,1,118,1],[119,1,122,1],[83,1,86,1],[87,1,90,1],[91,1,94,1],[95,1,98,1],[99,1,102,1],[63,1,66,1],[67,1,70,1],[71,1,74,1],[75,1,78,1],[79,1,82,1],[0,69,0,87],[99,93,99,95],[7,1,10,1],[11,1,14,1],[15,1,18,1],[19,1,22,1],[23,1,26,1],[27,1,30,1],[31,1,34,1],[35,1,38,1],[39,1,42,1],[43,1,46,1],[47,1,50,1],[51,1,54,1],[55,1,58,1],[59,1,62,1]]}
[null,null,null,1,{"$f":"SUM(D1+1)","v":2},{"$f":"SUM(E1+1)","v":3},4,5,6,7,8,9,10,11,12,13,14,15,16,17,18,19,20,21,22,23,24,25,26,27,28,29,30,31,32,33,34,35,36,37,38,39,40,41,42,43,44,45,46,47,48,49,50,51,52,53,54,55,56,57,58,{"$f":"SUM(BI1+1)","v":59},{"$f":"SUM(BJ1+1)","v":60},{"$f":"SUM(BK1+1)","v":61},62,null,null,null,null,"Hors FMB"]
[null,null,null,902,531,516,103,904,713,912,426,721,730,726,614,716,533,549,427,126,419,516,721,729,0,312,713,508,137,705,516,818,703,531,903,427,710,726,921,103,549,818,1000,406,902,730,426,703,908,705,136,531,912,126,406,622,1000,332,508,332,710,1000,1000,1000,1000]
[null,null,null,"2023-02-12","2023-02-26","2023-03-05","2023-03-12","2023-03-18","2023-03-19","2023-03-26","2023-04-02","2023-04-09","2023-04-10","2023-04-16","2023-04-22","2023-04-23","2023-04-30","2023-05-01","2023-05-07","2023-05-07","2023-05-13","2023-05-17","2023-05-28","2023-05-29",null,"2023-06-10","2023-06-18","2023-06-18","2023-06-24","2023-06-25","2023-07-01","2023-07-01","2023-07-02","2023-07-08","2023-07-15","2023-07-16","2023-07-21","2023-07-23","2023-07-29","2023-08-06","2023-08-06","2023-08-12",null,"2023-08-20","2023-08-26","2023-08-27","2023-09-02","2023-09-03","2023-09-09","2023-09-10","2023-09-16","2023-09-24","2023-09-24","2023-09-30","2023-10-08","2023-10-14",null,"2023-10-29","2023-11-01","2023-11-05","2023-11-11",null,null,null,null,null,null,null,"2023-03-26","2023-03-25","2023-05-21"]
[null,null,null,{"$f":"VLOOKUP(D2,'Kilomètre AR'!$A$1:$B$56,2)","v":"AMC GIJVERINKHOVE"},{"$f":"VLOOKUP(E2,'Kilomètre AR'!$A$1:$B$56,2)","v":"MC HOESELT"},{"$f":"VLOOKUP(F2,'Kilomètre AR'!$A$1:$B$56,2)","v":"MC LOTUS"},{"$f":"VLOOKUP(G2,'Kilomètre AR'!$A$1:$B$56,2)","v":"KAMC HERENTALS"},{"$f":"VLOOKUP(H2,'Kilomètre AR'!$A$1:$B$56,2)","v":"KAMC MENEN"},{"$f":"VLOOKUP(I2,'Kilomètre AR'!$A$1:$B$56,2)","v":"MC ST SERVAIS"},{"$f":"VLOOKUP(J2,'Kilomètre AR'!$A$1:$B$56,2)","v":"MTC ZEDELGEM"},{"$f":"VLOOKUP(K2,'Kilomètre AR'!$A$1:$B$56,2)","v":"MTC WELKENRAEDT"},{"$f":"VLOOKUP(L2,'Kilomètre AR'!$A$1:$B$56,2)","v":"MC LES PETITS GRIS   Warisoulx"},{"$f":"VLOOKUP(M2,'Kilomètre AR'!$A$1:$B$56,2)","v":"MC LES 4 & CO  Assesse"},{"$f":"VLOOKUP(N2,'Kilomètre AR'!$A$1:$B$56,2)","v":"MC BIKE AND TRIKE BELGIUM  Dhuy"},{"$f":"VLOOKUP(O2,'Kilomètre AR'!$A$1:$B$56,2)","v":"MC CHEVY RACING   Libramont-Chevigny"},{"$f":"VLOOKUP(P2,'Kilomètre AR'!$A$1:$B$56,2)","v":"AMC FLOREFFE"},{"$f":"VLOOKUP(Q2,'Kilomètre AR'!$A$1:$B$56,2)","v":"MTC 13  Leopoldsburg"},{"$f":"VLOOKUP(R2,'Kilomètre AR'!$A$1:$B$56,2)","v":"MTC WELLEN"},{"$f":"VLOOKUP(S2,'Kilomètre AR'!$A$1:$B$56,2)","v":"MC ZEBUS"},{"$f":"VLOOKUP(T2,'Kilomètre AR'!$A$1:$B$56,2)","v":"MTC TOERVRIENDEN  Berendrecht"},{"$f":"VLOOKUP(U2,'Kilomètre AR'!$A$1:$B$56,2)","v":"AMC ST VITH"},{"$f":"VLOOKUP(V2,'Kilomètre AR'!$A$1:$B$56,2)","v":"MC LOTUS"},{"$f":"VLOOKUP(W2,'Kilomètre AR'!$A$1:$B$56,2)","v":"MC LES PETITS GRIS   Warisoulx"},{"$f":"VLOOKUP(X2,'Kilomètre AR'!$A$1:$B$56,2)","v":"VIROINVAL MOTOR SPORT Dourbes"},{"$f":"VLOOKUP(Y2,'Kilomètre AR'!$A$1:$B$56,2)","v":"RONDE FMB"},{"$f":"VLOOKUP(Z2,'Kilomètre AR'!$A$1:$B$56,2)","v":"MC RESSAIX"},{"$f":"VLOOKUP(AA2,'Kilomètre AR'!$A$1:$B$56,2)","v":"MC ST SERVAIS"},{"$f":"VLOOKUP(AB2,'Kilomètre AR'!$A$1:$B$56,2)","v":"AMC KOERSEL"},{"$f":"VLOOKUP(AC2,'Kilomètre AR'!$A$1:$B$56,2)","v":"MTC YELLS ARMY   Berchem"},{"$f":"VLOOKUP(AD2,'Kilomètre AR'!$A$1:$B$56,2)","v":"MC DINANT"},{"$f":"VLOOKUP(AE2,'Kilomètre AR'!$A$1:$B$56,2)","v":"MC LOTUS"},{"$f":"VLOOKUP(AF2,'Kilomètre AR'!$A$1:$B$56,2)","v":"MOTORSPORT   Aalst"},{"$f":"VLOOKUP(AG2,'Kilomètre AR'!$A$1:$B$56,2)","v":"R CINEY MC"},{"$f":"VLOOKUP(AH2,'Kilomètre AR'!$A$1:$B$56,2)","v":"MC HOESELT"},{"$f":"VLOOKUP(AI2,'Kilomètre AR'!$A$1:$B$56,2)","v":"AMSC LEIELAND  Wervik"},{"$f":"VLOOKUP(AJ2,'Kilomètre AR'!$A$1:$B$56,2)","v":"MC ZEBUS"},{"$f":"VLOOKUP(AK2,'Kilomètre AR'!$A$1:$B$56,2)","v":"MC MOLIGNARD"},{"$f":"VLOOKUP(AL2,'Kilomètre AR'!$A$1:$B$56,2)","v":"MC BIKE AND TRIKE BELGIUM  Dhuy"},{"$f":"VLOOKUP(AM2,'Kilomètre AR'!$A$1:$B$56,2)","v":"MTC VRIJBOS   Houthulst"},{"$f":"VLOOKUP(AN2,'Kilomètre AR'!$A$1:$B$56,2)","v":"KAMC HERENTALS"},{"$f":"VLOOKUP(AO2,'Kilomètre AR'!$A$1:$B$56,2)","v":"MTC WELLEN"},{"$f":"VLOOKUP(AP2,'Kilomètre AR'!$A$1:$B$56,2)","v":"MOTORSPORT   Aalst"},{"$f":"VLOOKUP(AQ2,'Kilomètre AR'!$A$1:$B$56,2)","v":"FREE"},{"$f":"VLOOKUP(AR2,'Kilomètre AR'!$A$1:$B$56,2)","v":"RAMC EUPEN"},{"$f":"VLOOKUP(AS2,'Kilomètre AR'!$A$1:$B$56,2)","v":"AMC GIJVERINKHOVE"},{"$f":"VLOOKUP(AT2,'Kilomètre AR'!$A$1:$B$56,2)","v":"MC LES 4 & CO  Assesse"},{"$f":"VLOOKUP(AU2,'Kilomètre AR'!$A$1:$B$56,2)","v":"MTC WELKENRAEDT"},{"$f":"VLOOKUP(AV2,'Kilomètre AR'!$A$1:$B$56,2)","v":"R CINEY MC"},{"$f":"VLOOKUP(AW2,'Kilomètre AR'!$A$1:$B$56,2)","v":"AMC POPERINGE"},{"$f":"VLOOKUP(AX2,'Kilomètre AR'!$A$1:$B$56,2)","v":"MC DINANT"},{"$f":"VLOOKUP(AY2,'Kilomètre AR'!$A$1:$B$56,2)","v":"MTC AMIGO'S   Schoten"},{"$f":"VLOOKUP(AZ2,'Kilomètre AR'!$A$1:$B$56,2)","v":"MC HOESELT"},{"$f":"VLOOKUP(BA2,'Kilomètre AR'!$A$1:$B$56,2)","v":"MTC ZEDELGEM"},{"$f":"VLOOKUP(BB2,'Kilomètre AR'!$A$1:$B$56,2)","v":"MTC TOERVRIENDEN  Berendrecht"},{"$f":"VLOOKUP(BC2,'Kilomètre AR'!$A$1:$B$56,2)","v":"RAMC EUPEN"},{"$f":"VLOOKUP(BD2,'Kilomètre AR'!$A$1:$B$56,2)","v":"MC DÜREN"},{"$f":"VLOOKUP(BE2,'Kilomètre AR'!$A$1:$B$56,2)","v":"FREE"},{"$f":"VLOOKUP(BF2,'Kilomètre AR'!$A$1:$B$56,2)","v":"MC BUTZ BIKERS 95   Ecaussinnes"},{"$f":"VLOOKUP(BG2,'Kilomètre AR'!$A$1:$B$56,2)","v":"AMC KOERSEL"},{"$f":"VLOOKUP(BH2,'Kilomètre AR'!$A$1:$B$56,2)","v":"MC BUTZ BIKERS 95   Ecaussinnes"},{"$f":"VLOOKUP(BI2,'Kilomètre AR'!$A$1:$B$56,2)","v":"MC MOLIGNARD"},{"$f":"VLOOKUP(BJ2,'Kilomètre AR'!$A$1:$B$56,2)","v":"FREE"},{"$f":"VLOOKUP(BK2,'Kilomètre AR'!$A$1:$B$56,2)","v":"FREE"},{"$f":"VLOOKUP(BL2,'Kilomètre AR'!$A$1:$B$56,2)","v":"FREE"},{"$f":"VLOOKUP(BM2,'Kilomètre AR'!$A$1:$B$56,2)","v":"FREE"},null,null,null,"Offrez-moi la lune","MTC WALLONIE","MC Les Spectres"]
[null,"Aller-Retour",null,{"$f":"VLOOKUP(D2,'Kilomètre AR'!$A$1:$D$56,4)","v":394},{"$f":"VLOOKUP(E2,'Kilomètre AR'!$A$1:$D$56,4)","v":186},{"$f":"VLOOKUP(F2,'Kilomètre AR'!$A$1:$D$56,4)","v":160},{"$f":"VLOOKUP(G2,'Kilomètre AR'!$A$1:$D$56,4)","v":266},{"$f":"VLOOKUP(H2,'Kilomètre AR'!$A$1:$D$56,4)","v":310},{"$f":"VLOOKUP(I2,'Kilomètre AR'!$A$1:$D$56,4)","v":0},{"$f":"VLOOKUP(J2,'Kilomètre AR'!$A$1:$D$56,4)","v":338},{"$f":"VLOOKUP(K2,'Kilomètre AR'!$A$1:$D$56,4)","v":204},{"$f":"VLOOKUP(L2,'Kilomètre AR'!$A$1:$D$56,4)","v":20},{"$f":"VLOOKUP(M2,'Kilomètre AR'!$A$1:$D$56,4)","v":44},{"$f":"VLOOKUP(N2,'Kilomètre AR'!$A$1:$D$56,4)","v":34},{"$f":"VLOOKUP(O2,'Kilomètre AR'!$A$1:$D$56,4)","v":174},{"$f":"VLOOKUP(P2,'Kilomètre AR'!$A$1:$D$56,4)","v":18},{"$f":"VLOOKUP(Q2,'Kilomètre AR'!$A$1:$D$56,4)","v":268},{"$f":"VLOOKUP(R2,'Kilomètre AR'!$A$1:$D$56,4)","v":156},{"$f":"VLOOKUP(S2,'Kilomètre AR'!$A$1:$D$56,4)","v":118},{"$f":"VLOOKUP(T2,'Kilomètre AR'!$A$1:$D$56,4)","v":254},{"$f":"VLOOKUP(U2,'Kilomètre AR'!$A$1:$D$56,4)","v":284},1462,{"$f":"VLOOKUP(W2,'Kilomètre AR'!$A$1:$D$56,4)","v":20},{"$f":"VLOOKUP(X2,'Kilomètre AR'!$A$1:$D$56,4)","v":164},38,{"$f":"VLOOKUP(Z2,'Kilomètre AR'!$A$1:$D$56,4)","v":132},{"$f":"VLOOKUP(AA2,'Kilomètre AR'!$A$1:$D$56,4)","v":0},{"$f":"VLOOKUP(AB2,'Kilomètre AR'!$A$1:$D$56,4)","v":260},{"$f":"VLOOKUP(AC2,'Kilomètre AR'!$A$1:$D$56,4)","v":204},{"$f":"VLOOKUP(AD2,'Kilomètre AR'!$A$1:$D$56,4)","v":86},{"$f":"VLOOKUP(AE2,'Kilomètre AR'!$A$1:$D$56,4)","v":160},{"$f":"VLOOKUP(AF2,'Kilomètre AR'!$A$1:$D$56,4)","v":204},{"$f":"VLOOKUP(AG2,'Kilomètre AR'!$A$1:$D$56,4)","v":68},{"$f":"VLOOKUP(AH2,'Kilomètre AR'!$A$1:$D$56,4)","v":186},{"$f":"VLOOKUP(AI2,'Kilomètre AR'!$A$1:$D$56,4)","v":332},{"$f":"VLOOKUP(AJ2,'Kilomètre AR'!$A$1:$D$56,4)","v":118},{"$f":"VLOOKUP(AK2,'Kilomètre AR'!$A$1:$D$56,4)","v":18},{"$f":"VLOOKUP(AL2,'Kilomètre AR'!$A$1:$D$56,4)","v":34},{"$f":"VLOOKUP(AM2,'Kilomètre AR'!$A$1:$D$56,4)","v":374},{"$f":"VLOOKUP(AN2,'Kilomètre AR'!$A$1:$D$56,4)","v":266},{"$f":"VLOOKUP(AO2,'Kilomètre AR'!$A$1:$D$56,4)","v":156},{"$f":"VLOOKUP(AP2,'Kilomètre AR'!$A$1:$D$56,4)","v":204},{"$f":"VLOOKUP(AQ2,'Kilomètre AR'!$A$1:$D$56,4)","v":0},{"$f":"VLOOKUP(AR2,'Kilomètre AR'!$A$1:$D$56,4)","v":210},{"$f":"VLOOKUP(AS2,'Kilomètre AR'!$A$1:$D$56,4)","v":394},{"$f":"VLOOKUP(AT2,'Kilomètre AR'!$A$1:$D$56,4)","v":44},{"$f":"VLOOKUP(AU2,'Kilomètre AR'!$A$1:$D$56,4)","v":204},{"$f":"VLOOKUP(AV2,'Kilomètre AR'!$A$1:$D$56,4)","v":68},{"$f":"VLOOKUP(AW2,'Kilomètre AR'!$A$1:$D$56,4)","v":376},{"$f":"VLOOKUP(AX2,'Kilomètre AR'!$A$1:$D$56,4)","v":86},{"$f":"VLOOKUP(AY2,'Kilomètre AR'!$A$1:$D$56,4)","v":224},{"$f":"VLOOKUP(AZ2,'Kilomètre AR'!$A$1:$D$56,4)","v":186},{"$f":"VLOOKUP(BA2,'Kilomètre AR'!$A$1:$D$56,4)","v":338},{"$f":"VLOOKUP(BB2,'Kilomètre AR'!$A$1:$D$56,4)","v":254},{"$f":"VLOOKUP(BC2,'Kilomètre AR'!$A$1:$D$56,4)","v":210},{"$f":"VLOOKUP(BD2,'Kilomètre AR'!$A$1:$D$56,4)","v":280},{"$f":"VLOOKUP(BE2,'Kilomètre AR'!$A$1:$D$56,4)","v":0},{"$f":"VLOOKUP(BF2,'Kilomètre AR'!$A$1:$D$56,4)","v":118},164,{"$f":"VLOOKUP(BH2,'Kilomètre AR'!$A$1:$D$56,4)","v":118},{"$f":"VLOOKUP(BI2,'Kilomètre AR'!$A$1:$D$56,4)","v":18},{"$f":"VLOOKUP(BJ2,'Kilomètre AR'!$A$1:$D$56,4)","v":0},{"$f":"VLOOKUP(BK2,'Kilomètre AR'!$A$1:$D$56,4)","v":0},{"$f":"VLOOKUP(BL2,'Kilomètre AR'!$A$1:$D$56,4)","v":0},{"$f":"VLOOKUP(BM2,'Kilomètre AR'!$A$1:$D$56,4)","v":0},null,null,null,35,110,154,null,null,null,-1,-1,-1,-1,-1,-1,-1,-1,-1,-1,-1]
[null,"Ronde",null,130,150,140,130,120,160,150,134,173,160,160,175,180,179,146,170,270,190,212,200,221,803,175,200,160,150,216,175,285,196,180,160,160,195,167,300,150,185,250,null,200,220,240,200,220,153,188,180,150,130,160,160,160,null,160,130,155,126,null,null,null,null,null,null,null,270,200,180,null,null,null,-1,-1,-1,-1,-1,-1,-1,-1,-1,-1,-1]
[null,null,null,null,null,null,null,null,null,null,null,null,null,null,null,null,null,null,null,null,null,"Randonnée de l'amitié\nHolzgau / AU",null,null,null,null,null,null,null,null,null,null,null,null,null,null,null,null,null,null,null,null,null,null,null,null,null,null,null,null,null,null,null,null,null,null,null,"160 km au lieu de 118 km\nDépart de Villerot",null,null,null,null,null,null,null,"Sous-Total\nFMB",null,"Total FMB",null,null,null,null,null,null,null,null,null,null,null,null,null,null,null,null,null,"Sous-Totaux\nPirates",null,"Total Pirates",null,"TOTAL",null,null,null,"FMB","Hors FMB","Total"]
[1,{"$f":"VLOOKUP(A8,'Numéro licences'!$H$4:$I$47,2)","v":"BALLION Pierre"},"Aller-Retour",null,null,null,null,null,null,null,null,null,null,null,null,null,null,null,null,null,null,null,null,164,null,null,0,null,null,null,null,null,null,null,null,null,null,null,null,null,null,null,null,null,null,null,null,null,null,null,null,null,null,null,null,null,null,null,null,null,null,null,null,null,null,{"$f":"SUM(D8:BM8)","v":164},"Km  renseignés",{"$f":"SUM(BN8+BN9)","v":745},null,null,null,null,null,null,null,null,null,null,null,null,null,null,null,null,null,{"$f":"SUM(BQ8:CG8)","v":0},"Km  renseignés",{"$f":"SUM(CH8+CH9)","v":0},"Km  renseignés",{"$f":"SUM(BP8+CJ8)","v":745},null,1,{"$f":"VLOOKUP(CN8,A8:B188,2)","v":"BALLION Pierre"},{"$f":"SUM(BP8)","v":745},{"$f":"SUM(CJ8)","v":0},{"$f":"SUM(CP8+CQ8)","v":745}]
[null,null,"Ronde",null,null,null,null,null,160,null,null,null,null,null,null,null,null,null,null,null,null,null,null,221,null,null,200,null,null,null,null,null,null,null,null,null,null,null,null,null,null,null,null,null,null,null,null,null,null,null,null,null,null,null,null,null,null,null,null,null,null,null,null,null,null,{"$f":"SUM(D9:BM9)","v":581},"Km confirmés",{"$f":"SUM(D11:BM11)","v":360},null,null,null,null,null,null,null,null,null,null,null,null,null,null,null,null,null,{"$f":"SUM(BQ9:CG9)","v":0},"Km confirmés",{"$f":"SUM(BQ11:CG11)","v":0},"Km confirmés",{"$f":"SUM(CJ9+BP9)","v":360},null,2,{"$f":"VLOOKUP(CN9,A8:B188,2)","v":"BENET Jean-Pol"},{"$f":"SUM(BP12)","v":520},{"$f":"SUM(CJ12)","v":0},{"$f":"SUM(CP9+CQ9)","v":520}]
[null,null,null,0,0,0,0,0,1,0,0,0,0,0,0,0,0,0,0,0,0,0,0,0,0,0,1,0,0,0,0,0,0,0,0,0,0,0,0,0,0,0,0,0,0,0,0,0,0,0,0,0,0,0,0,0,0,0,0,0,0,0,0,0,0,null,"Rondes confirmées",{"$f":"SUM(C10:BM10)","v":2},0,0,0,0,0,0,0,0,0,0,0,0,0,0,0,0,0,null,"Rondes confirmées",{"$f":"SUM(BQ10:CH10)","v":0},"Rondes confirmées",{"$f":"SUM(CJ10+BP10)","v":2},null,3,{"$f":"VLOOKUP(CN10,A8:B188,2)","v":"BERDOYES Yannick"},{"$f":"SUM(BP16)","v":385},{"$f":"SUM(CJ16)","v":0},{"$f":"SUM(CP10+CQ10)","v":385}]
[null,null,null,{"$f":"SUM((D8+D9)*D10)","v":0},0,0,0,0,160,0,0,0,0,0,0,0,0,0,0,0,0,0,0,0,0,0,200,0,0,0,0,0,0,0,0,0,0,0,0,0,0,0,0,0,0,0,0,0,0,0,0,0,0,0,0,0,0,0,0,0,0,{"$f":"SUM((BJ8+BJ9)*BJ10)","v":0},{"$f":"SUM((BK8+BK9)*BK10)","v":0},{"$f":"SUM((BL8+BL9)*BL10)","v":0},{"$f":"SUM((BM8+BM9)*BM10)","v":0},null,"Rondes effectuées",{"$f":"COUNTIF(D8:BM8,\">0\")","v":1},{"$f":"SUM((BQ8+BQ9)*BQ10)","v":0},0,0,0,0,0,0,0,0,0,0,0,0,0,0,0,0,null,"Rondes Effectuées",{"$f":"COUNTIF(BQ8:CG8,\">0\")","v":0},"Rondes effectuées",{"$f":"SUM(CJ11+BP11)","v":1},null,4,{"$f":"VLOOKUP(CN11,A8:B188,2)","v":"BRUNEAU Denis-Claude"},{"$f":"SUM(BP20)","v":200},{"$f":"SUM(CJ20)","v":0},200]
[2,{"$f":"VLOOKUP(A12,'Numéro licences'!$H$4:$I$47,2)","v":"BENET Jean-Pol"},"Aller-Retour",null,null,160,null,null,null,null,null,null,null,null,null,null,null,null,null,null,null,null,20,null,null,null,null,null,null,null,null,null,null,null,null,null,null,null,null,null,null,null,null,null,null,null,null,null,null,null,null,null,null,null,null,null,null,null,null,null,null,null,null,null,null,{"$f":"SUM(D12:BM12)","v":180},"Km  renseignés",{"$f":"SUM(BN12+BN13)","v":520},null,null,null,null,null,null,null,null,null,null,null,null,null,null,null,null,null,{"$f":"SUM(BQ12:CG12)","v":0},"Km  renseignés",{"$f":"SUM(CH12+CH13)","v":0},"Km  renseignés",{"$f":"SUM(BP12+CJ12)","v":520},null,5,{"$f":"VLOOKUP(CN12,A8:B188,2)","v":"DAVIN Philippe"},{"$f":"SUM(BP24)","v":2533},{"$f":"SUM(CJ24)","v":0},2533]
[null,null,"Ronde",null,null,140,null,null,null,null,null,null,null,null,null,null,null,null,null,null,null,null,200,null,null,null,null,null,null,null,null,null,null,null,null,null,null,null,null,null,null,null,null,null,null,null,null,null,null,null,null,null,null,null,null,null,null,null,null,null,null,null,null,null,null,{"$f":"SUM(D13:BM13)","v":340},"Km confirmés",{"$f":"SUM(D15:BM15)","v":0},null,null,null,null,null,null,null,null,null,null,null,null,null,null,null,null,null,{"$f":"SUM(BQ13:CG13)","v":0},"Km confirmés",{"$f":"SUM(BQ15:CG15)","v":0},"Km confirmés",{"$f":"SUM(CJ13+BP13)","v":0},null,6,{"$f":"VLOOKUP(CN13,A8:B188,2)","v":"DESCAMPS Geoffrey"},{"$f":"SUM(BP28)","v":200},{"$f":"SUM(CJ28)","v":0},200]
[null,null,null,0,0,0,0,0,0,0,0,0,0,0,0,0,0,0,0,0,0,0,0,0,0,0,0,0,0,0,0,0,0,0,0,0,0,0,0,0,0,0,0,0,0,0,0,0,0,0,0,0,0,0,0,0,0,0,0,0,0,0,0,0,0,null,"Rondes confirmées",{"$f":"SUM(C14:BM14)","v":0},0,0,0,0,0,0,0,0,0,0,0,0,0,0,0,0,0,null,"Rondes confirmées",{"$f":"SUM(BQ14:CH14)","v":0},"Rondes confirmées",{"$f":"SUM(CJ14+BP14)","v":0},null,7,{"$f":"VLOOKUP(CN14,A8:B188,2)","v":"DESMAREE Francis"},{"$f":"SUM(BP32)","v":20260},{"$f":"SUM(CJ32)","v":0},20260]
[null,null,null,{"$f":"SUM((D12+D13)*D14)","v":0},0,0,0,0,0,0,0,0,0,0,0,0,0,0,0,0,0,0,0,0,0,0,0,0,0,0,0,0,0,0,0,0,0,0,0,0,0,0,0,0,0,0,0,0,0,0,0,0,0,0,0,0,0,0,0,0,0,{"$f":"SUM((BJ12+BJ13)*BJ14)","v":0},{"$f":"SUM((BK12+BK13)*BK14)","v":0},{"$f":"SUM((BL12+BL13)*BL14)","v":0},{"$f":"SUM((BM12+BM13)*BM14)","v":0},null,"Rondes effectuées",{"$f":"COUNTIF(D12:BM12,\">0\")","v":2},{"$f":"SUM((BQ12+BQ13)*BQ14)","v":0},0,0,0,0,0,0,0,0,0,0,0,0,0,0,0,0,null,"Rondes Effectuées",{"$f":"COUNTIF(BQ12:CG12,\">0\")","v":0},"Rondes effectuées",{"$f":"SUM(CJ15+BP15)","v":2},null,8,{"$f":"VLOOKUP(CN15,A8:B188,2)","v":"DEWAERSEGHERS Francis"},{"$f":"SUM(BP36)","v":1831},{"$f":"SUM(CJ36)","v":0},1831]
[3,{"$f":"VLOOKUP(A16,'Numéro licences'!$H$4:$I$47,2)","v":"BERDOYES Yannick"},"Aller-Retour",null,null,null,null,null,null,null,null,null,null,null,null,null,null,null,null,null,null,null,null,164,null,null,null,null,null,null,null,null,null,null,null,null,null,null,null,null,null,null,null,null,null,null,null,null,null,null,null,null,null,null,null,null,null,null,null,null,null,null,null,null,null,{"$f":"SUM(D16:BM16)","v":164},"Km  renseignés",{"$f":"SUM(BN16+BN17)","v":385},null,null,null,null,null,null,null,null,null,null,null,null,null,null,null,null,null,{"$f":"SUM(BQ16:CG16)","v":0},"Km  renseignés",{"$f":"SUM(CH16+CH17)","v":0},"Km  renseignés",{"$f":"SUM(BP16+CJ16)","v":385},null,9,{"$f":"VLOOKUP(CN16,A8:B188,2)","v":"DHONDT Jerry"},{"$f":"SUM(BP40)","v":1429},{"$f":"SUM(CJ40)","v":0},1429]
[null,null,"Ronde",null,null,null,null,null,null,null,null,null,null,null,null,null,null,null,null,null,null,null,null,221,null,null,null,null,null,null,null,null,null,null,null,null,null,null,null,null,null,null,null,null,null,null,null,null,null,null,null,null,null,null,null,null,null,null,null,null,null,null,null,null,null,{"$f":"SUM(D17:BM17)","v":221},"Km confirmés",{"$f":"SUM(D19:BM19)","v":0},null,null,null,null,null,null,null,null,null,null,null,null,null,null,null,null,null,{"$f":"SUM(BQ17:CG17)","v":0},"Km confirmés",{"$f":"SUM(BQ19:CG19)","v":0},"Km confirmés",{"$f":"SUM(CJ17+BP17)","v":0},null,10,{"$f":"VLOOKUP(CN17,A8:B188,2)","v":"DONY Marc"},{"$f":"SUM(BP44)","v":4923},{"$f":"SUM(CJ44)","v":0},4923]
[null,null,null,0,0,0,0,0,0,0,0,0,0,0,0,0,0,0,0,0,0,0,0,0,0,0,0,0,0,0,0,0,0,0,0,0,0,0,0,0,0,0,0,0,0,0,0,0,0,0,0,0,0,0,0,0,0,0,0,0,0,0,0,0,0,null,"Rondes confirmées",{"$f":"SUM(C18:BM18)","v":0},0,0,0,0,0,0,0,0,0,0,0,0,0,0,0,0,0,null,"Rondes confirmées",{"$f":"SUM(BQ18:CH18)","v":0},"Rondes confirmées",{"$f":"SUM(CJ18+BP18)","v":0},null,11,{"$f":"VLOOKUP(CN18,A8:B188,2)","v":"FAVRESSSE René"},{"$f":"SUM(BP48)","v":4194},{"$f":"SUM(CJ48)","v":305},4499]
[null,null,null,{"$f":"SUM((D16+D17)*D18)","v":0},0,0,0,0,0,0,0,0,0,0,0,0,0,0,0,0,0,0,0,0,0,0,0,0,0,0,0,0,0,0,0,0,0,0,0,0,0,0,0,0,0,0,0,0,0,0,0,0,0,0,0,0,0,0,0,0,0,{"$f":"SUM((BJ16+BJ17)*BJ18)","v":0},{"$f":"SUM((BK16+BK17)*BK18)","v":0},{"$f":"SUM((BL16+BL17)*BL18)","v":0},{"$f":"SUM((BM16+BM17)*BM18)","v":0},null,"Rondes effectuées",{"$f":"COUNTIF(D16:BM16,\">0\")","v":1},{"$f":"SUM((BQ16+BQ17)*BQ18)","v":0},0,0,0,0,0,0,0,0,0,0,0,0,0,0,0,0,null,"Rondes Effectuées",{"$f":"COUNTIF(BQ16:CG16,\">0\")","v":0},"Rondes effectuées",{"$f":"SUM(CJ19+BP19)","v":1},null,12,{"$f":"VLOOKUP(CN19,A8:B188,2)","v":"GOFFIN Amaury"},{"$f":"SUM(BP52)","v":0},{"$f":"SUM(CJ52)","v":0},0]
[4,{"$f":"VLOOKUP(A20,'Numéro licences'!$H$4:$I$47,2)","v":"BRUNEAU Denis-Claude"},"Aller-Retour",null,null,null,null,null,null,null,null,null,null,null,null,null,null,null,null,null,null,null,null,null,null,null,0,null,null,null,null,null,null,null,null,null,null,null,null,null,null,null,null,null,null,null,null,null,null,null,null,null,null,null,null,null,null,null,null,null,null,null,null,null,null,{"$f":"SUM(D20:BM20)","v":0},"Km  renseignés",{"$f":"SUM(BN20:BN21)","v":200},null,null,null,null,null,null,null,null,null,null,null,null,null,null,null,null,null,{"$f":"SUM(BQ20:CG20)","v":0},"Km  renseignés",{"$f":"SUM(CH20+CH21)","v":0},"Km  renseignés",{"$f":"SUM(BP20+CJ20)","v":200},null,13,{"$f":"VLOOKUP(CN20,A8:B188,2)","v":"HINYOT Thierry"},{"$f":"SUM(BP56)","v":3197},{"$f":"SUM(CJ56)","v":0},3197]
[null,null,"Ronde",null,null,null,null,null,null,null,null,null,null,null,null,null,null,null,null,null,null,null,null,null,null,null,200,null,null,null,null,null,null,null,null,null,null,null,null,null,null,null,null,null,null,null,null,null,null,null,null,null,null,null,null,null,null,null,null,null,null,null,null,null,null,{"$f":"SUM(D21:BM21)","v":200},"Km confirmés",{"$f":"SUM(D23:BM23)","v":200},null,null,null,null,null,null,null,null,null,null,null,null,null,null,null,null,null,{"$f":"SUM(BQ21:CG21)","v":0},"Km confirmés",{"$f":"SUM(BQ23:CG23)","v":0},"Km confirmés",{"$f":"SUM(CJ21+BP21)","v":200},null,14,{"$f":"VLOOKUP(CN21,A8:B188,2)","v":"JAMOTTE Jean"},{"$f":"SUM(BP60)","v":15472},{"$f":"SUM(CJ60)","v":0},15472]
[null,null,null,0,0,0,0,0,0,0,0,0,0,0,0,0,0,0,0,0,0,0,0,0,0,0,1,0,0,0,0,0,0,0,0,0,0,0,0,0,0,0,0,0,0,0,0,0,0,0,0,0,0,0,0,0,0,0,0,0,0,0,0,0,0,null,"Rondes confirmées",{"$f":"SUM(C22:BM22)","v":1},0,0,0,0,0,0,0,0,0,0,0,0,0,0,0,0,0,null,"Rondes confirmées",{"$f":"SUM(BQ22:CH22)","v":0},"Rondes confirmées",{"$f":"SUM(CJ22+BP22)","v":1},null,15,{"$f":"VLOOKUP(CN22,A8:B188,2)","v":"LAMBOTTE Didier"},{"$f":"SUM(BP64)","v":0},{"$f":"SUM(CJ64)","v":0},0]
[null,null,null,{"$f":"SUM((D20+D21)*D22)","v":0},0,0,0,0,0,0,0,0,0,0,0,0,0,0,0,0,0,0,0,0,0,0,200,0,0,0,0,0,0,0,0,0,0,0,0,0,0,0,0,0,0,0,0,0,0,0,0,0,0,0,0,0,0,0,0,0,0,{"$f":"SUM((BJ20+BJ21)*BJ22)","v":0},{"$f":"SUM((BK20+BK21)*BK22)","v":0},{"$f":"SUM((BL20+BL21)*BL22)","v":0},{"$f":"SUM((BM20+BM21)*BM22)","v":0},null,"Rondes effectuées",{"$f":"COUNTIF(D20:BM20,\">0\")","v":0},{"$f":"SUM((BQ20+BQ21)*BQ22)","v":0},0,0,0,0,0,0,0,0,0,0,0,0,0,0,0,0,null,"Rondes Effectuées",{"$f":"COUNTIF(BQ20:CG20,\">0\")","v":0},"Rondes effectuées",{"$f":"SUM(CJ23+BP23)","v":0},null,16,{"$f":"VLOOKUP(CN23,A8:B188,2)","v":"LESCAL Thierry"},{"$f":"SUM(BP68)","v":10370},{"$f":"SUM(CJ68)","v":0},10370]
[5,{"$f":"VLOOKUP(A24,'Numéro licences'!$H$4:$I$47,2)","v":"DAVIN Philippe"},"Aller-Retour",null,null,null,null,null,null,null,null,20,44,null,174,null,null,null,null,null,284,null,null,null,null,null,0,null,null,null,null,null,null,null,null,null,null,null,null,null,null,null,null,210,null,44,null,68,null,null,null,null,null,null,null,280,null,null,null,null,18,null,null,null,null,{"$f":"SUM(D24:BM24)","v":1142},"Km  renseignés",{"$f":"SUM(BN24:BN25)","v":2533},null,null,null,null,null,null,null,null,null,null,null,null,null,null,null,null,null,{"$f":"SUM(BQ24:CG24)","v":0},"Km  renseignés",{"$f":"SUM(CH24+CH25)","v":0},"Km  renseignés",{"$f":"SUM(BP24+CJ24)","v":2533},null,17,{"$f":"VLOOKUP(CN24,A8:B188,2)","v":"MALLIEN Philippe"},{"$f":"SUM(BP72)","v":624},{"$f":"SUM(CJ72)","v":0},624]
[null,null,"Ronde",null,null,null,null,null,160,null,null,0,160,null,175,null,null,null,null,null,190,null,null,null,null,null,200,null,null,null,null,null,null,null,null,null,null,null,null,null,null,null,null,0,null,0,null,220,null,null,null,null,null,null,null,160,null,null,null,null,126,null,null,null,null,{"$f":"SUM(D25:BM25)","v":1391},"Km confirmés",{"$f":"SUM(D27:BM27)","v":2533},null,null,null,null,null,null,null,null,null,null,null,null,null,null,null,null,null,{"$f":"SUM(BQ25:CG25)","v":0},"Km confirmés",{"$f":"SUM(BQ27:CG27)","v":0},"Km confirmés",{"$f":"SUM(CJ25+BP25)","v":2533},null,18,{"$f":"VLOOKUP(CN25,A8:B188,2)","v":"MANZANO Pascal"},{"$f":"SUM(BP76)","v":8123},{"$f":"SUM(CJ76)","v":310},8433]
[null,null,null,0,0,0,0,0,1,0,0,1,1,0,1,0,0,0,0,0,1,0,0,0,0,0,1,0,0,0,0,0,0,0,0,0,0,0,0,0,0,0,0,1,0,1,0,1,0,0,0,0,0,0,0,1,0,0,0,0,1,0,0,0,0,null,"Rondes confirmées",{"$f":"SUM(C26:BM26)","v":11},0,0,0,0,0,0,0,0,0,0,0,0,0,0,0,0,0,null,"Rondes confirmées",{"$f":"SUM(BQ26:CH26)","v":0},"Rondes confirmées",{"$f":"SUM(CJ26+BP26)","v":11},null,19,{"$f":"VLOOKUP(CN26,A8:B188,2)","v":"MARIEL Didier"},{"$f":"SUM(BP80)","v":1859},{"$f":"SUM(CJ80)","v":0},1859]
[null,null,null,{"$f":"SUM((D24+D25)*D26)","v":0},0,0,0,0,160,0,0,20,204,0,349,0,0,0,0,0,474,0,0,0,0,0,200,0,0,0,0,0,0,0,0,0,0,0,0,0,0,0,0,210,0,44,0,288,0,0,0,0,0,0,0,440,0,0,0,0,144,{"$f":"SUM((BJ24+BJ25)*BJ26)","v":0},{"$f":"SUM((BK24+BK25)*BK26)","v":0},{"$f":"SUM((BL24+BL25)*BL26)","v":0},{"$f":"SUM((BM24+BM25)*BM26)","v":0},null,"Rondes effectuées",{"$f":"COUNTIF(D24:BM24,\">0\")","v":9},{"$f":"SUM((BQ24+BQ25)*BQ26)","v":0},0,0,0,0,0,0,0,0,0,0,0,0,0,0,0,0,null,"Rondes Effectuées",{"$f":"COUNTIF(BQ24:CG24,\">0\")","v":0},"Rondes effectuées",{"$f":"SUM(CJ27+BP27)","v":9},null,20,{"$f":"VLOOKUP(CN27,A8:B188,2)","v":"MILET Benoit"},{"$f":"SUM(BP84)","v":504},{"$f":"SUM(CJ84)","v":0},504]
[6,{"$f":"VLOOKUP(A28,'Numéro licences'!$H$4:$I$47,2)","v":"DESCAMPS Geoffrey"},"Aller-Retour",null,null,null,null,null,null,null,null,null,null,null,null,null,null,null,null,null,null,null,null,null,null,null,0,null,null,null,null,null,null,null,null,null,null,null,null,null,null,null,null,null,null,null,null,null,null,null,null,null,null,null,null,null,null,null,null,null,null,null,null,null,null,{"$f":"SUM(D28:BM28)","v":0},"Km  renseignés",{"$f":"SUM(BN28:BN29)","v":200},null,null,null,null,null,null,null,null,null,null,null,null,null,null,null,null,null,{"$f":"SUM(BQ28:CG28)","v":0},"Km  renseignés",{"$f":"SUM(CH28+CH29)","v":0},"Km  renseignés",{"$f":"SUM(BP28+CJ28)","v":200},null,21,{"$f":"VLOOKUP(CN28,A8:B188,2)","v":"NIHOUL Dany"},{"$f":"SUM(BP88)","v":6312},{"$f":"SUM(CJ88)","v":0},6312]
[null,null,"Ronde",null,null,null,null,null,null,null,null,null,null,null,null,null,null,null,null,null,null,null,null,null,null,null,200,null,null,null,null,null,null,null,null,null,null,null,null,null,null,null,null,null,null,null,null,null,null,null,null,null,null,null,null,null,null,null,null,null,null,null,null,null,null,{"$f":"SUM(D29:BM29)","v":200},"Km confirmés",{"$f":"SUM(D31:BM31)","v":200},null,null,null,null,null,null,null,null,null,null,null,null,null,null,null,null,null,{"$f":"SUM(BQ29:CG29)","v":0},"Km confirmés",{"$f":"SUM(BQ31:CG31)","v":0},"Km confirmés",{"$f":"SUM(CJ29+BP29)","v":200},null,22,{"$f":"VLOOKUP(CN29,A8:B188,2)","v":"PARMENTIER Dominique"},{"$f":"SUM(BP92)","v":728},{"$f":"SUM(CJ92)","v":0},728]
[null,null,null,0,0,0,0,0,0,0,0,0,0,0,0,0,0,0,0,0,0,0,0,0,0,0,1,0,0,0,0,0,0,0,0,0,0,0,0,0,0,0,0,0,0,0,0,0,0,0,0,0,0,0,0,0,0,0,0,0,0,0,0,0,0,null,"Rondes confirmées",{"$f":"SUM(C30:BM30)","v":1},0,0,0,0,0,0,0,0,0,0,0,0,0,0,0,0,0,null,"Rondes confirmées",{"$f":"SUM(BQ30:CH30)","v":0},"Rondes confirmées",{"$f":"SUM(CJ30+BP30)","v":1},null,23,{"$f":"VLOOKUP(CN30,A8:B188,2)","v":"RAMEAU Didier"},{"$f":"SUM(BP96)","v":3956},{"$f":"SUM(CJ96)","v":0},3956]
[null,null,null,{"$f":"SUM((D28+D29)*D30)","v":0},0,0,0,0,0,0,0,0,0,0,0,0,0,0,0,0,0,0,0,0,0,0,200,0,0,0,0,0,0,0,0,0,0,0,0,0,0,0,0,0,0,0,0,0,0,0,0,0,0,0,0,0,0,0,0,0,0,{"$f":"SUM((BJ28+BJ29)*BJ30)","v":0},{"$f":"SUM((BK28+BK29)*BK30)","v":0},{"$f":"SUM((BL28+BL29)*BL30)","v":0},{"$f":"SUM((BM28+BM29)*BM30)","v":0},null,"Rondes effectuées",{"$f":"COUNTIF(D28:BM28,\">0\")","v":0},{"$f":"SUM((BQ28+BQ29)*BQ30)","v":0},0,0,0,0,0,0,0,0,0,0,0,0,0,0,0,0,null,"Rondes Effectuées",{"$f":"COUNTIF(BQ28:CG28,\">0\")","v":0},"Rondes effectuées",{"$f":"SUM(CJ31+BP31)","v":0},null,24,{"$f":"VLOOKUP(CN31,A8:B188,2)","v":"SMEETS Carine"},{"$f":"SUM(BP100)","v":160},{"$f":"SUM(CJ100)","v":0},160]
[7,{"$f":"VLOOKUP(A32,'Numéro licences'!$H$4:$I$47,2)","v":"DESMAREE Francis"},"Aller-Retour",394,186,160,266,310,null,338,204,20,44,34,174,18,268,156,118,254,284,1467,20,164,38,132,0,260,204,86,160,204,68,186,332,118,18,34,374,266,156,204,null,210,394,44,204,68,376,86,224,186,338,254,210,280,null,160,164,118,18,null,null,null,null,{"$f":"SUM(D32:BM32)","v":11053},"Km  renseignés",{"$f":"SUM(BN32:BN33)","v":20260},null,null,null,null,null,null,null,null,null,null,null,null,null,null,null,null,null,{"$f":"SUM(BQ32:CG32)","v":0},"Km  renseignés",{"$f":"SUM(CH32+CH33)","v":0},"Km  renseignés",{"$f":"SUM(BP32+CJ32)","v":20260},null,25,{"$f":"VLOOKUP(CN32,A8:B188,2)","v":"STRYPSTEIN Nicolas"},{"$f":"SUM(BP104)","v":200},{"$f":"SUM(CJ104)","v":0},200]
[null,null,"Ronde",130,150,140,130,0,160,150,134,173,160,160,175,180,179,146,170,0,190,0,200,221,803,175,200,0,150,216,175,0,196,180,160,160,195,167,300,150,0,250,null,200,220,240,200,220,153,188,180,0,130,160,160,160,null,160,130,155,126,null,null,null,null,{"$f":"SUM(D33:BM33)","v":9207},"Km confirmés",{"$f":"SUM(D35:BM35)","v":20260},null,null,null,null,null,null,null,null,null,null,null,null,null,null,null,null,null,{"$f":"SUM(BQ33:CG33)","v":0},"Km confirmés",{"$f":"SUM(BQ35:CG35)","v":0},"Km confirmés",{"$f":"SUM(CJ33+BP33)","v":20260},null,26,{"$f":"VLOOKUP(CN33,A8:B188,2)","v":"URBAIN Philippe"},{"$f":"SUM(BP108)","v":0},{"$f":"SUM(CJ108)","v":0},0]
[null,null,null,1,1,1,1,1,1,1,1,1,1,1,1,1,1,1,1,1,1,1,1,1,1,1,1,1,1,1,1,1,1,1,1,1,1,1,1,1,1,1,0,1,1,1,1,1,1,1,1,1,1,1,1,1,0,1,1,1,1,0,0,0,0,null,"Rondes confirmées",{"$f":"SUM(C34:BM34)","v":56},0,0,0,0,0,0,0,0,0,0,0,0,0,0,0,0,0,null,"Rondes confirmées",{"$f":"SUM(BQ34:CH34)","v":0},"Rondes confirmées",{"$f":"SUM(CJ34+BP34)","v":56},null,27,{"$f":"VLOOKUP(CN34,A8:B188,2)","v":"VANBELLINGEN Jean-Claude"},{"$f":"SUM(BP112)","v":4150},{"$f":"SUM(CJ112)","v":0},4150]
[null,null,null,{"$f":"SUM((D32+D33)*D34)","v":524},336,300,396,310,160,488,338,193,204,194,349,198,447,302,288,254,474,1467,220,385,841,307,200,260,354,302,335,204,264,366,492,278,213,201,674,416,156,454,0,410,614,284,404,288,529,274,404,186,468,414,370,440,0,320,294,273,144,{"$f":"SUM((BJ32+BJ33)*BJ34)","v":0},{"$f":"SUM((BK32+BK33)*BK34)","v":0},{"$f":"SUM((BL32+BL33)*BL34)","v":0},{"$f":"SUM((BM32+BM33)*BM34)","v":0},null,"Rondes effectuées",{"$f":"COUNTIF(D32:BM32,\">0\")","v":54},{"$f":"SUM((BQ32+BQ33)*BQ34)","v":0},0,0,0,0,0,0,0,0,0,0,0,0,0,0,0,0,null,"Rondes Effectuées",{"$f":"COUNTIF(BQ32:CG32,\">0\")","v":0},"Rondes effectuées",{"$f":"SUM(CJ35+BP35)","v":54},null,28,{"$f":"VLOOKUP(CN35,A8:B188,2)","v":"VAN DER BEETEN Pascal"},{"$f":"SUM(BP116)","v":9522},{"$f":"SUM(CJ116)","v":644},10166]
[8,{"$f":"VLOOKUP(A36,'Numéro licences'!$H$4:$I$47,2)","v":"DEWAERSEGHERS Francis"},"Aller-Retour",null,null,null,null,null,null,null,null,null,null,null,null,null,null,null,null,null,null,null,null,164,38,null,null,null,null,86,null,null,68,null,null,118,null,null,null,null,null,null,null,null,null,null,null,68,null,null,null,null,null,null,null,null,null,null,null,null,null,null,null,null,null,{"$f":"SUM(D36:BM36)","v":542},"Km  renseignés",{"$f":"SUM(BN36:BN37)","v":1831},null,null,null,null,null,null,null,null,null,null,null,null,null,null,null,null,null,{"$f":"SUM(BQ36:CG36)","v":0},"Km  renseignés",{"$f":"SUM(CH36+CH37)","v":0},"Km  renseignés",{"$f":"SUM(BP36+CJ36)","v":1831},null,29,{"$f":"VLOOKUP(CN36,A8:B188,2)","v":"VANSTEYVOORT André"},{"$f":"SUM(BP120)","v":5598},{"$f":"SUM(CJ120)","v":0},5598]
[null,null,"Ronde",null,null,null,null,null,null,null,null,null,null,null,null,null,null,null,null,null,null,null,null,221,492,null,null,null,null,0,null,null,196,null,null,160,null,null,null,null,null,null,null,null,null,null,null,220,null,null,null,null,null,null,null,null,null,null,null,null,null,null,null,null,null,{"$f":"SUM(D37:BM37)","v":1289},"Km confirmés",{"$f":"SUM(D39:BM39)","v":1543},null,null,null,null,null,null,null,null,null,null,null,null,null,null,null,null,null,{"$f":"SUM(BQ37:CG37)","v":0},"Km confirmés",{"$f":"SUM(BQ39:CG39)","v":0},"Km confirmés",{"$f":"SUM(CJ37+BP37)","v":1543},null,30,{"$f":"VLOOKUP(CN37,A8:B188,2)","v":"WOUTERS Olivier"},{"$f":"SUM(BP124)","v":7563},{"$f":"SUM(CJ124)","v":0},7563]
[null,null,null,0,0,0,0,0,0,0,0,0,0,0,0,0,0,0,0,0,0,0,0,1,1,0,0,0,0,1,0,0,1,0,0,1,0,0,0,0,0,0,0,0,0,0,0,0,0,0,0,0,0,0,0,0,0,0,0,0,0,0,0,0,0,null,"Rondes confirmées",{"$f":"SUM(C38:BM38)","v":5},0,0,0,0,0,0,0,0,0,0,0,0,0,0,0,0,0,null,"Rondes confirmées",{"$f":"SUM(BQ38:CH38)","v":0},"Rondes confirmées",{"$f":"SUM(CJ38+BP38)","v":5},null,31,{"$f":"VLOOKUP(CN38,A8:B188,2)","v":"THIRIFAYS Vincent"},{"$f":"SUM(BP128)","v":385},{"$f":"SUM(CJ128)","v":0},385]
[null,null,null,{"$f":"SUM((D36+D37)*D38)","v":0},0,0,0,0,0,0,0,0,0,0,0,0,0,0,0,0,0,0,0,385,530,0,0,0,0,86,0,0,264,0,0,278,0,0,0,0,0,0,0,0,0,0,0,0,0,0,0,0,0,0,0,0,0,0,0,0,0,{"$f":"SUM((BJ36+BJ37)*BJ38)","v":0},{"$f":"SUM((BK36+BK37)*BK38)","v":0},{"$f":"SUM((BL36+BL37)*BL38)","v":0},{"$f":"SUM((BM36+BM37)*BM38)","v":0},null,"Rondes effectuées",{"$f":"COUNTIF(D36:BM36,\">0\")","v":6},{"$f":"SUM((BQ36+BQ37)*BQ38)","v":0},0,0,0,0,0,0,0,0,0,0,0,0,0,0,0,0,null,"Rondes Effectuées",{"$f":"COUNTIF(BQ36:CG36,\">0\")","v":0},"Rondes effectuées",{"$f":"SUM(CJ39+BP39)","v":6},null,32,{"$f":"VLOOKUP(CN39,A8:B188,2)","v":"VANDY Rudi"},{"$f":"SUM(BP132)","v":5164},{"$f":"SUM(CJ132)","v":0},5164]
[9,{"$f":"VLOOKUP(A40,'Numéro licences'!$H$4:$I$47,2)","v":"DHONDT Jerry"},"Aller-Retour",null,null,null,null,null,null,null,204,null,44,null,null,null,null,null,null,null,null,null,null,null,null,132,null,null,null,86,null,null,null,null,null,118,null,null,null,null,null,null,null,null,null,null,null,null,null,null,null,null,null,null,null,null,null,null,null,null,null,null,null,null,null,{"$f":"SUM(D40:BM40)","v":584},"Km  renseignés",{"$f":"SUM(BN40:BN41)","v":1429},null,null,null,null,null,null,null,null,null,null,null,null,null,null,null,null,null,{"$f":"SUM(BQ40:CG40)","v":0},"Km  renseignés",{"$f":"SUM(CH40+CH41)","v":0},"Km  renseignés",{"$f":"SUM(BP40+CJ40)","v":1429},null,33,{"$f":"VLOOKUP(CN40,A8:B188,2)","v":"LEFRANT Sébastien"},{"$f":"SUM(BP136)","v":1457},{"$f":"SUM(CJ136)","v":0},1457]
[null,null,"Ronde",null,null,null,null,null,null,null,134,null,160,null,null,null,null,null,null,null,null,null,null,null,null,175,null,null,null,216,null,null,null,null,null,160,null,null,null,null,null,null,null,null,null,null,null,null,null,null,null,null,null,null,null,null,null,null,null,null,null,null,null,null,null,{"$f":"SUM(D41:BM41)","v":845},"Km confirmés",{"$f":"SUM(D43:BM43)","v":0},null,null,null,null,null,null,null,null,null,null,null,null,null,null,null,null,null,{"$f":"SUM(BQ41:CG41)","v":0},"Km confirmés",{"$f":"SUM(BQ43:CG43)","v":0},"Km confirmés",{"$f":"SUM(CJ41+BP41)","v":0},null,34,{"$f":"VLOOKUP(CN41,A8:B188,2)","v":0},{"$f":"SUM(BP140)","v":0},{"$f":"SUM(CJ140)","v":0},0]
[null,null,null,0,0,0,0,0,0,0,0,0,0,0,0,0,0,0,0,0,0,0,0,0,0,0,0,0,0,0,0,0,0,0,0,0,0,0,0,0,0,0,0,0,0,0,0,0,0,0,0,0,0,0,0,0,0,0,0,0,0,0,0,0,0,null,"Rondes confirmées",{"$f":"SUM(C42:BM42)","v":0},0,0,0,0,0,0,0,0,0,0,0,0,0,0,0,0,0,null,"Rondes confirmées",{"$f":"SUM(BQ42:CH42)","v":0},"Rondes confirmées",{"$f":"SUM(CJ42+BP42)","v":0},null,35,{"$f":"VLOOKUP(CN42,A8:B188,2)","v":0},{"$f":"SUM(BP144)","v":0},{"$f":"SUM(CJ144)","v":0},0]
[null,null,null,{"$f":"SUM((D40+D41)*D42)","v":0},0,0,0,0,0,0,0,0,0,0,0,0,0,0,0,0,0,0,0,0,0,0,0,0,0,0,0,0,0,0,0,0,0,0,0,0,0,0,0,0,0,0,0,0,0,0,0,0,0,0,0,0,0,0,0,0,0,{"$f":"SUM((BJ40+BJ41)*BJ42)","v":0},{"$f":"SUM((BK40+BK41)*BK42)","v":0},{"$f":"SUM((BL40+BL41)*BL42)","v":0},{"$f":"SUM((BM40+BM41)*BM42)","v":0},null,"Rondes effectuées",{"$f":"COUNTIF(D40:BM40,\">0\")","v":5},{"$f":"SUM((BQ40+BQ41)*BQ42)","v":0},0,0,0,0,0,0,0,0,0,0,0,0,0,0,0,0,null,"Rondes Effectuées",{"$f":"COUNTIF(BQ40:CG40,\">0\")","v":0},"Rondes effectuées",{"$f":"SUM(CJ43+BP43)","v":5},null,36,{"$f":"VLOOKUP(CN43,A8:B188,2)","v":0},{"$f":"SUM(BP148)","v":0},{"$f":"SUM(CJ148)","v":0},0]
[10,{"$f":"VLOOKUP(A44,'Numéro licences'!$H$4:$I$47,2)","v":"DONY Marc"},"Aller-Retour",null,null,null,null,null,null,null,204,20,null,34,null,null,268,null,null,null,284,null,null,null,null,132,0,null,null,86,null,null,68,186,null,118,null,null,null,null,null,null,null,210,null,null,204,68,null,null,null,null,null,null,210,null,null,null,null,null,18,null,null,null,null,{"$f":"SUM(D44:BM44)","v":2110},"Km  renseignés",{"$f":"SUM(BN44:BN45)","v":4923},null,null,null,null,null,null,null,null,null,null,null,null,null,null,null,null,null,{"$f":"SUM(BQ44:CG44)","v":0},"Km  renseignés",{"$f":"SUM(CH44+CH45)","v":0},"Km  renseignés",{"$f":"SUM(BP44+CJ44)","v":4923},null,37,{"$f":"VLOOKUP(CN44,A8:B188,2)","v":0},{"$f":"SUM(BP152)","v":0},{"$f":"SUM(CJ152)","v":0},0]
[null,null,"Ronde",null,null,null,null,null,160,null,134,173,null,160,null,null,179,null,null,null,190,null,null,null,null,175,200,null,null,0,null,null,196,180,null,160,null,null,null,null,null,null,null,200,null,null,200,220,null,null,null,null,null,null,160,null,null,null,null,null,126,null,null,null,null,{"$f":"SUM(D45:BM45)","v":2813},"Km confirmés",{"$f":"SUM(D47:BM47)","v":360},null,null,null,null,null,null,null,null,null,null,null,null,null,null,null,null,null,{"$f":"SUM(BQ45:CG45)","v":0},"Km confirmés",{"$f":"SUM(BQ47:CG47)","v":0},"Km confirmés",{"$f":"SUM(CJ45+BP45)","v":360},null,38,{"$f":"VLOOKUP(CN45,A8:B188,2)","v":0},{"$f":"SUM(BP156)","v":0},{"$f":"SUM(CJ156)","v":0},0]
[null,null,null,0,0,0,0,0,1,0,0,0,0,0,0,0,0,0,0,0,0,0,0,0,0,0,1,0,0,0,0,0,0,0,0,0,0,0,0,0,0,0,0,0,0,0,0,0,0,0,0,0,0,0,0,0,0,0,0,0,0,0,0,0,0,null,"Rondes confirmées",{"$f":"SUM(C46:BM46)","v":2},0,0,0,0,0,0,0,0,0,0,0,0,0,0,0,0,0,null,"Rondes confirmées",{"$f":"SUM(BQ46:CH46)","v":0},"Rondes confirmées",{"$f":"SUM(CJ46+BP46)","v":2},null,39,{"$f":"VLOOKUP(CN46,A8:B188,2)","v":0},{"$f":"SUM(BP160)","v":0},{"$f":"SUM(CJ160)","v":0},0]
[null,null,null,{"$f":"SUM((D44+D45)*D46)","v":0},0,0,0,0,160,0,0,0,0,0,0,0,0,0,0,0,0,0,0,0,0,0,200,0,0,0,0,0,0,0,0,0,0,0,0,0,0,0,0,0,0,0,0,0,0,0,0,0,0,0,0,0,0,0,0,0,0,{"$f":"SUM((BJ44+BJ45)*BJ46)","v":0},{"$f":"SUM((BK44+BK45)*BK46)","v":0},{"$f":"SUM((BL44+BL45)*BL46)","v":0},{"$f":"SUM((BM44+BM45)*BM46)","v":0},null,"Rondes effectuées",{"$f":"COUNTIF(D44:BM44,\">0\")","v":15},{"$f":"SUM((BQ44+BQ45)*BQ46)","v":0},0,0,0,0,0,0,0,0,0,0,0,0,0,0,0,0,null,"Rondes Effectuées",{"$f":"COUNTIF(BQ44:CG44,\">0\")","v":0},"Rondes effectuées",{"$f":"SUM(CJ47+BP47)","v":15},null,40,{"$f":"VLOOKUP(CN47,A8:B188,2)","v":0},{"$f":"SUM(BP164)","v":0},{"$f":"SUM(CJ164)","v":0},0]
[11,{"$f":"VLOOKUP(A48,'Numéro licences'!$H$4:$I$47,2)","v":"FAVRESSSE René"},"Aller-Retour",null,null,null,null,null,null,null,null,20,44,null,174,18,268,null,null,null,null,null,20,null,38,null,0,null,null,86,null,null,null,null,null,null,null,null,null,null,null,null,null,210,null,null,null,null,null,null,null,186,null,null,210,null,null,null,null,null,18,null,null,null,null,{"$f":"SUM(D48:BM48)","v":1292},"Km  renseignés",{"$f":"SUM(BN48:BN49)","v":4194},35,null,null,null,null,null,null,null,null,null,null,null,null,null,null,null,null,{"$f":"SUM(BQ48:CG48)","v":35},"Km  renseignés",{"$f":"SUM(CH48+CH49)","v":305},"Km  renseignés",{"$f":"SUM(BP48+CJ48)","v":4499},null,41,{"$f":"VLOOKUP(CN48,A8:B188,2)","v":0},{"$f":"SUM(BP168)","v":0},{"$f":"SUM(CJ168)","v":0},0]
[null,null,"Ronde",null,null,null,null,null,160,null,null,173,160,null,175,0,179,null,null,null,null,null,200,null,803,null,200,null,null,216,null,null,null,null,null,null,null,null,null,null,null,null,null,200,null,null,null,null,null,null,null,150,null,null,160,null,null,null,null,null,126,null,null,null,null,{"$f":"SUM(D49:BM49)","v":2902},"Km confirmés",{"$f":"SUM(D51:BM51)","v":4194},270,null,null,null,null,null,null,null,null,null,null,null,null,null,null,null,null,{"$f":"SUM(BQ49:CG49)","v":270},"Km confirmés",{"$f":"SUM(BQ51:CG51)","v":305},"Km confirmés",{"$f":"SUM(CJ49+BP49)","v":4499},null,42,{"$f":"VLOOKUP(CN49,A8:B188,2)","v":0},{"$f":"SUM(BP172)","v":0},{"$f":"SUM(CJ172)","v":0},0]
[null,null,null,0,0,0,0,0,1,0,0,1,1,0,1,1,1,0,0,0,0,0,1,0,1,0,1,0,0,1,0,0,0,0,0,0,0,0,0,0,0,0,0,1,0,0,0,0,0,0,0,1,0,0,1,0,0,0,0,0,1,0,0,0,0,null,"Rondes confirmées",{"$f":"SUM(C50:BM50)","v":14},1,0,0,0,0,0,0,0,0,0,0,0,0,0,0,0,0,null,"Rondes confirmées",{"$f":"SUM(BQ50:CH50)","v":1},"Rondes confirmées",{"$f":"SUM(CJ50+BP50)","v":15},null,43,{"$f":"VLOOKUP(CN50,A8:B188,2)","v":0},{"$f":"SUM(BP176)","v":0},{"$f":"SUM(CJ176)","v":0},0]
[null,null,null,{"$f":"SUM((D48+D49)*D50)","v":0},0,0,0,0,160,0,0,193,204,0,349,18,447,0,0,0,0,0,220,0,841,0,200,0,0,302,0,0,0,0,0,0,0,0,0,0,0,0,0,410,0,0,0,0,0,0,0,336,0,0,370,0,0,0,0,0,144,{"$f":"SUM((BJ48+BJ49)*BJ50)","v":0},{"$f":"SUM((BK48+BK49)*BK50)","v":0},{"$f":"SUM((BL48+BL49)*BL50)","v":0},{"$f":"SUM((BM48+BM49)*BM50)","v":0},null,"Rondes effectuées",{"$f":"COUNTIF(D48:BM48,\">0\")","v":12},{"$f":"SUM((BQ48+BQ49)*BQ50)","v":305},0,0,0,0,0,0,0,0,0,0,0,0,0,0,0,0,null,"Rondes Effectuées",{"$f":"COUNTIF(BQ48:CG48,\">0\")","v":1},"Rondes effectuées",{"$f":"SUM(CJ51+BP51)","v":13},null,44,{"$f":"VLOOKUP(CN51,A8:B188,2)","v":0},{"$f":"SUM(BP180)","v":0},{"$f":"SUM(CJ180)","v":0},0]
[12,{"$f":"VLOOKUP(A52,'Numéro licences'!$H$4:$I$47,2)","v":"GOFFIN Amaury"},"Aller-Retour",null,null,null,null,null,null,null,null,null,null,null,null,null,null,null,null,null,null,null,null,null,null,null,null,null,null,null,null,null,null,null,null,null,null,null,null,null,null,null,null,null,null,null,null,null,null,null,null,null,null,null,null,null,null,null,null,null,null,null,null,null,null,{"$f":"SUM(D52:BM52)","v":0},"Km  renseignés",{"$f":"SUM(BN52:BN53)","v":0},null,null,null,null,null,null,null,null,null,null,null,null,null,null,null,null,null,{"$f":"SUM(BQ52:CG52)","v":0},"Km  renseignés",{"$f":"SUM(CH52+CH53)","v":0},"Km  renseignés",{"$f":"SUM(BP52+CJ52)","v":0},null,45,{"$f":"VLOOKUP(CN52,A8:B188,2)","v":0},{"$f":"SUM(BP184)","v":0},{"$f":"SUM(CJ184)","v":0},0]
[null,null,"Ronde",null,null,null,null,null,null,null,null,null,null,null,null,null,null,null,null,null,null,null,null,null,null,null,null,null,null,null,null,null,null,null,null,null,null,null,null,null,null,null,null,null,null,null,null,null,null,null,null,null,null,null,null,null,null,null,null,null,null,null,null,null,null,{"$f":"SUM(D53:BM53)","v":0},"Km confirmés",{"$f":"SUM(D55:BM55)","v":0},null,null,null,null,null,null,null,null,null,null,null,null,null,null,null,null,null,{"$f":"SUM(BQ53:CG53)","v":0},"Km confirmés",{"$f":"SUM(BQ55:CG55)","v":0},"Km confirmés",{"$f":"SUM(CJ53+BP53)","v":0},null,46,{"$f":"VLOOKUP(CN53,A8:B188,2)","v":0},{"$f":"SUM(BP188)","v":0},{"$f":"SUM(CJ188)","v":0},0]
[null,null,null,0,0,0,0,0,0,0,0,0,0,0,0,0,0,0,0,0,0,0,0,0,0,0,0,0,0,0,0,0,0,0,0,0,0,0,0,0,0,0,0,0,0,0,0,0,0,0,0,0,0,0,0,0,0,0,0,0,0,0,0,0,0,null,"Rondes confirmées",{"$f":"SUM(C54:BM54)","v":0},0,0,0,0,0,0,0,0,0,0,0,0,0,0,0,0,0,null,"Rondes confirmées",{"$f":"SUM(BQ54:CH54)","v":0},"Rondes confirmées",{"$f":"SUM(CJ54+BP54)","v":0}]
[null,null,null,{"$f":"SUM((D52+D53)*D54)","v":0},0,0,0,0,0,0,0,0,0,0,0,0,0,0,0,0,0,0,0,0,0,0,0,0,0,0,0,0,0,0,0,0,0,0,0,0,0,0,0,0,0,0,0,0,0,0,0,0,0,0,0,0,0,0,0,0,0,{"$f":"SUM((BJ52+BJ53)*BJ54)","v":0},{"$f":"SUM((BK52+BK53)*BK54)","v":0},{"$f":"SUM((BL52+BL53)*BL54)","v":0},{"$f":"SUM((BM52+BM53)*BM54)","v":0},null,"Rondes effectuées",{"$f":"COUNTIF(D52:BM52,\">0\")","v":0},{"$f":"SUM((BQ52+BQ53)*BQ54)","v":0},0,0,0,0,0,0,0,0,0,0,0,0,0,0,0,0,null,"Rondes Effectuées",{"$f":"COUNTIF(BQ52:CG52,\">0\")","v":0},"Rondes effectuées",{"$f":"SUM(CJ55+BP55)","v":0}]
[13,{"$f":"VLOOKUP(A56,'Numéro licences'!$H$4:$I$47,2)","v":"HINYOT Thierry"},"Aller-Retour",null,null,null,null,null,null,null,null,20,44,34,null,null,null,156,null,null,null,null,null,164,null,null,null,null,null,null,null,null,null,null,null,118,18,null,null,null,null,null,null,210,null,null,null,null,null,86,null,null,null,null,null,280,null,null,null,null,18,null,null,null,null,{"$f":"SUM(D56:BM56)","v":1148},"Km  renseignés",{"$f":"SUM(BN56:BN57)","v":3197},null,null,null,null,null,null,null,null,null,null,null,null,null,null,null,null,null,{"$f":"SUM(BQ56:CG56)","v":0},"Km  renseignés",{"$f":"SUM(CH56+CH57)","v":0},"Km  renseignés",{"$f":"SUM(BP56+CJ56)","v":3197}]
[null,null,"Ronde",null,null,null,null,null,160,null,null,173,160,160,null,null,null,146,null,null,null,null,null,221,null,null,null,null,null,null,null,null,null,null,null,160,195,null,null,null,null,null,null,200,null,null,null,null,null,188,null,null,null,null,null,160,null,null,null,null,126,null,null,null,null,{"$f":"SUM(D57:BM57)","v":2049},"Km confirmés",{"$f":"SUM(D59:BM59)","v":3197},null,null,null,null,null,null,null,null,null,null,null,null,null,null,null,null,null,{"$f":"SUM(BQ57:CG57)","v":0},"Km confirmés",{"$f":"SUM(BQ59:CG59)","v":0},"Km confirmés",{"$f":"SUM(CJ57+BP57)","v":3197}]
[null,null,null,0,0,0,0,0,1,0,0,1,1,1,0,0,0,1,0,0,0,0,0,1,0,0,0,0,0,0,0,0,0,0,0,1,1,0,0,0,0,0,0,1,0,0,0,0,0,1,0,0,0,0,0,1,0,0,0,0,1,0,0,0,0,null,"Rondes confirmées",{"$f":"SUM(C58:BM58)","v":12},0,0,0,0,0,0,0,0,0,0,0,0,0,0,0,0,0,null,"Rondes confirmées",{"$f":"SUM(BQ58:CH58)","v":0},"Rondes confirmées",{"$f":"SUM(CJ58+BP58)","v":12}]
[null,null,null,{"$f":"SUM((D56+D57)*D58)","v":0},0,0,0,0,160,0,0,193,204,194,0,0,0,302,0,0,0,0,0,385,0,0,0,0,0,0,0,0,0,0,0,278,213,0,0,0,0,0,0,410,0,0,0,0,0,274,0,0,0,0,0,440,0,0,0,0,144,{"$f":"SUM((BJ56+BJ57)*BJ58)","v":0},{"$f":"SUM((BK56+BK57)*BK58)","v":0},{"$f":"SUM((BL56+BL57)*BL58)","v":0},{"$f":"SUM((BM56+BM57)*BM58)","v":0},null,"Rondes effectuées",{"$f":"COUNTIF(D56:BM56,\">0\")","v":11},{"$f":"SUM((BQ56+BQ57)*BQ58)","v":0},0,0,0,0,0,0,0,0,0,0,0,0,0,0,0,0,null,"Rondes Effectuées",{"$f":"COUNTIF(BQ56:CG56,\">0\")","v":0},"Rondes effectuées",{"$f":"SUM(CJ59+BP59)","v":11},null,null,null,{"$f":"SUM(CP9:CP53)","v":121819},{"$f":"SUM(CQ9:CQ53)","v":1259},{"$f":"SUM(CR8:CR53)","v":123823}]
[14,{"$f":"VLOOKUP(A60,'Numéro licences'!$H$4:$I$47,2)","v":"JAMOTTE Jean"},"Aller-Retour",394,186,160,266,null,null,338,204,20,44,34,174,18,268,156,118,null,284,1455,20,164,38,132,0,null,204,86,null,null,68,186,null,118,18,34,null,266,null,204,null,210,null,null,204,68,null,null,224,null,338,254,210,280,null,160,164,118,18,null,null,null,null,{"$f":"SUM(D60:BM60)","v":7905},"Km  renseignés",{"$f":"SUM(BN60:BN61)","v":15472},null,null,null,null,null,null,null,null,null,null,null,null,null,null,null,null,null,0,"Km  renseignés",{"$f":"SUM(CH60+CH61)","v":0},"Km  renseignés",{"$f":"SUM(BP60+CJ60)","v":15472},null,null,null,{"$f":"SUM(CP59/CR59)","v":0.9838156077626935},{"$f":"SUM(CQ59/CR59)","v":1.0167739434515396E-2}]
[null,null,"Ronde",130,150,140,130,null,160,150,134,173,160,160,175,180,179,146,170,null,190,212,0,221,803,175,200,null,150,0,null,null,196,180,null,160,195,167,null,150,null,250,null,200,null,null,200,220,null,null,180,null,130,160,160,160,null,160,130,155,126,null,null,null,null,{"$f":"SUM(D61:BM61)","v":7567},"Km confirmés",{"$f":"SUM(D63:BM63)","v":15472},null,null,null,null,null,null,null,null,null,null,null,null,null,null,null,null,null,0,"Km confirmés",{"$f":"SUM(BQ63:CG63)","v":0},"Km confirmés",{"$f":"SUM(CJ61+BP61)","v":15472},null,null,null,"FMB","Hors FMB"]
[null,null,null,1,1,1,1,0,1,1,1,1,1,1,1,1,1,1,1,0,1,1,1,1,1,1,1,0,1,1,0,0,1,1,0,1,1,1,0,1,0,1,0,1,0,0,1,1,0,0,1,0,1,1,1,1,0,1,1,1,1,0,0,0,0,null,"Rondes confirmées",{"$f":"SUM(C62:BM62)","v":43},0,0,0,0,0,0,0,0,0,0,0,0,0,0,0,0,0,null,"Rondes confirmées",{"$f":"SUM(BQ62:CH62)","v":0},"Rondes confirmées",{"$f":"SUM(CJ62+BP62)","v":43}]
[null,null,null,{"$f":"SUM((D60+D61)*D62)","v":524},336,300,396,0,160,488,338,193,204,194,349,198,447,302,288,0,474,1667,20,385,841,307,200,0,354,86,0,0,264,366,0,278,213,201,0,416,0,454,0,410,0,0,404,288,0,0,404,0,468,414,370,440,0,320,294,273,144,{"$f":"SUM((BJ60+BJ61)*BJ62)","v":0},{"$f":"SUM((BK60+BK61)*BK62)","v":0},{"$f":"SUM((BL60+BL61)*BL62)","v":0},{"$f":"SUM((BM60+BM61)*BM62)","v":0},null,"Rondes effectuées",{"$f":"COUNTIF(D60:BM60,\">0\")","v":41},{"$f":"SUM((BQ60+BQ61)*BQ62)","v":0},0,0,0,0,0,0,0,0,0,0,0,0,0,0,0,0,null,"Rondes Effectuées",{"$f":"COUNTIF(BQ60:CG60,\">0\")","v":0},"Rondes effectuées",{"$f":"SUM(CJ63+BP63)","v":41}]
[15,{"$f":"VLOOKUP(A64,'Numéro licences'!$H$4:$I$47,2)","v":"LAMBOTTE Didier"},"Aller-Retour",null,null,null,null,null,null,null,null,null,null,null,null,null,null,null,null,null,null,null,null,null,null,null,null,null,null,null,null,null,null,null,null,null,null,null,null,null,null,null,null,null,null,null,null,null,null,null,null,null,null,null,null,null,null,null,null,null,null,null,null,null,null,{"$f":"SUM(D64:BM64)","v":0},"Km  renseignés",{"$f":"SUM(BN64:BN65)","v":0},null,null,null,null,null,null,null,null,null,null,null,null,null,null,null,null,null,{"$f":"SUM(BQ64:CG64)","v":0},"Km  renseignés",{"$f":"SUM(CH64+CH65)","v":0},"Km  renseignés",{"$f":"SUM(BP64+CJ64)","v":0}]
[null,null,"Ronde",null,null,null,null,null,null,null,null,null,null,null,null,null,null,null,null,null,null,null,null,null,null,null,null,null,null,null,null,null,null,null,null,null,null,null,null,null,null,null,null,null,null,null,null,null,null,null,null,null,null,null,null,null,null,null,null,null,null,null,null,null,null,{"$f":"SUM(D65:BM65)","v":0},"Km confirmés",{"$f":"SUM(D67:BM67)","v":0},null,null,null,null,null,null,null,null,null,null,null,null,null,null,null,null,null,{"$f":"SUM(BQ65:CG65)","v":0},"Km confirmés",{"$f":"SUM(BQ67:CG67)","v":0},"Km confirmés",{"$f":"SUM(CJ65+BP65)","v":0}]
[null,null,null,0,0,0,0,0,0,0,0,0,0,0,0,0,0,0,0,0,0,0,0,0,0,0,0,0,0,0,0,0,0,0,0,0,0,0,0,0,0,0,0,0,0,0,0,0,0,0,0,0,0,0,0,0,0,0,0,0,0,0,0,0,0,null,"Rondes confirmées",{"$f":"SUM(C66:BM66)","v":0},0,0,0,0,0,0,0,0,0,0,0,0,0,0,0,0,0,null,"Rondes confirmées",{"$f":"SUM(BQ66:CH66)","v":0},"Rondes confirmées",{"$f":"SUM(CJ66+BP66)","v":0}]
[null,null,null,{"$f":"SUM((D64+D65)*D66)","v":0},0,0,0,0,0,0,0,0,0,0,0,0,0,0,0,0,0,0,0,0,0,0,0,0,0,0,0,0,0,0,0,0,0,0,0,0,0,0,0,0,0,0,0,0,0,0,0,0,0,0,0,0,0,0,0,0,0,{"$f":"SUM((BJ64+BJ65)*BJ66)","v":0},{"$f":"SUM((BK64+BK65)*BK66)","v":0},{"$f":"SUM((BL64+BL65)*BL66)","v":0},{"$f":"SUM((BM64+BM65)*BM66)","v":0},null,"Rondes effectuées",{"$f":"COUNTIF(D64:BM64,\">0\")","v":0},{"$f":"SUM((BQ64+BQ65)*BQ66)","v":0},0,0,0,0,0,0,0,0,0,0,0,0,0,0,0,0,null,"Rondes Effectuées",{"$f":"COUNTIF(BQ64:CG64,\">0\")","v":0},"Rondes effectuées",{"$f":"SUM(CJ67+BP67)","v":0}]
[16,{"$f":"VLOOKUP(A68,'Numéro licences'!$H$4:$I$47,2)","v":"LESCAL Thierry"},"Aller-Retour",null,null,null,266,null,null,338,204,20,44,34,174,18,268,156,118,null,284,null,20,164,null,132,0,null,null,86,null,null,68,null,null,118,18,34,null,null,null,null,null,210,null,44,204,68,null,86,null,null,338,null,210,280,null,160,164,118,18,null,null,null,null,{"$f":"SUM(D68:BM68)","v":4464},"Km  renseignés",{"$f":"SUM(BN68:BN69)","v":10370},null,null,null,null,null,null,null,null,null,null,null,null,null,null,null,null,null,{"$f":"SUM(BQ68:CG68)","v":0},"Km  renseignés",{"$f":"SUM(CH68+CH69)","v":0},"Km  renseignés",{"$f":"SUM(BP68+CJ68)","v":10370}]
[null,null,"Ronde",null,null,null,130,null,160,150,134,173,160,160,175,180,179,146,170,null,190,null,200,221,null,175,200,null,null,216,null,null,196,null,null,160,195,167,null,null,null,null,null,200,null,240,200,220,null,188,null,null,130,null,160,160,null,160,130,155,126,null,null,null,null,{"$f":"SUM(D69:BM69)","v":5906},"Km confirmés",{"$f":"SUM(D71:BM71)","v":10370},null,null,null,null,null,null,null,null,null,null,null,null,null,null,null,null,null,{"$f":"SUM(BQ69:CG69)","v":0},"Km confirmés",{"$f":"SUM(BQ71:CG71)","v":0},"Km confirmés",{"$f":"SUM(CJ69+BP69)","v":10370}]
[null,null,null,0,0,0,1,0,1,1,1,1,1,1,1,1,1,1,1,0,1,0,1,1,0,1,1,0,0,1,0,0,1,0,0,1,1,1,0,0,0,0,0,1,0,1,1,1,0,1,0,0,1,0,1,1,0,1,1,1,1,0,0,0,0,null,"Rondes confirmées",{"$f":"SUM(C70:BM70)","v":34},0,0,0,0,0,0,0,0,0,0,0,0,0,0,0,0,0,null,"Rondes confirmées",{"$f":"SUM(BQ70:CH70)","v":0},"Rondes confirmées",{"$f":"SUM(CJ70+BP70)","v":34}]
[null,null,null,{"$f":"SUM((D68+D69)*D70)","v":0},0,0,396,0,160,488,338,193,204,194,349,198,447,302,288,0,474,0,220,385,0,307,200,0,0,302,0,0,264,0,0,278,213,201,0,0,0,0,0,410,0,284,404,288,0,274,0,0,468,0,370,440,0,320,294,273,144,{"$f":"SUM((BJ68+BJ69)*BJ70)","v":0},{"$f":"SUM((BK68+BK69)*BK70)","v":0},{"$f":"SUM((BL68+BL69)*BL70)","v":0},{"$f":"SUM((BM68+BM69)*BM70)","v":0},null,"Rondes effectuées",{"$f":"COUNTIF(D68:BM68,\">0\")","v":32},{"$f":"SUM((BQ68+BQ69)*BQ70)","v":0},0,0,0,0,0,0,0,0,0,0,0,0,0,0,0,0,null,"Rondes Effectuées",{"$f":"COUNTIF(BQ68:CG68,\">0\")","v":0},"Rondes effectuées",{"$f":"SUM(CJ71+BP71)","v":32}]
[17,{"$f":"VLOOKUP(A72,'Numéro licences'!$H$4:$I$47,2)","v":"MALLIEN Philippe"},"Aller-Retour",null,null,null,null,null,null,null,null,null,null,null,null,null,null,null,null,null,null,null,null,null,null,null,0,null,null,null,null,null,68,null,null,null,null,null,null,null,null,null,null,null,null,null,null,null,null,null,null,null,null,null,null,null,null,null,null,null,null,null,null,null,null,{"$f":"SUM(D72:BM72)","v":68},"Km  renseignés",{"$f":"SUM(BN72:BN73)","v":624},null,null,null,null,null,null,null,null,null,null,null,null,null,null,null,null,null,{"$f":"SUM(BQ72:CG72)","v":0},"Km  renseignés",{"$f":"SUM(CH72+CH73)","v":0},"Km  renseignés",{"$f":"SUM(BP72+CJ72)","v":624}]
[null,null,"Ronde",null,null,null,null,null,160,null,null,null,null,null,null,null,null,null,null,null,null,null,null,null,null,null,200,null,null,null,null,null,196,null,null,null,null,null,null,null,null,null,null,null,null,null,null,null,null,null,null,null,null,null,null,null,null,null,null,null,null,null,null,null,null,{"$f":"SUM(D73:BM73)","v":556},"Km confirmés",{"$f":"SUM(D75:BM75)","v":360},null,null,null,null,null,null,null,null,null,null,null,null,null,null,null,null,null,{"$f":"SUM(BQ73:CG73)","v":0},"Km confirmés",{"$f":"SUM(BQ75:CG75)","v":0},"Km confirmés",{"$f":"SUM(CJ73+BP73)","v":360}]
[null,null,null,0,0,0,0,0,1,0,0,0,0,0,0,0,0,0,0,0,0,0,0,0,0,0,1,0,0,0,0,0,0,0,0,0,0,0,0,0,0,0,0,0,0,0,0,0,0,0,0,0,0,0,0,0,0,0,0,0,0,0,0,0,0,null,"Rondes confirmées",{"$f":"SUM(C74:BM74)","v":2},0,0,0,0,0,0,0,0,0,0,0,0,0,0,0,0,0,null,"Rondes confirmées",{"$f":"SUM(BQ74:CH74)","v":0},"Rondes confirmées",{"$f":"SUM(CJ74+BP74)","v":2}]
[null,null,null,{"$f":"SUM((D72+D73)*D74)","v":0},0,0,0,0,160,0,0,0,0,0,0,0,0,0,0,0,0,0,0,0,0,0,200,0,0,0,0,0,0,0,0,0,0,0,0,0,0,0,0,0,0,0,0,0,0,0,0,0,0,0,0,0,0,0,0,0,0,{"$f":"SUM((BJ72+BJ73)*BJ74)","v":0},{"$f":"SUM((BK72+BK73)*BK74)","v":0},{"$f":"SUM((BL72+BL73)*BL74)","v":0},{"$f":"SUM((BM72+BM73)*BM74)","v":0},null,"Rondes effectuées",{"$f":"COUNTIF(D72:BM72,\">0\")","v":1},{"$f":"SUM((BQ72+BQ73)*BQ74)","v":0},0,0,0,0,0,0,0,0,0,0,0,0,0,0,0,0,null,"Rondes Effectuées",{"$f":"COUNTIF(BQ72:CG72,\">0\")","v":0},"Rondes effectuées",{"$f":"SUM(CJ75+BP75)","v":1}]
[18,{"$f":"VLOOKUP(A76,'Numéro licences'!$H$4:$I$47,2)","v":"MANZANO Pascal"},"Aller-Retour",394,186,160,266,null,null,null,204,20,44,34,null,null,null,156,null,254,284,null,20,164,null,132,0,null,null,null,null,null,null,186,null,118,18,null,null,null,null,null,null,210,null,null,204,68,null,null,null,null,null,null,210,null,null,160,null,118,18,null,null,null,null,{"$f":"SUM(D76:BM76)","v":3628},"Km  renseignés",{"$f":"SUM(BN76:BN77)","v":8123},null,110,null,null,null,null,null,null,null,null,null,null,null,null,null,null,null,{"$f":"SUM(BQ76:CG76)","v":110},"Km  renseignés",{"$f":"SUM(CH76+CH77)","v":310},"Km  renseignés",{"$f":"SUM(BP76+CJ76)","v":8433}]
[null,null,"Ronde",130,150,140,130,null,160,null,134,173,160,160,null,null,null,146,null,270,190,null,200,221,null,175,200,null,null,null,null,null,null,180,null,160,195,null,null,null,null,null,null,200,null,null,200,220,null,null,null,null,null,null,160,null,null,160,null,155,126,null,null,null,null,{"$f":"SUM(D77:BM77)","v":4495},"Km confirmés",{"$f":"SUM(D79:BM79)","v":7803},null,200,null,null,null,null,null,null,null,null,null,null,null,null,null,null,null,{"$f":"SUM(BQ77:CG77)","v":200},"Km confirmés",{"$f":"SUM(BQ79:CG79)","v":310},"Km confirmés",{"$f":"SUM(CJ77+BP77)","v":8113}]
[null,null,null,1,1,1,1,0,1,0,1,1,1,1,0,0,0,1,0,1,1,0,1,1,0,1,1,0,0,0,0,0,0,1,0,1,1,0,0,0,0,0,0,1,0,0,1,1,0,0,0,0,0,0,1,0,0,0,0,1,1,0,0,0,0,null,"Rondes confirmées",{"$f":"SUM(C78:BM78)","v":25},0,1,0,0,0,0,0,0,0,0,0,0,0,0,0,0,0,null,"Rondes confirmées",{"$f":"SUM(BQ78:CH78)","v":1},"Rondes confirmées",{"$f":"SUM(CJ78+BP78)","v":26}]
[null,null,null,{"$f":"SUM((D76+D77)*D78)","v":524},336,300,396,0,160,0,338,193,204,194,0,0,0,302,0,524,474,0,220,385,0,307,200,0,0,0,0,0,0,366,0,278,213,0,0,0,0,0,0,410,0,0,404,288,0,0,0,0,0,0,370,0,0,0,0,273,144,{"$f":"SUM((BJ76+BJ77)*BJ78)","v":0},{"$f":"SUM((BK76+BK77)*BK78)","v":0},{"$f":"SUM((BL76+BL77)*BL78)","v":0},{"$f":"SUM((BM76+BM77)*BM78)","v":0},null,"Rondes effectuées",{"$f":"COUNTIF(D76:BM76,\">0\")","v":24},{"$f":"SUM((BQ76+BQ77)*BQ78)","v":0},310,0,0,0,0,0,0,0,0,0,0,0,0,0,0,0,null,"Rondes Effectuées",{"$f":"COUNTIF(BQ76:CG76,\">0\")","v":1},"Rondes effectuées",{"$f":"SUM(CJ79+BP79)","v":25}]
[19,{"$f":"VLOOKUP(A80,'Numéro licences'!$H$4:$I$47,2)","v":"MARIEL Didier"},"Aller-Retour",null,null,null,null,null,null,null,204,null,44,null,null,18,null,null,null,null,null,null,null,null,null,null,null,null,null,86,null,null,null,null,null,118,18,null,null,null,null,null,null,null,null,44,null,null,null,null,null,null,null,null,null,null,null,null,164,null,18,null,null,null,null,{"$f":"SUM(D80:BM80)","v":714},"Km  renseignés",{"$f":"SUM(BN80:BN81)","v":1859},null,null,null,null,null,null,null,null,null,null,null,null,null,null,null,null,null,{"$f":"SUM(BQ80:CG80)","v":0},"Km  renseignés",{"$f":"SUM(CH80+CH81)","v":0},"Km  renseignés",{"$f":"SUM(BP80+CJ80)","v":1859}]
[null,null,"Ronde",null,null,null,null,null,null,null,134,null,160,null,null,0,null,null,null,null,null,null,null,null,null,null,null,null,null,0,null,null,null,null,null,160,195,null,null,null,null,null,null,null,null,240,null,null,null,null,null,null,null,null,null,null,null,null,130,null,126,null,null,null,null,{"$f":"SUM(D81:BM81)","v":1145},"Km confirmés",{"$f":"SUM(D83:BM83)","v":1859},null,null,null,null,null,null,null,null,null,null,null,null,null,null,null,null,null,{"$f":"SUM(BQ81:CG81)","v":0},"Km confirmés",{"$f":"SUM(BQ83:CG83)","v":0},"Km confirmés",{"$f":"SUM(CJ81+BP81)","v":1859}]
[null,null,null,0,0,0,0,0,0,0,1,0,1,0,0,1,0,0,0,0,0,0,0,0,0,0,0,0,0,1,0,0,0,0,0,1,1,0,0,0,0,0,0,0,0,1,0,0,0,0,0,0,0,0,0,0,0,0,1,0,1,0,0,0,0,null,"Rondes confirmées",{"$f":"SUM(C82:BM82)","v":9},0,0,0,0,0,0,0,0,0,0,0,0,0,0,0,0,0,null,"Rondes confirmées",{"$f":"SUM(BQ82:CH82)","v":0},"Rondes confirmées",{"$f":"SUM(CJ82+BP82)","v":9}]
[null,null,null,{"$f":"SUM((D80+D81)*D82)","v":0},0,0,0,0,0,0,338,0,204,0,0,18,0,0,0,0,0,0,0,0,0,0,0,0,0,86,0,0,0,0,0,278,213,0,0,0,0,0,0,0,0,284,0,0,0,0,0,0,0,0,0,0,0,0,294,0,144,{"$f":"SUM((BJ80+BJ81)*BJ82)","v":0},{"$f":"SUM((BK80+BK81)*BK82)","v":0},{"$f":"SUM((BL80+BL81)*BL82)","v":0},{"$f":"SUM((BM80+BM81)*BM82)","v":0},null,"Rondes effectuées",{"$f":"COUNTIF(D80:BM80,\">0\")","v":9},{"$f":"SUM((BQ80+BQ81)*BQ82)","v":0},0,0,0,0,0,0,0,0,0,0,0,0,0,0,0,0,null,"Rondes Effectuées",{"$f":"COUNTIF(BQ80:CG80,\">0\")","v":0},"Rondes effectuées",{"$f":"SUM(CJ83+BP83)","v":9}]
[20,{"$f":"VLOOKUP(A84,'Numéro licences'!$H$4:$I$47,2)","v":"MILET Benoit"},"Aller-Retour",null,null,null,null,null,null,null,null,null,null,null,null,null,null,null,null,null,null,null,null,null,null,null,0,null,null,null,null,null,null,null,null,null,null,null,null,null,null,null,null,null,null,null,null,null,null,null,null,null,null,null,null,null,null,null,null,null,18,null,null,null,null,{"$f":"SUM(D84:BM84)","v":18},"Km  renseignés",{"$f":"SUM(BN84:BN85)","v":504},null,null,null,null,null,null,null,null,null,null,null,null,null,null,null,null,null,{"$f":"SUM(BQ84:CG84)","v":0},"Km  renseignés",{"$f":"SUM(CH84+CH85)","v":0},"Km  renseignés",{"$f":"SUM(BP84+CJ84)","v":504}]
[null,null,"Ronde",null,null,null,null,null,160,null,null,null,null,null,null,null,null,null,null,null,null,null,null,null,null,null,200,null,null,null,null,null,null,null,null,null,null,null,null,null,null,null,null,null,null,null,null,null,null,null,null,null,null,null,null,null,null,null,null,null,126,null,null,null,null,{"$f":"SUM(D85:BM85)","v":486},"Km confirmés",{"$f":"SUM(D87:BM87)","v":504},null,null,null,null,null,null,null,null,null,null,null,null,null,null,null,null,null,{"$f":"SUM(BQ85:CG85)","v":0},"Km confirmés",{"$f":"SUM(BQ87:CG87)","v":0},"Km confirmés",{"$f":"SUM(CJ85+BP85)","v":504}]
[null,null,null,0,0,0,0,0,1,0,0,0,0,0,0,0,0,0,0,0,0,0,0,0,0,0,1,0,0,0,0,0,0,0,0,0,0,0,0,0,0,0,0,0,0,0,0,0,0,0,0,0,0,0,0,0,0,0,0,0,1,0,0,0,0,null,"Rondes confirmées",{"$f":"SUM(C86:BM86)","v":3},0,0,0,0,0,0,0,0,0,0,0,0,0,0,0,0,0,null,"Rondes confirmées",{"$f":"SUM(BQ86:CH86)","v":0},"Rondes confirmées",{"$f":"SUM(CJ86+BP86)","v":3}]
[null,null,null,{"$f":"SUM((D84+D85)*D86)","v":0},0,0,0,0,160,0,0,0,0,0,0,0,0,0,0,0,0,0,0,0,0,0,200,0,0,0,0,0,0,0,0,0,0,0,0,0,0,0,0,0,0,0,0,0,0,0,0,0,0,0,0,0,0,0,0,0,144,{"$f":"SUM((BJ84+BJ85)*BJ86)","v":0},{"$f":"SUM((BK84+BK85)*BK86)","v":0},{"$f":"SUM((BL84+BL85)*BL86)","v":0},{"$f":"SUM((BM84+BM85)*BM86)","v":0},null,"Rondes effectuées",{"$f":"COUNTIF(D84:BM84,\">0\")","v":1},{"$f":"SUM((BQ84+BQ85)*BQ86)","v":0},0,0,0,0,0,0,0,0,0,0,0,0,0,0,0,0,null,"Rondes Effectuées",{"$f":"COUNTIF(BQ84:CG84,\">0\")","v":0},"Rondes effectuées",{"$f":"SUM(CJ87+BP87)","v":1}]
[21,{"$f":"VLOOKUP(A88,'Numéro licences'!$H$4:$I$47,2)","v":"NIHOUL Dany"},"Aller-Retour",394,null,null,null,null,null,null,null,20,44,null,null,null,null,156,null,null,284,null,20,164,38,132,0,null,null,86,null,null,68,null,null,null,null,null,null,null,null,null,null,210,null,44,null,68,null,null,null,null,null,null,210,280,null,null,null,null,18,null,null,null,null,{"$f":"SUM(D88:BM88)","v":2236},"Km  renseignés",{"$f":"SUM(BN88:BN89)","v":6312},null,null,null,null,null,null,null,null,null,null,null,null,null,null,null,null,null,{"$f":"SUM(BQ88:CG88)","v":0},"Km  renseignés",{"$f":"SUM(CH88+CH89)","v":0},"Km  renseignés",{"$f":"SUM(BP88+CJ88)","v":6312}]
[null,null,"Ronde",130,null,null,null,null,160,null,null,173,160,null,null,null,null,146,null,null,190,null,200,221,803,175,200,null,null,216,null,null,196,null,null,null,null,null,null,null,null,null,null,200,null,240,null,220,null,null,null,null,null,null,160,160,null,null,null,null,126,null,null,null,null,{"$f":"SUM(D89:BM89)","v":4076},"Km confirmés",{"$f":"SUM(D91:BM91)","v":6312},null,null,null,null,null,null,null,null,null,null,null,null,null,null,null,null,null,{"$f":"SUM(BQ89:CG89)","v":0},"Km confirmés",{"$f":"SUM(BQ91:CG91)","v":0},"Km confirmés",{"$f":"SUM(CJ89+BP89)","v":6312}]
[null,null,null,1,0,0,0,0,1,0,0,1,1,0,0,0,0,1,0,0,1,0,1,1,1,1,1,0,0,1,0,0,1,0,0,0,0,0,0,0,0,0,0,1,0,1,0,1,0,0,0,0,0,0,1,1,0,0,0,0,1,0,0,0,0,null,"Rondes confirmées",{"$f":"SUM(C90:BM90)","v":19},0,0,0,0,0,0,0,0,0,0,0,0,0,0,0,0,0,null,"Rondes confirmées",{"$f":"SUM(BQ90:CH90)","v":0},"Rondes confirmées",{"$f":"SUM(CJ90+BP90)","v":19}]
[null,null,null,{"$f":"SUM((D88+D89)*D90)","v":524},0,0,0,0,160,0,0,193,204,0,0,0,0,302,0,0,474,0,220,385,841,307,200,0,0,302,0,0,264,0,0,0,0,0,0,0,0,0,0,410,0,284,0,288,0,0,0,0,0,0,370,440,0,0,0,0,144,{"$f":"SUM((BJ88+BJ89)*BJ90)","v":0},{"$f":"SUM((BK88+BK89)*BK90)","v":0},{"$f":"SUM((BL88+BL89)*BL90)","v":0},{"$f":"SUM((BM88+BM89)*BM90)","v":0},null,"Rondes effectuées",{"$f":"COUNTIF(D88:BM88,\">0\")","v":17},{"$f":"SUM((BQ88+BQ89)*BQ90)","v":0},0,0,0,0,0,0,0,0,0,0,0,0,0,0,0,0,null,"Rondes Effectuées",{"$f":"COUNTIF(BQ88:CG88,\">0\")","v":0},"Rondes effectuées",{"$f":"SUM(CJ91+BP91)","v":17}]
[22,{"$f":"VLOOKUP(A92,'Numéro licences'!$H$4:$I$47,2)","v":"PARMENTIER Dominique"},"Aller-Retour",null,null,null,null,null,null,null,null,null,null,null,null,null,null,null,null,null,null,null,null,164,null,null,0,null,null,86,null,null,null,null,null,118,null,null,null,null,null,null,null,null,null,null,null,null,null,null,null,null,null,null,null,null,null,null,null,null,null,null,null,null,null,{"$f":"SUM(D92:BM92)","v":368},"Km  renseignés",{"$f":"SUM(BN92:BN93)","v":728},null,null,null,null,null,null,null,null,null,null,null,null,null,null,null,null,null,{"$f":"SUM(BQ92:CG92)","v":0},"Km  renseignés",{"$f":"SUM(CH92+CH93)","v":0},"Km  renseignés",{"$f":"SUM(BP92+CJ92)","v":728}]
[null,null,"Ronde",null,null,null,null,null,160,null,null,null,null,null,null,null,null,null,null,null,null,null,null,0,null,null,200,null,null,0,null,null,null,null,null,0,null,null,null,null,null,null,null,null,null,null,null,null,null,null,null,null,null,null,null,null,null,null,null,null,null,null,null,null,null,{"$f":"SUM(D93:BM93)","v":360},"Km confirmés",{"$f":"SUM(D95:BM95)","v":728},null,null,null,null,null,null,null,null,null,null,null,null,null,null,null,null,null,{"$f":"SUM(BQ93:CG93)","v":0},"Km confirmés",{"$f":"SUM(BQ95:CG95)","v":0},"Km confirmés",{"$f":"SUM(CJ93+BP93)","v":728}]
[null,null,null,0,0,0,0,0,1,0,0,0,0,0,0,0,0,0,0,0,0,0,0,1,0,0,1,0,0,1,0,0,0,0,0,1,0,0,0,0,0,0,0,0,0,0,0,0,0,0,0,0,0,0,0,0,0,0,0,0,0,0,0,0,0,null,"Rondes confirmées",{"$f":"SUM(C94:BM94)","v":5},0,0,0,0,0,0,0,0,0,0,0,0,0,0,0,0,0,null,"Rondes confirmées",{"$f":"SUM(BQ94:CH94)","v":0},"Rondes confirmées",{"$f":"SUM(CJ94+BP94)","v":5}]
[null,null,null,{"$f":"SUM((D92+D93)*D94)","v":0},0,0,0,0,160,0,0,0,0,0,0,0,0,0,0,0,0,0,0,164,0,0,200,0,0,86,0,0,0,0,0,118,0,0,0,0,0,0,0,0,0,0,0,0,0,0,0,0,0,0,0,0,0,0,0,0,0,{"$f":"SUM((BJ92+BJ93)*BJ94)","v":0},{"$f":"SUM((BK92+BK93)*BK94)","v":0},{"$f":"SUM((BL92+BL93)*BL94)","v":0},{"$f":"SUM((BM92+BM93)*BM94)","v":0},null,"Rondes effectuées",{"$f":"COUNTIF(D92:BM92,\">0\")","v":3},{"$f":"SUM((BQ92+BQ93)*BQ94)","v":0},0,0,0,0,0,0,0,0,0,0,0,0,0,0,0,0,null,"Rondes Effectuées",{"$f":"COUNTIF(BQ92:CG92,\">0\")","v":0},"Rondes effectuées",{"$f":"SUM(CJ95+BP95)","v":3}]
[23,{"$f":"VLOOKUP(A96,'Numéro licences'!$H$4:$I$47,2)","v":"RAMEAU Didier"},"Aller-Retour",394,186,null,266,null,null,null,204,null,44,34,null,null,null,null,null,null,null,null,null,164,null,null,null,null,null,null,null,null,68,null,null,118,18,null,null,null,null,null,null,null,null,null,null,null,null,null,null,null,null,null,210,null,null,null,164,null,null,null,null,null,null,{"$f":"SUM(D96:BM96)","v":1870},"Km  renseignés",{"$f":"SUM(BN96:BN97)","v":3956},null,null,null,null,null,null,null,null,null,null,null,null,null,null,null,null,null,{"$f":"SUM(BQ96:CG96)","v":0},"Km  renseignés",{"$f":"SUM(CH96+CH97)","v":0},"Km  renseignés",{"$f":"SUM(BP96+CJ96)","v":3956}]
[null,null,"Ronde",130,150,null,130,null,160,null,134,null,160,160,null,null,null,null,null,null,null,null,null,221,null,null,null,null,null,null,null,null,196,null,null,160,195,null,null,null,null,null,null,null,null,null,null,null,null,null,null,null,null,null,160,null,null,null,130,null,null,null,null,null,null,{"$f":"SUM(D97:BM97)","v":2086},"Km confirmés",{"$f":"SUM(D99:BM99)","v":3956},null,null,null,null,null,null,null,null,null,null,null,null,null,null,null,null,null,{"$f":"SUM(BQ97:CG97)","v":0},"Km confirmés",{"$f":"SUM(BQ99:CG99)","v":0},"Km confirmés",{"$f":"SUM(CJ97+BP97)","v":3956}]
[null,null,null,1,1,0,1,0,1,0,1,0,1,1,0,0,0,0,0,0,0,0,0,1,0,0,0,0,0,0,0,0,1,0,0,1,1,0,0,0,0,0,0,0,0,0,0,0,0,0,0,0,0,0,1,0,0,0,1,0,0,0,0,0,0,null,"Rondes confirmées",{"$f":"SUM(C98:BM98)","v":13},0,0,0,0,0,0,0,0,0,0,0,0,0,0,0,0,0,null,"Rondes confirmées",{"$f":"SUM(BQ98:CH98)","v":0},"Rondes confirmées",{"$f":"SUM(CJ98+BP98)","v":13}]
[null,null,null,{"$f":"SUM((D96+D97)*D98)","v":524},336,0,396,0,160,0,338,0,204,194,0,0,0,0,0,0,0,0,0,385,0,0,0,0,0,0,0,0,264,0,0,278,213,0,0,0,0,0,0,0,0,0,0,0,0,0,0,0,0,0,370,0,0,0,294,0,0,{"$f":"SUM((BJ96+BJ97)*BJ98)","v":0},{"$f":"SUM((BK96+BK97)*BK98)","v":0},{"$f":"SUM((BL96+BL97)*BL98)","v":0},{"$f":"SUM((BM96+BM97)*BM98)","v":0},null,"Rondes effectuées",{"$f":"COUNTIF(D96:BM96,\">0\")","v":12},{"$f":"SUM((BQ96+BQ97)*BQ98)","v":0},0,0,0,0,0,0,0,0,0,0,0,0,0,0,0,0,null,"Rondes Effectuées",{"$f":"COUNTIF(BQ96:CG96,\">0\")","v":0},"Rondes effectuées",{"$f":"SUM(CJ99+BP99)","v":12}]
[24,{"$f":"VLOOKUP(A100,'Numéro licences'!$H$4:$I$47,2)","v":"SMEETS Carine"},"Aller-Retour",null,null,null,null,null,null,null,null,null,null,null,null,null,null,null,null,null,null,null,null,null,null,null,null,null,null,null,null,null,null,null,null,null,null,null,null,null,null,null,null,null,null,null,null,null,null,null,null,null,null,null,null,null,null,null,null,null,null,null,null,null,null,{"$f":"SUM(D100:BM100)","v":0},"Km  renseignés",{"$f":"SUM(BN100:BN101)","v":160},null,null,null,null,null,null,null,null,null,null,null,null,null,null,null,null,null,{"$f":"SUM(BQ100:CG100)","v":0},"Km  renseignés",{"$f":"SUM(CH100+CH101)","v":0},"Km  renseignés",{"$f":"SUM(BP100+CJ100)","v":160}]
[null,null,"Ronde",null,null,null,null,null,160,null,null,null,null,null,null,null,null,null,null,null,null,null,null,null,null,null,null,null,null,null,null,null,null,null,null,null,null,null,null,null,null,null,null,null,null,null,null,null,null,null,null,null,null,null,null,null,null,null,null,null,null,null,null,null,null,{"$f":"SUM(D101:BM101)","v":160},"Km confirmés",{"$f":"SUM(D103:BM103)","v":160},null,null,null,null,null,null,null,null,null,null,null,null,null,null,null,null,null,{"$f":"SUM(BQ101:CG101)","v":0},"Km confirmés",{"$f":"SUM(BQ103:CG103)","v":0},"Km confirmés",{"$f":"SUM(CJ101+BP101)","v":160}]
[null,null,null,0,0,0,0,0,1,0,0,0,0,0,0,0,0,0,0,0,0,0,0,0,0,0,0,0,0,0,0,0,0,0,0,0,0,0,0,0,0,0,0,0,0,0,0,0,0,0,0,0,0,0,0,0,0,0,0,0,0,0,0,0,0,null,"Rondes confirmées",{"$f":"SUM(C102:BM102)","v":1},0,0,0,0,0,0,0,0,0,0,0,0,0,0,0,0,0,null,"Rondes confirmées",{"$f":"SUM(BQ102:CH102)","v":0},"Rondes confirmées",{"$f":"SUM(CJ102+BP102)","v":1}]
[null,null,null,{"$f":"SUM((D100+D101)*D102)","v":0},0,0,0,0,160,0,0,0,0,0,0,0,0,0,0,0,0,0,0,0,0,0,0,0,0,0,0,0,0,0,0,0,0,0,0,0,0,0,0,0,0,0,0,0,0,0,0,0,0,0,0,0,0,0,0,0,0,{"$f":"SUM((BJ100+BJ101)*BJ102)","v":0},{"$f":"SUM((BK100+BK101)*BK102)","v":0},{"$f":"SUM((BL100+BL101)*BL102)","v":0},{"$f":"SUM((BM100+BM101)*BM102)","v":0},null,"Rondes effectuées",{"$f":"COUNTIF(D100:BM100,\">0\")","v":0},{"$f":"SUM((BQ100+BQ101)*BQ102)","v":0},0,0,0,0,0,0,0,0,0,0,0,0,0,0,0,0,null,"Rondes Effectuées",{"$f":"COUNTIF(BQ100:CG100,\">0\")","v":0},"Rondes effectuées",{"$f":"SUM(CJ103+BP103)","v":0}]
[25,{"$f":"VLOOKUP(A104,'Numéro licences'!$H$4:$I$47,2)","v":"STRYPSTEIN Nicolas"},"Aller-Retour",null,null,null,null,null,null,null,null,null,null,null,null,null,null,null,null,null,null,null,null,null,null,null,0,null,null,null,null,null,null,null,null,null,null,null,null,null,null,null,null,null,null,null,null,null,null,null,null,null,null,null,null,null,null,null,null,null,null,null,null,null,null,{"$f":"SUM(D104:BM104)","v":0},"Km  renseignés",{"$f":"SUM(BN104:BN105)","v":200},null,null,null,null,null,null,null,null,null,null,null,null,null,null,null,null,null,{"$f":"SUM(BQ104:CG104)","v":0},"Km  renseignés",{"$f":"SUM(CH104+CH105)","v":0},"Km  renseignés",{"$f":"SUM(BP104+CJ104)","v":200}]
[null,null,"Ronde",null,null,null,null,null,null,null,null,null,null,null,null,null,null,null,null,null,null,null,null,null,null,null,200,null,null,null,null,null,null,null,null,null,null,null,null,null,null,null,null,null,null,null,null,null,null,null,null,null,null,null,null,null,null,null,null,null,null,null,null,null,null,{"$f":"SUM(D105:BM105)","v":200},"Km confirmés",{"$f":"SUM(D107:BM107)","v":200},null,null,null,null,null,null,null,null,null,null,null,null,null,null,null,null,null,{"$f":"SUM(BQ105:CG105)","v":0},"Km confirmés",{"$f":"SUM(BQ107:CG107)","v":0},"Km confirmés",{"$f":"SUM(CJ105+BP105)","v":200}]
[null,null,null,0,0,0,0,0,0,0,0,0,0,0,0,0,0,0,0,0,0,0,0,0,0,0,1,0,0,0,0,0,0,0,0,0,0,0,0,0,0,0,0,0,0,0,0,0,0,0,0,0,0,0,0,0,0,0,0,0,0,0,0,0,0,null,"Rondes confirmées",{"$f":"SUM(C106:BM106)","v":1},0,0,0,0,0,0,0,0,0,0,0,0,0,0,0,0,0,null,"Rondes confirmées",{"$f":"SUM(BQ106:CH106)","v":0},"Rondes confirmées",{"$f":"SUM(CJ106+BP106)","v":1}]
[null,null,null,{"$f":"SUM((D104+D105)*D106)","v":0},0,0,0,0,0,0,0,0,0,0,0,0,0,0,0,0,0,0,0,0,0,0,200,0,0,0,0,0,0,0,0,0,0,0,0,0,0,0,0,0,0,0,0,0,0,0,0,0,0,0,0,0,0,0,0,0,0,{"$f":"SUM((BJ104+BJ105)*BJ106)","v":0},{"$f":"SUM((BK104+BK105)*BK106)","v":0},{"$f":"SUM((BL104+BL105)*BL106)","v":0},{"$f":"SUM((BM104+BM105)*BM106)","v":0},null,"Rondes effectuées",{"$f":"COUNTIF(D104:BM104,\">0\")","v":0},{"$f":"SUM((BQ104+BQ105)*BQ106)","v":0},0,0,0,0,0,0,0,0,0,0,0,0,0,0,0,0,null,"Rondes Effectuées",{"$f":"COUNTIF(BQ104:CG104,\">0\")","v":0},"Rondes effectuées",{"$f":"SUM(CJ107+BP107)","v":0}]
[26,{"$f":"VLOOKUP(A108,'Numéro licences'!$H$4:$I$47,2)","v":"URBAIN Philippe"},"Aller-Retour",null,null,null,null,null,null,null,null,null,null,null,null,null,null,null,null,null,null,null,null,null,null,null,null,null,null,null,null,null,null,null,null,null,null,null,null,null,null,null,null,null,null,null,null,null,null,null,null,null,null,null,null,null,null,null,null,null,null,null,null,null,null,{"$f":"SUM(D108:BM108)","v":0},"Km  renseignés",{"$f":"SUM(BN108:BN109)","v":0},null,null,null,null,null,null,null,null,null,null,null,null,null,null,null,null,null,{"$f":"SUM(BQ108:CG108)","v":0},"Km  renseignés",{"$f":"SUM(CH108+CH109)","v":0},"Km  renseignés",{"$f":"SUM(BP108+CJ108)","v":0}]
[null,null,"Ronde",null,null,null,null,null,null,null,null,null,null,null,null,null,null,null,null,null,null,null,null,null,null,null,null,null,null,null,null,null,null,null,null,null,null,null,null,null,null,null,null,null,null,null,null,null,null,null,null,null,null,null,null,null,null,null,null,null,null,null,null,null,null,{"$f":"SUM(D109:BM109)","v":0},"Km confirmés",{"$f":"SUM(D111:BM111)","v":0},null,null,null,null,null,null,null,null,null,null,null,null,null,null,null,null,null,{"$f":"SUM(BQ109:CG109)","v":0},"Km confirmés",{"$f":"SUM(BQ111:CG111)","v":0},"Km confirmés",{"$f":"SUM(CJ109+BP109)","v":0}]
[null,null,null,0,0,0,0,0,0,0,0,0,0,0,0,0,0,0,0,0,0,0,0,0,0,0,0,0,0,0,0,0,0,0,0,0,0,0,0,0,0,0,0,0,0,0,0,0,0,0,0,0,0,0,0,0,0,0,0,0,0,0,0,0,0,null,"Rondes confirmées",{"$f":"SUM(C110:BM110)","v":0},0,0,0,0,0,0,0,0,0,0,0,0,0,0,0,0,0,null,"Rondes confirmées",{"$f":"SUM(BQ110:CH110)","v":0},"Rondes confirmées",{"$f":"SUM(CJ110+BP110)","v":0}]
[null,null,null,{"$f":"SUM((D108+D109)*D110)","v":0},0,0,0,0,0,0,0,0,0,0,0,0,0,0,0,0,0,0,0,0,0,0,0,0,0,0,0,0,0,0,0,0,0,0,0,0,0,0,0,0,0,0,0,0,0,0,0,0,0,0,0,0,0,0,0,0,0,{"$f":"SUM((BJ108+BJ109)*BJ110)","v":0},{"$f":"SUM((BK108+BK109)*BK110)","v":0},{"$f":"SUM((BL108+BL109)*BL110)","v":0},{"$f":"SUM((BM108+BM109)*BM110)","v":0},null,"Rondes effectuées",{"$f":"COUNTIF(D108:BM108,\">0\")","v":0},{"$f":"SUM((BQ108+BQ109)*BQ110)","v":0},0,0,0,0,0,0,0,0,0,0,0,0,0,0,0,0,null,"Rondes Effectuées",{"$f":"COUNTIF(BQ108:CG108,\">0\")","v":0},"Rondes effectuées",{"$f":"SUM(CJ111+BP111)","v":0}]
[27,{"$f":"VLOOKUP(A112,'Numéro licences'!$H$4:$I$47,2)","v":"VANBELLINGEN Jean-Claude"},"Aller-Retour",394,null,null,null,null,null,null,null,null,null,34,null,18,null,null,null,null,null,1545,null,null,38,132,0,null,null,null,null,null,null,null,null,null,null,null,null,null,null,null,null,210,null,null,null,60,null,null,null,null,null,null,null,null,null,null,null,null,18,null,null,null,null,{"$f":"SUM(D112:BM112)","v":2449},"Km  renseignés",{"$f":"SUM(BN112:BN113)","v":4150},null,null,null,null,null,null,null,null,null,null,null,null,null,null,null,null,null,{"$f":"SUM(BQ112:CG112)","v":0},"Km  renseignés",{"$f":"SUM(CH112+CH113)","v":0},"Km  renseignés",{"$f":"SUM(BP112+CJ112)","v":4150}]
[null,null,"Ronde",0,null,null,null,null,null,null,null,null,null,160,null,0,null,null,null,null,null,212,null,null,803,0,200,null,null,null,null,null,null,null,null,null,null,null,null,null,null,null,null,200,null,null,null,0,null,null,null,null,null,null,null,null,null,null,null,null,126,null,null,null,null,{"$f":"SUM(D113:BM113)","v":1701},"Km confirmés",{"$f":"SUM(D115:BM115)","v":4150},null,null,null,null,null,null,null,null,null,null,null,null,null,null,null,null,null,{"$f":"SUM(BQ113:CG113)","v":0},"Km confirmés",{"$f":"SUM(BQ115:CG115)","v":0},"Km confirmés",{"$f":"SUM(CJ113+BP113)","v":4150}]
[null,null,null,1,0,0,0,0,0,0,0,0,0,1,0,1,0,0,0,0,0,1,0,0,1,1,1,0,0,0,0,0,0,0,0,0,0,0,0,0,0,0,0,1,0,0,0,1,0,0,0,0,0,0,0,0,0,0,0,0,1,0,0,0,0,null,"Rondes confirmées",{"$f":"SUM(C114:BM114)","v":10},0,0,0,0,0,0,0,0,0,0,0,0,0,0,0,0,0,null,"Rondes confirmées",{"$f":"SUM(BQ114:CH114)","v":0},"Rondes confirmées",{"$f":"SUM(CJ114+BP114)","v":10}]
[null,null,null,{"$f":"SUM((D112+D113)*D114)","v":394},0,0,0,0,0,0,0,0,0,194,0,18,0,0,0,0,0,1757,0,0,841,132,200,0,0,0,0,0,0,0,0,0,0,0,0,0,0,0,0,410,0,0,0,60,0,0,0,0,0,0,0,0,0,0,0,0,144,{"$f":"SUM((BJ112+BJ113)*BJ114)","v":0},{"$f":"SUM((BK112+BK113)*BK114)","v":0},{"$f":"SUM((BL112+BL113)*BL114)","v":0},{"$f":"SUM((BM112+BM113)*BM114)","v":0},null,"Rondes effectuées",{"$f":"COUNTIF(D112:BM112,\">0\")","v":9},{"$f":"SUM((BQ112+BQ113)*BQ114)","v":0},0,0,0,0,0,0,0,0,0,0,0,0,0,0,0,0,null,"Rondes Effectuées",{"$f":"COUNTIF(BQ112:CG112,\">0\")","v":0},"Rondes effectuées",{"$f":"SUM(CJ115+BP115)","v":9}]
[28,{"$f":"VLOOKUP(A116,'Numéro licences'!$H$4:$I$47,2)","v":"VAN DER BEETEN Pascal"},"Aller-Retour",394,186,160,266,null,null,null,204,20,null,34,174,18,268,null,118,null,284,null,20,164,38,132,null,null,null,86,160,null,null,186,null,118,null,34,null,266,null,204,null,210,394,null,null,null,null,null,null,null,null,254,210,null,null,160,null,118,18,null,null,null,null,{"$f":"SUM(D116:BM116)","v":4898},"Km  renseignés",{"$f":"SUM(BN116:BN117)","v":9522},null,110,154,null,null,null,null,null,null,null,null,null,null,null,null,null,null,{"$f":"SUM(BQ116:CG116)","v":264},"Km  renseignés",{"$f":"SUM(CH116+CH117)","v":644},"Km  renseignés",{"$f":"SUM(BP116+CJ116)","v":10166}]
[null,null,"Ronde",0,150,140,130,null,160,null,134,173,null,160,175,0,179,null,170,null,0,null,200,0,349,175,null,null,null,216,175,null,null,180,null,160,null,167,null,0,null,250,null,200,220,null,null,null,null,null,null,null,null,160,160,null,null,160,null,155,126,null,null,null,null,{"$f":"SUM(D117:BM117)","v":4624},"Km confirmés",{"$f":"SUM(D119:BM119)","v":9522},null,200,180,null,null,null,null,null,null,null,null,null,null,null,null,null,null,{"$f":"SUM(BQ117:CG117)","v":380},"Km confirmés",{"$f":"SUM(BQ119:CG119)","v":644},"Km confirmés",{"$f":"SUM(CJ117+BP117)","v":10166}]
[null,null,null,1,1,1,1,0,1,0,1,1,0,1,1,1,1,0,1,0,1,0,1,1,1,1,0,0,0,1,1,0,0,1,0,1,0,1,0,1,0,1,0,1,1,0,0,0,0,0,0,0,0,1,1,0,0,1,0,1,1,0,0,0,0,null,"Rondes confirmées",{"$f":"SUM(C118:BM118)","v":31},0,1,1,0,0,0,0,0,0,0,0,0,0,0,0,0,0,null,"Rondes confirmées",{"$f":"SUM(BQ118:CH118)","v":2},"Rondes confirmées",{"$f":"SUM(CJ118+BP118)","v":33}]
[null,null,null,{"$f":"SUM((D116+D117)*D118)","v":394},336,300,396,0,160,0,338,193,0,194,349,18,447,0,288,0,284,0,220,164,387,307,0,0,0,302,335,0,0,366,0,278,0,201,0,266,0,454,0,410,614,0,0,0,0,0,0,0,0,414,370,0,0,320,0,273,144,{"$f":"SUM((BJ116+BJ117)*BJ118)","v":0},{"$f":"SUM((BK116+BK117)*BK118)","v":0},{"$f":"SUM((BL116+BL117)*BL118)","v":0},{"$f":"SUM((BM116+BM117)*BM118)","v":0},null,"Rondes effectuées",{"$f":"COUNTIF(D116:BM116,\">0\")","v":30},{"$f":"SUM((BQ116+BQ117)*BQ118)","v":0},310,334,0,0,0,0,0,0,0,0,0,0,0,0,0,0,null,"Rondes Effectuées",{"$f":"COUNTIF(BQ116:CG116,\">0\")","v":2},"Rondes effectuées",{"$f":"SUM(CJ119+BP119)","v":32}]
[29,{"$f":"VLOOKUP(A120,'Numéro licences'!$H$4:$I$47,2)","v":"VANSTEYVOORT André"},"Aller-Retour",null,null,null,null,null,null,null,204,20,44,34,null,null,268,156,118,null,null,null,null,null,38,132,0,null,204,null,null,null,68,186,332,118,null,null,null,266,null,null,null,null,null,null,null,null,null,86,null,null,null,null,null,null,null,null,null,null,null,null,null,null,null,{"$f":"SUM(D120:BM120)","v":2274},"Km  renseignés",{"$f":"SUM(BN120:BN121)","v":5598},null,null,null,null,null,null,null,null,null,null,null,null,null,null,null,null,null,{"$f":"SUM(BQ120:CG120)","v":0},"Km  renseignés",{"$f":"SUM(CH120+CH121)","v":0},"Km  renseignés",{"$f":"SUM(BP120+CJ120)","v":5598}]
[null,null,"Ronde",null,null,null,null,null,null,null,134,173,160,160,null,null,179,146,170,null,null,null,null,null,803,175,200,null,150,null,null,null,196,180,0,160,null,null,null,150,null,null,null,null,null,null,null,null,null,188,null,null,null,null,null,null,null,null,null,null,null,null,null,null,null,{"$f":"SUM(D121:BM121)","v":3324},"Km confirmés",{"$f":"SUM(D123:BM123)","v":200},null,null,null,null,null,null,null,null,null,null,null,null,null,null,null,null,null,{"$f":"SUM(BQ121:CG121)","v":0},"Km confirmés",{"$f":"SUM(BQ123:CG123)","v":0},"Km confirmés",{"$f":"SUM(CJ121+BP121)","v":200}]
[null,null,null,0,0,0,0,0,0,0,0,0,0,0,0,0,0,0,0,0,0,0,0,0,0,0,1,0,0,0,0,0,0,0,0,0,0,0,0,0,0,0,0,0,0,0,0,0,0,0,0,0,0,0,0,0,0,0,0,0,0,0,0,0,0,null,"Rondes confirmées",{"$f":"SUM(C122:BM122)","v":1},0,0,0,0,0,0,0,0,0,0,0,0,0,0,0,0,0,null,"Rondes confirmées",{"$f":"SUM(BQ122:CH122)","v":0},"Rondes confirmées",{"$f":"SUM(CJ122+BP122)","v":1}]
[null,null,null,{"$f":"SUM((D120+D121)*D122)","v":0},0,0,0,0,0,0,0,0,0,0,0,0,0,0,0,0,0,0,0,0,0,0,200,0,0,0,0,0,0,0,0,0,0,0,0,0,0,0,0,0,0,0,0,0,0,0,0,0,0,0,0,0,0,0,0,0,0,{"$f":"SUM((BJ120+BJ121)*BJ122)","v":0},{"$f":"SUM((BK120+BK121)*BK122)","v":0},{"$f":"SUM((BL120+BL121)*BL122)","v":0},{"$f":"SUM((BM120+BM121)*BM122)","v":0},null,"Rondes effectuées",{"$f":"COUNTIF(D120:BM120,\">0\")","v":16},{"$f":"SUM((BQ120+BQ121)*BQ122)","v":0},0,0,0,0,0,0,0,0,0,0,0,0,0,0,0,0,null,"Rondes Effectuées",{"$f":"COUNTIF(BQ120:CG120,\">0\")","v":0},"Rondes effectuées",{"$f":"SUM(CJ123+BP123)","v":16}]
[30,{"$f":"VLOOKUP(A124,'Numéro licences'!$H$4:$I$47,2)","v":"WOUTERS Olivier"},"Aller-Retour",394,186,160,266,null,null,null,204,20,null,34,null,18,null,null,118,null,284,null,20,164,38,132,null,null,null,null,null,null,68,null,null,null,18,null,null,null,null,204,null,210,null,44,null,null,null,null,null,null,null,254,210,null,null,null,null,null,null,null,null,null,null,{"$f":"SUM(D124:BM124)","v":3046},"Km  renseignés",{"$f":"SUM(BN124:BN125)","v":7563},null,null,null,null,null,null,null,null,null,null,null,null,null,null,null,null,null,{"$f":"SUM(BQ124:CG124)","v":0},"Km  renseignés",{"$f":"SUM(CH124+CH125)","v":0},"Km  renseignés",{"$f":"SUM(BP124+CJ124)","v":7563}]
[null,null,"Ronde",130,150,140,130,null,160,null,134,173,null,160,null,180,null,null,170,null,190,null,200,221,803,175,null,null,null,null,null,null,196,null,null,null,195,null,null,null,null,250,null,200,null,240,null,null,null,null,null,null,null,160,160,null,null,null,null,null,null,null,null,null,null,{"$f":"SUM(D125:BM125)","v":4517},"Km confirmés",{"$f":"SUM(D127:BM127)","v":7563},null,null,null,null,null,null,null,null,null,null,null,null,null,null,null,null,null,{"$f":"SUM(BQ125:CG125)","v":0},"Km confirmés",{"$f":"SUM(BQ127:CG127)","v":0},"Km confirmés",{"$f":"SUM(CJ125+BP125)","v":7563}]
[null,null,null,1,1,1,1,0,1,0,1,1,0,1,0,1,0,0,1,0,1,0,1,1,1,1,0,0,0,0,0,0,1,0,0,0,1,0,0,0,0,1,0,1,0,1,0,0,0,0,0,0,0,1,1,0,0,0,0,0,0,0,0,0,0,null,"Rondes confirmées",{"$f":"SUM(C126:BM126)","v":22},0,0,0,0,0,0,0,0,0,0,0,0,0,0,0,0,0,null,"Rondes confirmées",{"$f":"SUM(BQ126:CH126)","v":0},"Rondes confirmées",{"$f":"SUM(CJ126+BP126)","v":22}]
[null,null,null,{"$f":"SUM((D124+D125)*D126)","v":524},336,300,396,0,160,0,338,193,0,194,0,198,0,0,288,0,474,0,220,385,841,307,0,0,0,0,0,0,264,0,0,0,213,0,0,0,0,454,0,410,0,284,0,0,0,0,0,0,0,414,370,0,0,0,0,0,0,{"$f":"SUM((BJ124+BJ125)*BJ126)","v":0},{"$f":"SUM((BK124+BK125)*BK126)","v":0},{"$f":"SUM((BL124+BL125)*BL126)","v":0},{"$f":"SUM((BM124+BM125)*BM126)","v":0},null,"Rondes effectuées",{"$f":"COUNTIF(D124:BM124,\">0\")","v":21},{"$f":"SUM((BQ124+BQ125)*BQ126)","v":0},0,0,0,0,0,0,0,0,0,0,0,0,0,0,0,0,null,"Rondes Effectuées",{"$f":"COUNTIF(BQ124:CG124,\">0\")","v":0},"Rondes effectuées",{"$f":"SUM(CJ127+BP127)","v":21}]
[31,{"$f":"VLOOKUP(A128,'Numéro licences'!$H$4:$I$47,2)","v":"THIRIFAYS Vincent"},"Aller-Retour",null,null,null,null,null,null,null,null,null,null,null,null,null,null,null,null,null,null,null,null,164,null,null,null,null,null,null,null,null,null,null,null,null,null,null,null,null,null,null,null,null,null,null,null,null,null,null,null,null,null,null,null,null,null,null,null,null,null,null,null,null,null,{"$f":"SUM(D128:BM128)","v":164},"Km  renseignés",{"$f":"SUM(BN128:BN129)","v":385},null,null,null,null,null,null,null,null,null,null,null,null,null,null,null,null,null,{"$f":"SUM(BQ128:CG128)","v":0},"Km  renseignés",{"$f":"SUM(CH128+CH129)","v":0},"Km  renseignés",{"$f":"SUM(BP128+CJ128)","v":385}]
[null,null,"Ronde",null,null,null,null,null,null,null,null,null,null,null,null,null,null,null,null,null,null,null,null,221,null,null,null,null,null,null,null,null,null,null,null,null,null,null,null,null,null,null,null,null,null,null,null,null,null,null,null,null,null,null,null,null,null,null,null,null,null,null,null,null,null,{"$f":"SUM(D129:BM129)","v":221},"Km confirmés",{"$f":"SUM(D131:BM131)","v":0},null,null,null,null,null,null,null,null,null,null,null,null,null,null,null,null,null,{"$f":"SUM(BQ129:CG129)","v":0},"Km confirmés",{"$f":"SUM(BQ131:CG131)","v":0},"Km confirmés",{"$f":"SUM(CJ129+BP129)","v":0}]
[null,null,null,0,0,0,0,0,0,0,0,0,0,0,0,0,0,0,0,0,0,0,0,0,0,0,0,0,0,0,0,0,0,0,0,0,0,0,0,0,0,0,0,0,0,0,0,0,0,0,0,0,0,0,0,0,0,0,0,0,0,0,0,0,0,null,"Rondes confirmées",{"$f":"SUM(C130:BM130)","v":0},0,0,0,0,0,0,0,0,0,0,0,0,0,0,0,0,0,null,"Rondes confirmées",{"$f":"SUM(BQ130:CH130)","v":0},"Rondes confirmées",{"$f":"SUM(CJ130+BP130)","v":0}]
[null,null,null,{"$f":"SUM((D128+D129)*D130)","v":0},0,0,0,0,0,0,0,0,0,0,0,0,0,0,0,0,0,0,0,0,0,0,0,0,0,0,0,0,0,0,0,0,0,0,0,0,0,0,0,0,0,0,0,0,0,0,0,0,0,0,0,0,0,0,0,0,0,{"$f":"SUM((BJ128+BJ129)*BJ130)","v":0},{"$f":"SUM((BK128+BK129)*BK130)","v":0},{"$f":"SUM((BL128+BL129)*BL130)","v":0},{"$f":"SUM((BM128+BM129)*BM130)","v":0},null,"Rondes effectuées",{"$f":"COUNTIF(D128:BM128,\">0\")","v":1},{"$f":"SUM((BQ128+BQ129)*BQ130)","v":0},0,0,0,0,0,0,0,0,0,0,0,0,0,0,0,0,null,"Rondes Effectuées",{"$f":"COUNTIF(BQ128:CG128,\">0\")","v":0},"Rondes effectuées",{"$f":"SUM(CJ131+BP131)","v":1}]
[32,{"$f":"VLOOKUP(A132,'Numéro licences'!$H$4:$I$47,2)","v":"VANDY Rudi"},"Aller-Retour",null,null,null,null,null,null,null,null,null,null,null,null,null,null,null,null,null,null,null,null,null,null,null,null,null,null,86,null,null,68,186,null,null,null,34,null,null,null,null,null,210,null,44,204,null,null,86,224,null,null,254,210,280,null,160,164,118,18,null,null,null,null,{"$f":"SUM(D132:BM132)","v":2346},"Km  renseignés",{"$f":"SUM(BN132:BN133)","v":5164},null,null,null,null,null,null,null,null,null,null,null,null,null,null,null,null,null,{"$f":"SUM(BQ132:CG132)","v":0},"Km  renseignés",{"$f":"SUM(CH132+CH133)","v":0},"Km  renseignés",{"$f":"SUM(BP132+CJ132)","v":5164}]
[null,null,"Ronde",null,null,null,null,null,null,null,null,null,null,null,null,null,null,null,null,null,null,null,null,null,null,null,null,null,null,216,null,null,196,180,null,null,null,167,null,null,null,null,null,200,null,240,200,null,null,188,180,null,null,160,160,160,null,160,130,155,126,null,null,null,null,{"$f":"SUM(D133:BM133)","v":2818},"Km confirmés",{"$f":"SUM(D135:BM135)","v":5164},null,null,null,null,null,null,null,null,null,null,null,null,null,null,null,null,null,{"$f":"SUM(BQ133:CG133)","v":0},"Km confirmés",{"$f":"SUM(BQ135:CG135)","v":0},"Km confirmés",{"$f":"SUM(CJ133+BP133)","v":5164}]
[null,null,null,0,0,0,0,0,0,0,0,0,0,0,0,0,0,0,0,0,0,0,0,0,0,0,0,0,0,1,0,0,1,1,0,0,0,1,0,0,0,0,0,1,0,1,1,0,0,1,1,0,0,1,1,1,0,1,1,1,1,0,0,0,0,null,"Rondes confirmées",{"$f":"SUM(C134:BM134)","v":16},0,0,0,0,0,0,0,0,0,0,0,0,0,0,0,0,0,null,"Rondes confirmées",{"$f":"SUM(BQ134:CH134)","v":0},"Rondes confirmées",{"$f":"SUM(CJ134+BP134)","v":16}]
[null,null,null,{"$f":"SUM((D132+D133)*D134)","v":0},0,0,0,0,0,0,0,0,0,0,0,0,0,0,0,0,0,0,0,0,0,0,0,0,0,302,0,0,264,366,0,0,0,201,0,0,0,0,0,410,0,284,404,0,0,274,404,0,0,414,370,440,0,320,294,273,144,{"$f":"SUM((BJ132+BJ133)*BJ134)","v":0},{"$f":"SUM((BK132+BK133)*BK134)","v":0},{"$f":"SUM((BL132+BL133)*BL134)","v":0},{"$f":"SUM((BM132+BM133)*BM134)","v":0},null,"Rondes effectuées",{"$f":"COUNTIF(D132:BM132,\">0\")","v":16},{"$f":"SUM((BQ132+BQ133)*BQ134)","v":0},0,0,0,0,0,0,0,0,0,0,0,0,0,0,0,0,null,"Rondes Effectuées",{"$f":"COUNTIF(BQ132:CG132,\">0\")","v":0},"Rondes effectuées",{"$f":"SUM(CJ135+BP135)","v":16}]
[33,{"$f":"VLOOKUP(A136,'Numéro licences'!$H$4:$I$47,2)","v":"LEFRANT Sébastien"},"Aller-Retour",null,null,null,null,null,null,null,null,null,null,null,null,null,null,null,null,null,null,null,null,null,null,null,null,null,null,null,null,null,68,null,null,118,18,null,null,null,null,null,null,null,null,null,null,68,null,null,null,null,null,254,null,null,null,null,null,null,null,null,null,null,null,{"$f":"SUM(D136:BM136)","v":526},"Km  renseignés",{"$f":"SUM(BN136:BN137)","v":1457},null,null,null,null,null,null,null,null,null,null,null,null,null,null,null,null,null,{"$f":"SUM(BQ136:CG136)","v":0},"Km  renseignés",{"$f":"SUM(CH136+CH137)","v":0},"Km  renseignés",{"$f":"SUM(BP136+CJ136)","v":1457}]
[null,null,"Ronde",null,null,null,null,null,null,null,null,null,null,null,null,null,null,null,null,null,null,null,null,null,null,null,null,null,null,null,null,null,196,null,null,160,195,null,null,null,null,null,null,null,null,null,null,220,null,null,null,null,null,160,null,null,null,null,null,null,null,null,null,null,null,{"$f":"SUM(D137:BM137)","v":931},"Km confirmés",{"$f":"SUM(D139:BM139)","v":0},null,null,null,null,null,null,null,null,null,null,null,null,null,null,null,null,null,{"$f":"SUM(BQ137:CG137)","v":0},"Km confirmés",{"$f":"SUM(BQ139:CG139)","v":0},"Km confirmés",{"$f":"SUM(CJ137+BP137)","v":0}]
[null,null,null,0,0,0,0,0,0,0,0,0,0,0,0,0,0,0,0,0,0,0,0,0,0,0,0,0,0,0,0,0,0,0,0,0,0,0,0,0,0,0,0,0,0,0,0,0,0,0,0,0,0,0,0,0,0,0,0,0,0,0,0,0,0,null,"Rondes confirmées",{"$f":"SUM(C138:BM138)","v":0},0,0,0,0,0,0,0,0,0,0,0,0,0,0,0,0,0,null,"Rondes confirmées",{"$f":"SUM(BQ138:CH138)","v":0},"Rondes confirmées",{"$f":"SUM(CJ138+BP138)","v":0}]
[null,null,null,{"$f":"SUM((D136+D137)*D138)","v":0},0,0,0,0,0,0,0,0,0,0,0,0,0,0,0,0,0,0,0,0,0,0,0,0,0,0,0,0,0,0,0,0,0,0,0,0,0,0,0,0,0,0,0,0,0,0,0,0,0,0,0,0,0,0,0,0,0,{"$f":"SUM((BJ136+BJ137)*BJ138)","v":0},{"$f":"SUM((BK136+BK137)*BK138)","v":0},{"$f":"SUM((BL136+BL137)*BL138)","v":0},{"$f":"SUM((BM136+BM137)*BM138)","v":0},null,"Rondes effectuées",{"$f":"COUNTIF(D136:BM136,\">0\")","v":5},{"$f":"SUM((BQ136+BQ137)*BQ138)","v":0},0,0,0,0,0,0,0,0,0,0,0,0,0,0,0,0,null,"Rondes Effectuées",{"$f":"COUNTIF(BQ136:CG136,\">0\")","v":0},"Rondes effectuées",{"$f":"SUM(CJ139+BP139)","v":5}]
[34,{"$f":"VLOOKUP(A140,'Numéro licences'!$H$4:$I$47,2)","v":0},"Aller-Retour",null,null,null,null,null,null,null,null,null,null,null,null,null,null,null,null,null,null,null,null,null,null,null,null,null,null,null,null,null,null,null,null,null,null,null,null,null,null,null,null,null,null,null,null,null,null,null,null,null,null,null,null,null,null,null,null,null,null,null,null,null,null,{"$f":"SUM(D140:BM140)","v":0},"Km  renseignés",{"$f":"SUM(BN140:BN141)","v":0},null,null,null,null,null,null,null,null,null,null,null,null,null,null,null,null,null,{"$f":"SUM(BQ140:CG140)","v":0},"Km  renseignés",{"$f":"SUM(CH140+CH141)","v":0},"Km  renseignés",{"$f":"SUM(BP140+CJ140)","v":0}]
[null,null,"Ronde",null,null,null,null,null,null,null,null,null,null,null,null,null,null,null,null,null,null,null,null,null,null,null,null,null,null,null,null,null,null,null,null,null,null,null,null,null,null,null,null,null,null,null,null,null,null,null,null,null,null,null,null,null,null,null,null,null,null,null,null,null,null,{"$f":"SUM(D141:BM141)","v":0},"Km confirmés",{"$f":"SUM(D143:BM143)","v":0},null,null,null,null,null,null,null,null,null,null,null,null,null,null,null,null,null,{"$f":"SUM(BQ141:CG141)","v":0},"Km confirmés",{"$f":"SUM(BQ143:CG143)","v":0},"Km confirmés",{"$f":"SUM(CJ141+BP141)","v":0}]
[null,null,null,0,0,0,0,0,0,0,0,0,0,0,0,0,0,0,0,0,0,0,0,0,0,0,0,0,0,0,0,0,0,0,0,0,0,0,0,0,0,0,0,0,0,0,0,0,0,0,0,0,0,0,0,0,0,0,0,0,0,0,0,0,0,null,"Rondes confirmées",{"$f":"SUM(C142:BM142)","v":0},0,0,0,0,0,0,0,0,0,0,0,0,0,0,0,0,0,null,"Rondes confirmées",{"$f":"SUM(BQ142:CH142)","v":0},"Rondes confirmées",{"$f":"SUM(CJ142+BP142)","v":0}]
[null,null,null,{"$f":"SUM((D140+D141)*D142)","v":0},0,0,0,0,0,0,0,0,0,0,0,0,0,0,0,0,0,0,0,0,0,0,0,0,0,0,0,0,0,0,0,0,0,0,0,0,0,0,0,0,0,0,0,0,0,0,0,0,0,0,0,0,0,0,0,0,0,{"$f":"SUM((BJ140+BJ141)*BJ142)","v":0},{"$f":"SUM((BK140+BK141)*BK142)","v":0},{"$f":"SUM((BL140+BL141)*BL142)","v":0},{"$f":"SUM((BM140+BM141)*BM142)","v":0},null,"Rondes effectuées",{"$f":"COUNTIF(D140:BM140,\">0\")","v":0},{"$f":"SUM((BQ140+BQ141)*BQ142)","v":0},0,0,0,0,0,0,0,0,0,0,0,0,0,0,0,0,null,"Rondes Effectuées",{"$f":"COUNTIF(BQ140:CG140,\">0\")","v":0},"Rondes effectuées",{"$f":"SUM(CJ143+BP143)","v":0}]
[35,{"$f":"VLOOKUP(A144,'Numéro licences'!$H$4:$I$47,2)","v":0},"Aller-Retour",null,null,null,null,null,null,null,null,null,null,null,null,null,null,null,null,null,null,null,null,null,null,null,null,null,null,null,null,null,null,null,null,null,null,null,null,null,null,null,null,null,null,null,null,null,null,null,null,null,null,null,null,null,null,null,null,null,null,null,null,null,null,{"$f":"SUM(D144:BM144)","v":0},"Km  renseignés",{"$f":"SUM(BN144+BN145)","v":0},null,null,null,null,null,null,null,null,null,null,null,null,null,null,null,null,null,{"$f":"SUM(BQ144:CG144)","v":0},"Km  renseignés",{"$f":"SUM(CH144+CH145)","v":0},"Km  renseignés",{"$f":"SUM(BP144+CJ144)","v":0}]
[null,null,"Ronde",null,null,null,null,null,null,null,null,null,null,null,null,null,null,null,null,null,null,null,null,null,null,null,null,null,null,null,null,null,null,null,null,null,null,null,null,null,null,null,null,null,null,null,null,null,null,null,null,null,null,null,null,null,null,null,null,null,null,null,null,null,null,{"$f":"SUM(D145:BM145)","v":0},"Km confirmés",{"$f":"SUM(D147:BM147)","v":0},null,null,null,null,null,null,null,null,null,null,null,null,null,null,null,null,null,{"$f":"SUM(BQ145:CG145)","v":0},"Km confirmés",{"$f":"SUM(BQ147:CG147)","v":0},"Km confirmés",{"$f":"SUM(CJ145+BP145)","v":0}]
[null,null,null,0,0,0,0,0,0,0,0,0,0,0,0,0,0,0,0,0,0,0,0,0,0,0,0,0,0,0,0,0,0,0,0,0,0,0,0,0,0,0,0,0,0,0,0,0,0,0,0,0,0,0,0,0,0,0,0,0,0,0,0,0,0,null,"Rondes confirmées",{"$f":"SUM(C146:BM146)","v":0},0,0,0,0,0,0,0,0,0,0,0,0,0,0,0,0,0,null,"Rondes confirmées",{"$f":"SUM(BQ146:CH146)","v":0},"Rondes confirmées",{"$f":"SUM(CJ146+BP146)","v":0}]
[null,null,null,{"$f":"SUM((D144+D145)*D146)","v":0},0,0,0,0,0,0,0,0,0,0,0,0,0,0,0,0,0,0,0,0,0,0,0,0,0,0,0,0,0,0,0,0,0,0,0,0,0,0,0,0,0,0,0,0,0,0,0,0,0,0,0,0,0,0,0,0,0,{"$f":"SUM((BJ144+BJ145)*BJ146)","v":0},{"$f":"SUM((BK144+BK145)*BK146)","v":0},{"$f":"SUM((BL144+BL145)*BL146)","v":0},{"$f":"SUM((BM144+BM145)*BM146)","v":0},null,"Rondes effectuées",{"$f":"COUNTIF(D144:BM144,\">0\")","v":0},{"$f":"SUM((BQ144+BQ145)*BQ146)","v":0},0,0,0,0,0,0,0,0,0,0,0,0,0,0,0,0,null,"Rondes Effectuées",{"$f":"COUNTIF(BQ144:CG144,\">0\")","v":0},"Rondes effectuées",{"$f":"SUM(CJ147+BP147)","v":0}]
[36,{"$f":"VLOOKUP(A148,'Numéro licences'!$H$4:$I$47,2)","v":0},"Aller-Retour",null,null,null,null,null,null,null,null,null,null,null,null,null,null,null,null,null,null,null,null,null,null,null,null,null,null,null,null,null,null,null,null,null,null,null,null,null,null,null,null,null,null,null,null,null,null,null,null,null,null,null,null,null,null,null,null,null,null,null,null,null,null,{"$f":"SUM(D148:BM148)","v":0},"Km  renseignés",{"$f":"SUM(BN148+BN149)","v":0},null,null,null,null,null,null,null,null,null,null,null,null,null,null,null,null,null,{"$f":"SUM(BQ148:CG148)","v":0},"Km  renseignés",{"$f":"SUM(CH148+CH149)","v":0},"Km  renseignés",{"$f":"SUM(BP148+CJ148)","v":0}]
[null,null,"Ronde",null,null,null,null,null,null,null,null,null,null,null,null,null,null,null,null,null,null,null,null,null,null,null,null,null,null,null,null,null,null,null,null,null,null,null,null,null,null,null,null,null,null,null,null,null,null,null,null,null,null,null,null,null,null,null,null,null,null,null,null,null,null,{"$f":"SUM(D149:BM149)","v":0},"Km confirmés",{"$f":"SUM(D151:BM151)","v":0},null,null,null,null,null,null,null,null,null,null,null,null,null,null,null,null,null,{"$f":"SUM(BQ149:CG149)","v":0},"Km confirmés",{"$f":"SUM(BQ151:CG151)","v":0},"Km confirmés",{"$f":"SUM(CJ149+BP149)","v":0}]
[null,null,null,0,0,0,0,0,0,0,0,0,0,0,0,0,0,0,0,0,0,0,0,0,0,0,0,0,0,0,0,0,0,0,0,0,0,0,0,0,0,0,0,0,0,0,0,0,0,0,0,0,0,0,0,0,0,0,0,0,0,0,0,0,0,null,"Rondes confirmées",{"$f":"SUM(C150:BM150)","v":0},0,0,0,0,0,0,0,0,0,0,0,0,0,0,0,0,0,null,"Rondes confirmées",{"$f":"SUM(BQ150:CH150)","v":0},"Rondes confirmées",{"$f":"SUM(CJ150+BP150)","v":0}]
[null,null,null,{"$f":"SUM((D148+D149)*D150)","v":0},0,0,0,0,0,0,0,0,0,0,0,0,0,0,0,0,0,0,0,0,0,0,0,0,0,0,0,0,0,0,0,0,0,0,0,0,0,0,0,0,0,0,0,0,0,0,0,0,0,0,0,0,0,0,0,0,0,{"$f":"SUM((BJ148+BJ149)*BJ150)","v":0},{"$f":"SUM((BK148+BK149)*BK150)","v":0},{"$f":"SUM((BL148+BL149)*BL150)","v":0},{"$f":"SUM((BM148+BM149)*BM150)","v":0},null,"Rondes effectuées",{"$f":"COUNTIF(D148:BM148,\">0\")","v":0},{"$f":"SUM((BQ148+BQ149)*BQ150)","v":0},0,0,0,0,0,0,0,0,0,0,0,0,0,0,0,0,null,"Rondes Effectuées",{"$f":"COUNTIF(BQ148:CG148,\">0\")","v":0},"Rondes effectuées",{"$f":"SUM(CJ151+BP151)","v":0}]
[37,{"$f":"VLOOKUP(A152,'Numéro licences'!$H$4:$I$47,2)","v":0},"Aller-Retour",null,null,null,null,null,null,null,null,null,null,null,null,null,null,null,null,null,null,null,null,null,null,null,null,null,null,null,null,null,null,null,null,null,null,null,null,null,null,null,null,null,null,null,null,null,null,null,null,null,null,null,null,null,null,null,null,null,null,null,null,null,null,{"$f":"SUM(D152:BM152)","v":0},"Km  renseignés",{"$f":"SUM(BN152+BN153)","v":0},null,null,null,null,null,null,null,null,null,null,null,null,null,null,null,null,null,{"$f":"SUM(BQ152:CG152)","v":0},"Km  renseignés",{"$f":"SUM(CH152+CH153)","v":0},"Km  renseignés",{"$f":"SUM(BP152+CJ152)","v":0}]
[null,null,"Ronde",null,null,null,null,null,null,null,null,null,null,null,null,null,null,null,null,null,null,null,null,null,null,null,null,null,null,null,null,null,null,null,null,null,null,null,null,null,null,null,null,null,null,null,null,null,null,null,null,null,null,null,null,null,null,null,null,null,null,null,null,null,null,{"$f":"SUM(D153:BM153)","v":0},"Km confirmés",{"$f":"SUM(D155:BM155)","v":0},null,null,null,null,null,null,null,null,null,null,null,null,null,null,null,null,null,{"$f":"SUM(BQ153:CG153)","v":0},"Km confirmés",{"$f":"SUM(BQ155:CG155)","v":0},"Km confirmés",{"$f":"SUM(CJ153+BP153)","v":0}]
[null,null,null,0,0,0,0,0,0,0,0,0,0,0,0,0,0,0,0,0,0,0,0,0,0,0,0,0,0,0,0,0,0,0,0,0,0,0,0,0,0,0,0,0,0,0,0,0,0,0,0,0,0,0,0,0,0,0,0,0,0,0,0,0,0,null,"Rondes confirmées",{"$f":"SUM(C154:BM154)","v":0},0,0,0,0,0,0,0,0,0,0,0,0,0,0,0,0,0,null,"Rondes confirmées",{"$f":"SUM(BQ154:CH154)","v":0},"Rondes confirmées",{"$f":"SUM(CJ154+BP154)","v":0}]
[null,null,null,{"$f":"SUM((D152+D153)*D154)","v":0},0,0,0,0,0,0,0,0,0,0,0,0,0,0,0,0,0,0,0,0,0,0,0,0,0,0,0,0,0,0,0,0,0,0,0,0,0,0,0,0,0,0,0,0,0,0,0,0,0,0,0,0,0,0,0,0,0,{"$f":"SUM((BJ152+BJ153)*BJ154)","v":0},{"$f":"SUM((BK152+BK153)*BK154)","v":0},{"$f":"SUM((BL152+BL153)*BL154)","v":0},{"$f":"SUM((BM152+BM153)*BM154)","v":0},null,"Rondes effectuées",{"$f":"COUNTIF(D152:BM152,\">0\")","v":0},{"$f":"SUM((BQ152+BQ153)*BQ154)","v":0},0,0,0,0,0,0,0,0,0,0,0,0,0,0,0,0,null,"Rondes Effectuées",{"$f":"COUNTIF(BQ152:CG152,\">0\")","v":0},"Rondes effectuées",{"$f":"SUM(CJ155+BP155)","v":0}]
[38,{"$f":"VLOOKUP(A156,'Numéro licences'!$H$4:$I$47,2)","v":0},"Aller-Retour",null,null,null,null,null,null,null,null,null,null,null,null,null,null,null,null,null,null,null,null,null,null,null,null,null,null,null,null,null,null,null,null,null,null,null,null,null,null,null,null,null,null,null,null,null,null,null,null,null,null,null,null,null,null,null,null,null,null,null,null,null,null,{"$f":"SUM(D156:BM156)","v":0},"Km  renseignés",{"$f":"SUM(BN156+BN157)","v":0},null,null,null,null,null,null,null,null,null,null,null,null,null,null,null,null,null,{"$f":"SUM(BQ156:CG156)","v":0},"Km  renseignés",{"$f":"SUM(CH156+CH157)","v":0},"Km  renseignés",{"$f":"SUM(BP156+CJ156)","v":0}]
[null,null,"Ronde",null,null,null,null,null,null,null,null,null,null,null,null,null,null,null,null,null,null,null,null,null,null,null,null,null,null,null,null,null,null,null,null,null,null,null,null,null,null,null,null,null,null,null,null,null,null,null,null,null,null,null,null,null,null,null,null,null,null,null,null,null,null,{"$f":"SUM(D157:BM157)","v":0},"Km confirmés",{"$f":"SUM(D159:BM159)","v":0},null,null,null,null,null,null,null,null,null,null,null,null,null,null,null,null,null,{"$f":"SUM(BQ157:CG157)","v":0},"Km confirmés",{"$f":"SUM(BQ159:CG159)","v":0},"Km confirmés",{"$f":"SUM(CJ157+BP157)","v":0}]
[null,null,null,0,0,0,0,0,0,0,0,0,0,0,0,0,0,0,0,0,0,0,0,0,0,0,0,0,0,0,0,0,0,0,0,0,0,0,0,0,0,0,0,0,0,0,0,0,0,0,0,0,0,0,0,0,0,0,0,0,0,0,0,0,0,null,"Rondes confirmées",{"$f":"SUM(C158:BM158)","v":0},0,0,0,0,0,0,0,0,0,0,0,0,0,0,0,0,0,null,"Rondes confirmées",{"$f":"SUM(BQ158:CH158)","v":0},"Rondes confirmées",{"$f":"SUM(CJ158+BP158)","v":0}]
[null,null,null,{"$f":"SUM((D156+D157)*D158)","v":0},0,0,0,0,0,0,0,0,0,0,0,0,0,0,0,0,0,0,0,0,0,0,0,0,0,0,0,0,0,0,0,0,0,0,0,0,0,0,0,0,0,0,0,0,0,0,0,0,0,0,0,0,0,0,0,0,0,{"$f":"SUM((BJ156+BJ157)*BJ158)","v":0},{"$f":"SUM((BK156+BK157)*BK158)","v":0},{"$f":"SUM((BL156+BL157)*BL158)","v":0},{"$f":"SUM((BM156+BM157)*BM158)","v":0},null,"Rondes effectuées",{"$f":"COUNTIF(D156:BM156,\">0\")","v":0},{"$f":"SUM((BQ156+BQ157)*BQ158)","v":0},0,0,0,0,0,0,0,0,0,0,0,0,0,0,0,0,null,"Rondes Effectuées",{"$f":"COUNTIF(BQ156:CG156,\">0\")","v":0},"Rondes effectuées",{"$f":"SUM(CJ159+BP159)","v":0}]
[39,{"$f":"VLOOKUP(A160,'Numéro licences'!$H$4:$I$47,2)","v":0},"Aller-Retour",null,null,null,null,null,null,null,null,null,null,null,null,null,null,null,null,null,null,null,null,null,null,null,null,null,null,null,null,null,null,null,null,null,null,null,null,null,null,null,null,null,null,null,null,null,null,null,null,null,null,null,null,null,null,null,null,null,null,null,null,null,null,{"$f":"SUM(D160:BM160)","v":0},"Km  renseignés",{"$f":"SUM(BN160+BN161)","v":0},null,null,null,null,null,null,null,null,null,null,null,null,null,null,null,null,null,{"$f":"SUM(BQ160:CG160)","v":0},"Km  renseignés",{"$f":"SUM(CH160+CH161)","v":0},"Km  renseignés",{"$f":"SUM(BP160+CJ160)","v":0}]
[null,null,"Ronde",null,null,null,null,null,null,null,null,null,null,null,null,null,null,null,null,null,null,null,null,null,null,null,null,null,null,null,null,null,null,null,null,null,null,null,null,null,null,null,null,null,null,null,null,null,null,null,null,null,null,null,null,null,null,null,null,null,null,null,null,null,null,{"$f":"SUM(D161:BM161)","v":0},"Km confirmés",{"$f":"SUM(D163:BM163)","v":0},null,null,null,null,null,null,null,null,null,null,null,null,null,null,null,null,null,{"$f":"SUM(BQ161:CG161)","v":0},"Km confirmés",{"$f":"SUM(BQ163:CG163)","v":0},"Km confirmés",{"$f":"SUM(CJ161+BP161)","v":0}]
[null,null,null,0,0,0,0,0,0,0,0,0,0,0,0,0,0,0,0,0,0,0,0,0,0,0,0,0,0,0,0,0,0,0,0,0,0,0,0,0,0,0,0,0,0,0,0,0,0,0,0,0,0,0,0,0,0,0,0,0,0,0,0,0,0,null,"Rondes confirmées",{"$f":"SUM(C162:BM162)","v":0},0,0,0,0,0,0,0,0,0,0,0,0,0,0,0,0,0,null,"Rondes confirmées",{"$f":"SUM(BQ162:CH162)","v":0},"Rondes confirmées",{"$f":"SUM(CJ162+BP162)","v":0}]
[null,null,null,{"$f":"SUM((D160+D161)*D162)","v":0},0,0,0,0,0,0,0,0,0,0,0,0,0,0,0,0,0,0,0,0,0,0,0,0,0,0,0,0,0,0,0,0,0,0,0,0,0,0,0,0,0,0,0,0,0,0,0,0,0,0,0,0,0,0,0,0,0,{"$f":"SUM((BJ160+BJ161)*BJ162)","v":0},{"$f":"SUM((BK160+BK161)*BK162)","v":0},{"$f":"SUM((BL160+BL161)*BL162)","v":0},{"$f":"SUM((BM160+BM161)*BM162)","v":0},null,"Rondes effectuées",{"$f":"COUNTIF(D160:BM160,\">0\")","v":0},{"$f":"SUM((BQ160+BQ161)*BQ162)","v":0},0,0,0,0,0,0,0,0,0,0,0,0,0,0,0,0,null,"Rondes Effectuées",{"$f":"COUNTIF(BQ160:CG160,\">0\")","v":0},"Rondes effectuées",{"$f":"SUM(CJ163+BP163)","v":0}]
[40,{"$f":"VLOOKUP(A164,'Numéro licences'!$H$4:$I$47,2)","v":0},"Aller-Retour",null,null,null,null,null,null,null,null,null,null,null,null,null,null,null,null,null,null,null,null,null,null,null,null,null,null,null,null,null,null,null,null,null,null,null,null,null,null,null,null,null,null,null,null,null,null,null,null,null,null,null,null,null,null,null,null,null,null,null,null,null,null,{"$f":"SUM(D164:BM164)","v":0},"Km  renseignés",{"$f":"SUM(BN164+BN165)","v":0},null,null,null,null,null,null,null,null,null,null,null,null,null,null,null,null,null,{"$f":"SUM(BQ164:CG164)","v":0},"Km  renseignés",{"$f":"SUM(CH164+CH165)","v":0},"Km  renseignés",{"$f":"SUM(BP164+CJ164)","v":0}]
[null,null,"Ronde",null,null,null,null,null,null,null,null,null,null,null,null,null,null,null,null,null,null,null,null,null,null,null,null,null,null,null,null,null,null,null,null,null,null,null,null,null,null,null,null,null,null,null,null,null,null,null,null,null,null,null,null,null,null,null,null,null,null,null,null,null,null,{"$f":"SUM(D165:BM165)","v":0},"Km confirmés",{"$f":"SUM(D167:BM167)","v":0},null,null,null,null,null,null,null,null,null,null,null,null,null,null,null,null,null,{"$f":"SUM(BQ165:CG165)","v":0},"Km confirmés",{"$f":"SUM(BQ167:CG167)","v":0},"Km confirmés",{"$f":"SUM(CJ165+BP165)","v":0}]
[null,null,null,0,0,0,0,0,0,0,0,0,0,0,0,0,0,0,0,0,0,0,0,0,0,0,0,0,0,0,0,0,0,0,0,0,0,0,0,0,0,0,0,0,0,0,0,0,0,0,0,0,0,0,0,0,0,0,0,0,0,0,0,0,0,null,"Rondes confirmées",{"$f":"SUM(C166:BM166)","v":0},0,0,0,0,0,0,0,0,0,0,0,0,0,0,0,0,0,null,"Rondes confirmées",{"$f":"SUM(BQ166:CH166)","v":0},"Rondes confirmées",{"$f":"SUM(CJ166+BP166)","v":0}]
[null,null,null,{"$f":"SUM((D164+D165)*D166)","v":0},0,0,0,0,0,0,0,0,0,0,0,0,0,0,0,0,0,0,0,0,0,0,0,0,0,0,0,0,0,0,0,0,0,0,0,0,0,0,0,0,0,0,0,0,0,0,0,0,0,0,0,0,0,0,0,0,0,{"$f":"SUM((BJ164+BJ165)*BJ166)","v":0},{"$f":"SUM((BK164+BK165)*BK166)","v":0},{"$f":"SUM((BL164+BL165)*BL166)","v":0},{"$f":"SUM((BM164+BM165)*BM166)","v":0},null,"Rondes effectuées",{"$f":"COUNTIF(D164:BM164,\">0\")","v":0},{"$f":"SUM((BQ164+BQ165)*BQ166)","v":0},0,0,0,0,0,0,0,0,0,0,0,0,0,0,0,0,null,"Rondes Effectuées",{"$f":"COUNTIF(BQ164:CG164,\">0\")","v":0},"Rondes effectuées",{"$f":"SUM(CJ167+BP167)","v":0}]
[41,{"$f":"VLOOKUP(A168,'Numéro licences'!$H$4:$I$47,2)","v":0},"Aller-Retour",null,null,null,null,null,null,null,null,null,null,null,null,null,null,null,null,null,null,null,null,null,null,null,null,null,null,null,null,null,null,null,null,null,null,null,null,null,null,null,null,null,null,null,null,null,null,null,null,null,null,null,null,null,null,null,null,null,null,null,null,null,null,{"$f":"SUM(D168:BM168)","v":0},"Km  renseignés",{"$f":"SUM(BN168+BN169)","v":0},null,null,null,null,null,null,null,null,null,null,null,null,null,null,null,null,null,{"$f":"SUM(BQ168:CG168)","v":0},"Km  renseignés",{"$f":"SUM(CH168+CH169)","v":0},"Km  renseignés",{"$f":"SUM(BP168+CJ168)","v":0}]
[null,null,"Ronde",null,null,null,null,null,null,null,null,null,null,null,null,null,null,null,null,null,null,null,null,null,null,null,null,null,null,null,null,null,null,null,null,null,null,null,null,null,null,null,null,null,null,null,null,null,null,null,null,null,null,null,null,null,null,null,null,null,null,null,null,null,null,{"$f":"SUM(D169:BM169)","v":0},"Km confirmés",{"$f":"SUM(D171:BM171)","v":0},null,null,null,null,null,null,null,null,null,null,null,null,null,null,null,null,null,{"$f":"SUM(BQ169:CG169)","v":0},"Km confirmés",{"$f":"SUM(BQ171:CG171)","v":0},"Km confirmés",{"$f":"SUM(CJ169+BP169)","v":0}]
[null,null,null,0,0,0,0,0,0,0,0,0,0,0,0,0,0,0,0,0,0,0,0,0,0,0,0,0,0,0,0,0,0,0,0,0,0,0,0,0,0,0,0,0,0,0,0,0,0,0,0,0,0,0,0,0,0,0,0,0,0,0,0,0,0,null,"Rondes confirmées",{"$f":"SUM(C170:BM170)","v":0},0,0,0,0,0,0,0,0,0,0,0,0,0,0,0,0,0,null,"Rondes confirmées",{"$f":"SUM(BQ170:CH170)","v":0},"Rondes confirmées",{"$f":"SUM(CJ170+BP170)","v":0}]
[null,null,null,{"$f":"SUM((D168+D169)*D170)","v":0},0,0,0,0,0,0,0,0,0,0,0,0,0,0,0,0,0,0,0,0,0,0,0,0,0,0,0,0,0,0,0,0,0,0,0,0,0,0,0,0,0,0,0,0,0,0,0,0,0,0,0,0,0,0,0,0,0,{"$f":"SUM((BJ168+BJ169)*BJ170)","v":0},{"$f":"SUM((BK168+BK169)*BK170)","v":0},{"$f":"SUM((BL168+BL169)*BL170)","v":0},{"$f":"SUM((BM168+BM169)*BM170)","v":0},null,"Rondes effectuées",{"$f":"COUNTIF(D168:BM168,\">0\")","v":0},{"$f":"SUM((BQ168+BQ169)*BQ170)","v":0},0,0,0,0,0,0,0,0,0,0,0,0,0,0,0,0,null,"Rondes Effectuées",{"$f":"COUNTIF(BQ168:CG168,\">0\")","v":0},"Rondes effectuées",{"$f":"SUM(CJ171+BP171)","v":0}]
[42,{"$f":"VLOOKUP(A172,'Numéro licences'!$H$4:$I$47,2)","v":0},"Aller-Retour",null,null,null,null,null,null,null,null,null,null,null,null,null,null,null,null,null,null,null,null,null,null,null,null,null,null,null,null,null,null,null,null,null,null,null,null,null,null,null,null,null,null,null,null,null,null,null,null,null,null,null,null,null,null,null,null,null,null,null,null,null,null,{"$f":"SUM(D172:BM172)","v":0},"Km  renseignés",{"$f":"SUM(BN172+BN173)","v":0},null,null,null,null,null,null,null,null,null,null,null,null,null,null,null,null,null,{"$f":"SUM(BQ172:CG172)","v":0},"Km  renseignés",{"$f":"SUM(CH172+CH173)","v":0},"Km  renseignés",{"$f":"SUM(BP172+CJ172)","v":0}]
[null,null,"Ronde",null,null,null,null,null,null,null,null,null,null,null,null,null,null,null,null,null,null,null,null,null,null,null,null,null,null,null,null,null,null,null,null,null,null,null,null,null,null,null,null,null,null,null,null,null,null,null,null,null,null,null,null,null,null,null,null,null,null,null,null,null,null,{"$f":"SUM(D173:BM173)","v":0},"Km confirmés",{"$f":"SUM(D175:BM175)","v":0},null,null,null,null,null,null,null,null,null,null,null,null,null,null,null,null,null,{"$f":"SUM(BQ173:CG173)","v":0},"Km confirmés",{"$f":"SUM(BQ175:CG175)","v":0},"Km confirmés",{"$f":"SUM(CJ173+BP173)","v":0}]
[null,null,null,0,0,0,0,0,0,0,0,0,0,0,0,0,0,0,0,0,0,0,0,0,0,0,0,0,0,0,0,0,0,0,0,0,0,0,0,0,0,0,0,0,0,0,0,0,0,0,0,0,0,0,0,0,0,0,0,0,0,0,0,0,0,null,"Rondes confirmées",{"$f":"SUM(C174:BM174)","v":0},0,0,0,0,0,0,0,0,0,0,0,0,0,0,0,0,0,null,"Rondes confirmées",{"$f":"SUM(BQ174:CH174)","v":0},"Rondes confirmées",{"$f":"SUM(CJ174+BP174)","v":0}]
[null,null,null,{"$f":"SUM((D172+D173)*D174)","v":0},0,0,0,0,0,0,0,0,0,0,0,0,0,0,0,0,0,0,0,0,0,0,0,0,0,0,0,0,0,0,0,0,0,0,0,0,0,0,0,0,0,0,0,0,0,0,0,0,0,0,0,0,0,0,0,0,0,{"$f":"SUM((BJ172+BJ173)*BJ174)","v":0},{"$f":"SUM((BK172+BK173)*BK174)","v":0},0,0,null,"Rondes effectuées",{"$f":"COUNTIF(D172:BM172,\">0\")","v":0},{"$f":"SUM((BQ172+BQ173)*BQ174)","v":0},0,0,0,0,0,0,0,0,0,0,0,0,0,0,0,0,null,"Rondes Effectuées",{"$f":"COUNTIF(BQ172:CG172,\">0\")","v":0},"Rondes effectuées",{"$f":"SUM(CJ175+BP175)","v":0}]
[43,{"$f":"VLOOKUP(A176,'Numéro licences'!$H$4:$I$47,2)","v":0},"Aller-Retour",null,null,null,null,null,null,null,null,null,null,null,null,null,null,null,null,null,null,null,null,null,null,null,null,null,null,null,null,null,null,null,null,null,null,null,null,null,null,null,null,null,null,null,null,null,null,null,null,null,null,null,null,null,null,null,null,null,null,null,null,null,null,{"$f":"SUM(D176:BM176)","v":0},"Km  renseignés",{"$f":"SUM(BN176+BN177)","v":0},null,null,null,null,null,null,null,null,null,null,null,null,null,null,null,null,null,{"$f":"SUM(BQ176:CG176)","v":0},"Km  renseignés",{"$f":"SUM(CH176+CH177)","v":0},"Km  renseignés",{"$f":"SUM(BP176+CJ176)","v":0}]
[null,null,"Ronde",null,null,null,null,null,null,null,null,null,null,null,null,null,null,null,null,null,null,null,null,null,null,null,null,null,null,null,null,null,null,null,null,null,null,null,null,null,null,null,null,null,null,null,null,null,null,null,null,null,null,null,null,null,null,null,null,null,null,null,null,null,null,{"$f":"SUM(D177:BM177)","v":0},"Km confirmés",{"$f":"SUM(D179:BM179)","v":0},null,null,null,null,null,null,null,null,null,null,null,null,null,null,null,null,null,{"$f":"SUM(BQ177:CG177)","v":0},"Km confirmés",{"$f":"SUM(BQ179:CG179)","v":0},"Km confirmés",{"$f":"SUM(CJ177+BP177)","v":0}]
[null,null,null,0,0,0,0,0,0,0,0,0,0,0,0,0,0,0,0,0,0,0,0,0,0,0,0,0,0,0,0,0,0,0,0,0,0,0,0,0,0,0,0,0,0,0,0,0,0,0,0,0,0,0,0,0,0,0,0,0,0,0,0,0,0,null,"Rondes confirmées",{"$f":"SUM(C178:BM178)","v":0},0,0,0,0,0,0,0,0,0,0,0,0,0,0,0,0,0,null,"Rondes confirmées",{"$f":"SUM(BQ178:CH178)","v":0},"Rondes confirmées",{"$f":"SUM(CJ178+BP178)","v":0}]
[null,null,null,{"$f":"SUM((D176+D177)*D178)","v":0},0,0,0,0,0,0,0,0,0,0,0,0,0,0,0,0,0,0,0,0,0,0,0,0,0,0,0,0,0,0,0,0,0,0,0,0,0,0,0,0,0,0,0,0,0,0,0,0,0,0,0,0,0,0,0,0,0,{"$f":"SUM((BJ176+BJ177)*BJ178)","v":0},{"$f":"SUM((BK176+BK177)*BK178)","v":0},0,0,null,"Rondes effectuées",{"$f":"COUNTIF(D176:BM176,\">0\")","v":0},{"$f":"SUM((BQ176+BQ177)*BQ178)","v":0},0,0,0,0,0,0,0,0,0,0,0,0,0,0,0,0,null,"Rondes Effectuées",{"$f":"COUNTIF(BQ176:CG176,\">0\")","v":0},"Rondes effectuées",{"$f":"SUM(CJ179+BP179)","v":0}]
[44,{"$f":"VLOOKUP(A180,'Numéro licences'!$H$4:$I$47,2)","v":0},"Aller-Retour",null,null,null,null,null,null,null,null,null,null,null,null,null,null,null,null,null,null,null,null,null,null,null,null,null,null,null,null,null,null,null,null,null,null,null,null,null,null,null,null,null,null,null,null,null,null,null,null,null,null,null,null,null,null,null,null,null,null,null,null,null,null,{"$f":"SUM(D180:BM180)","v":0},"Km  renseignés",{"$f":"SUM(BN180+BN181)","v":0},null,null,null,null,null,null,null,null,null,null,null,null,null,null,null,null,null,{"$f":"SUM(BQ180:CG180)","v":0},"Km  renseignés",{"$f":"SUM(CH180+CH181)","v":0},"Km  renseignés",{"$f":"SUM(BP180+CJ180)","v":0}]
[null,null,"Ronde",null,null,null,null,null,null,null,null,null,null,null,null,null,null,null,null,null,null,null,null,null,null,null,null,null,null,null,null,null,null,null,null,null,null,null,null,null,null,null,null,null,null,null,null,null,null,null,null,null,null,null,null,null,null,null,null,null,null,null,null,null,null,{"$f":"SUM(D181:BM181)","v":0},"Km confirmés",{"$f":"SUM(D183:BM183)","v":0},null,null,null,null,null,null,null,null,null,null,null,null,null,null,null,null,null,{"$f":"SUM(BQ181:CG181)","v":0},"Km confirmés",{"$f":"SUM(BQ183:CG183)","v":0},"Km confirmés",{"$f":"SUM(CJ181+BP181)","v":0}]
[null,null,null,0,0,0,0,0,0,0,0,0,0,0,0,0,0,0,0,0,0,0,0,0,0,0,0,0,0,0,0,0,0,0,0,0,0,0,0,0,0,0,0,0,0,0,0,0,0,0,0,0,0,0,0,0,0,0,0,0,0,0,0,0,0,null,"Rondes confirmées",{"$f":"SUM(C182:BM182)","v":0},0,0,0,0,0,0,0,0,0,0,0,0,0,0,0,0,0,null,"Rondes confirmées",{"$f":"SUM(BQ182:CH182)","v":0},"Rondes confirmées",{"$f":"SUM(CJ182+BP182)","v":0}]
[null,null,null,{"$f":"SUM((D180+D181)*D182)","v":0},0,0,0,0,0,0,0,0,0,0,0,0,0,0,0,0,0,0,0,0,0,0,0,0,0,0,0,0,0,0,0,0,0,0,0,0,0,0,0,0,0,0,0,0,0,0,0,0,0,0,0,0,0,0,0,0,0,{"$f":"SUM((BJ180+BJ181)*BJ182)","v":0},{"$f":"SUM((BK180+BK181)*BK182)","v":0},0,0,null,"Rondes effectuées",{"$f":"COUNTIF(D180:BM180,\">0\")","v":0},{"$f":"SUM((BQ180+BQ181)*BQ182)","v":0},0,0,0,0,0,0,0,0,0,0,0,0,0,0,0,0,null,"Rondes Effectuées",{"$f":"COUNTIF(BQ180:CG180,\">0\")","v":0},"Rondes effectuées",{"$f":"SUM(CJ183+BP183)","v":0}]
[45,{"$f":"VLOOKUP(A184,'Numéro licences'!$H$4:$I$47,2)","v":0},"Aller-Retour",null,null,null,null,null,null,null,null,null,null,null,null,null,null,null,null,null,null,null,null,null,null,null,null,null,null,null,null,null,null,null,null,null,null,null,null,null,null,null,null,null,null,null,null,null,null,null,null,null,null,null,null,null,null,null,null,null,null,null,null,null,null,{"$f":"SUM(D184:BM184)","v":0},"Km  renseignés",{"$f":"SUM(BN184+BN185)","v":0},null,null,null,null,null,null,null,null,null,null,null,null,null,null,null,null,null,{"$f":"SUM(BQ184:CG184)","v":0},"Km  renseignés",{"$f":"SUM(CH184+CH185)","v":0},"Km  renseignés",{"$f":"SUM(BP184+CJ184)","v":0}]
[null,null,"Ronde",null,null,null,null,null,null,null,null,null,null,null,null,null,null,null,null,null,null,null,null,null,null,null,null,null,null,null,null,null,null,null,null,null,null,null,null,null,null,null,null,null,null,null,null,null,null,null,null,null,null,null,null,null,null,null,null,null,null,null,null,null,null,{"$f":"SUM(D185:BM185)","v":0},"Km confirmés",{"$f":"SUM(D187:BM187)","v":0},null,null,null,null,null,null,null,null,null,null,null,null,null,null,null,null,null,{"$f":"SUM(BQ185:CG185)","v":0},"Km confirmés",{"$f":"SUM(BQ187:CG187)","v":0},"Km confirmés",{"$f":"SUM(CJ185+BP185)","v":0}]
[null,null,null,0,0,0,0,0,0,0,0,0,0,0,0,0,0,0,0,0,0,0,0,0,0,0,0,0,0,0,0,0,0,0,0,0,0,0,0,0,0,0,0,0,0,0,0,0,0,0,0,0,0,0,0,0,0,0,0,0,0,0,0,0,0,null,"Rondes confirmées",{"$f":"SUM(C186:BM186)","v":0},0,0,0,0,0,0,0,0,0,0,0,0,0,0,0,0,0,null,"Rondes confirmées",{"$f":"SUM(BQ186:CH186)","v":0},"Rondes confirmées",{"$f":"SUM(CJ186+BP186)","v":0}]
[null,null,null,{"$f":"SUM((D184+D185)*D186)","v":0},0,0,0,0,0,0,0,0,0,0,0,0,0,0,0,0,0,0,0,0,0,0,0,0,0,0,0,0,0,0,0,0,0,0,0,0,0,0,0,0,0,0,0,0,0,0,0,0,0,0,0,0,0,0,0,0,0,{"$f":"SUM((BJ184+BJ185)*BJ186)","v":0},{"$f":"SUM((BK184+BK185)*BK186)","v":0},0,0,null,"Rondes effectuées",{"$f":"COUNTIF(D184:BM184,\">0\")","v":0},{"$f":"SUM((BQ184+BQ185)*BQ186)","v":0},0,0,0,0,0,0,0,0,0,0,0,0,0,0,0,0,null,"Rondes Effectuées",{"$f":"COUNTIF(BQ184:CG184,\">0\")","v":0},"Rondes effectuées",{"$f":"SUM(CJ187+BP187)","v":0}]
[46,{"$f":"VLOOKUP(A188,'Numéro licences'!$H$4:$I$47,2)","v":0},"Aller-Retour",null,null,null,null,null,null,null,null,null,null,null,null,null,null,null,null,null,null,null,null,null,null,null,null,null,null,null,null,null,null,null,null,null,null,null,null,null,null,null,null,null,null,null,null,null,null,null,null,null,null,null,null,null,null,null,null,null,null,null,null,null,null,{"$f":"SUM(D188:BM188)","v":0},"Km  renseignés",{"$f":"SUM(BN188+BN189)","v":0},null,null,null,null,null,null,null,null,null,null,null,null,null,null,null,null,null,{"$f":"SUM(BQ188:CG188)","v":0},"Km  renseignés",{"$f":"SUM(CH188+CH189)","v":0},"Km  renseignés",{"$f":"SUM(BP188+CJ188)","v":0}]
[null,null,"Ronde",null,null,null,null,null,null,null,null,null,null,null,null,null,null,null,null,null,null,null,null,null,null,null,null,null,null,null,null,null,null,null,null,null,null,null,null,null,null,null,null,null,null,null,null,null,null,null,null,null,null,null,null,null,null,null,null,null,null,null,null,null,null,{"$f":"SUM(D189:BM189)","v":0},"Km confirmés",{"$f":"SUM(D191:BM191)","v":0},null,null,null,null,null,null,null,null,null,null,null,null,null,null,null,null,null,{"$f":"SUM(BQ189:CG189)","v":0},"Km confirmés",{"$f":"SUM(BQ191:CG191)","v":0},"Km confirmés",{"$f":"SUM(CJ189+BP189)","v":0}]
[null,null,null,0,0,0,0,0,0,0,0,0,0,0,0,0,0,0,0,0,0,0,0,0,0,0,0,0,0,0,0,0,0,0,0,0,0,0,0,0,0,0,0,0,0,0,0,0,0,0,0,0,0,0,0,0,0,0,0,0,0,0,0,0,0,null,"Rondes confirmées",{"$f":"SUM(C190:BM190)","v":0},0,0,0,0,0,0,0,0,0,0,0,0,0,0,0,0,0,null,"Rondes confirmées",{"$f":"SUM(BQ190:CH190)","v":0},"Rondes confirmées",{"$f":"SUM(CJ190+BP190)","v":0}]
[null,null,null,{"$f":"SUM((D188+D189)*D190)","v":0},0,0,0,0,0,0,0,0,0,0,0,0,0,0,0,0,0,0,0,0,0,0,0,0,0,0,0,0,0,0,0,0,0,0,0,0,0,0,0,0,0,0,0,0,0,0,0,0,0,0,0,0,0,0,0,0,0,{"$f":"SUM((BJ188+BJ189)*BJ190)","v":0},{"$f":"SUM((BK188+BK189)*BK190)","v":0},0,0,null,"Rondes effectuées",{"$f":"COUNTIF(D188:BM188,\">0\")","v":0},{"$f":"SUM((BQ188+BQ189)*BQ190)","v":0},0,0,0,0,0,0,0,0,0,0,0,0,0,0,0,0,null,"Rondes Effectuées",{"$f":"COUNTIF(BQ188:CG188,\">0\")","v":0},"Rondes effectuées",{"$f":"SUM(CJ191+BP191)","v":0}]
[null,null,"Nat.Pirates-Hors/FMB"]
[null,null,"Inconnu ou non-confirmé"]
[]
[null,null,"Concentres",{"$f":"COUNTIF(D8:D191,D5)","v":10},{"$f":"COUNTIF(E8:E191,E5)","v":6},{"$f":"COUNTIF(F8:F191,F5)","v":6},7,2,58,3,11,13,12,11,6,12,7,7,6,3,10,0,10,16,9,12,75,2,3,16,2,2,12,7,2,15,9,5,1,5,2,4,92,14,2,8,6,9,1,5,3,3,3,6,11,7,92,0,6,6,{"$f":"COUNTIF(BI8:BI191,BI5)","v":14},92,{"$f":"COUNTIF(BK8:BK191,BK5)","v":92},92,92,{"$f":"SUM(D195:BM195)","v":1055},"Concentres",null,1,2,1,92,{"$f":"COUNTIF(BU8:BU191,BU5)","v":92},92,0,0,0,0,0,0,0,0,0,0,0,{"$f":"SUM(BQ195:CG195)","v":280},"Concentres",null,"Concentres",{"$f":"SUM(CH195+BN195)","v":1335}]
[null,null,"Rondes",{"$f":"COUNTIF(D9:D192,D6)","v":6},{"$f":"COUNTIF(E9:E192,E6)","v":6},{"$f":"COUNTIF(F9:F192,F6)","v":6},7,0,34,3,11,11,12,11,6,4,7,7,6,1,8,2,8,12,7,10,34,0,3,7,2,0,12,7,1,13,9,5,1,3,0,4,92,12,2,6,6,9,1,5,3,1,3,6,11,7,92,12,6,6,14,92,{"$f":"COUNTIF(BK9:BK192,BK6)","v":92},92,92,{"$f":"SUM(D196:BM196)","v":948},"Rondes",null,1,2,1,92,{"$f":"COUNTIF(BU9:BU192,BU6)","v":92},92,0,0,0,0,0,0,0,0,0,0,0,{"$f":"SUM(BQ196:CG196)","v":280},"Rondes",null,"Rondes",{"$f":"SUM(CH196+BN196)","v":1228}]
[]
[]
[]
[]
[null,"Colonne1"]
[1,"BALLION Pierre"]
[{"$f":"SUM(A202+1)","v":2},"BERDOYES Yannick"]
[{"$f":"SUM(A203+1)","v":3},"CLAISSE Jean-Luc"]
[4,"DAVIN Philippe"]
[5,"DE BONDT Philippe"]
[6,"DE SCHEPPERS Jean-Claude"]
[7,"DECELLE Hubert"]
[8,"DONY Marc"]
[9,"FAVRESSSE René"]
[10,"FONTAINE Guy"]
[11,"GADEYNE Claude"]
[12,"GOOSSENS Joël"]
[13,"LAMBOTTE Didier"]
[14,"LEFEVRE Didier"]
[15,"LEROY Michel"]
[16,"LONDOT Philippe"]
[17,"MALLIEN Philippe"]
[18,"MILET Benoit"]
[19,"NIHOUL Dany"]
[20,"PARMENTIER Dominique"]
[21,"POMPIER Philippe"]
[22,"RICHARD Didier"]
[23,"ROUSSEAU Eric"]
[24,"SERGI Gérard"]
[25,"SMETS Rudy"]
[26,"STRYPSTEIN Nicolas"]
[27,"VANBELLINGEN Jean-Claude"]
[28,"VANDERVELDEN Robert"]
[29]
[30]
[31]
[32]
[33]
[34]
[35]
[36]
[37]
[38]
[39]
[40]
[41]
[42]
[43]
[{"$f":"SUM(A244+1)","v":44}]
[45]
[46]

{"sheet":"Passagers Nat","index":5,"n_rows":179,"n_cols":96,"rows_kept":179,"cut":false,"hidden":false,"merged":[[83,1,86,1],[87,1,90,1],[91,1,94,1],[95,1,98,1],[119,1,122,1],[99,1,102,1],[103,1,106,1],[107,1,110,1],[111,1,114,1],[115,1,118,1],[63,1,66,1],[67,1,70,1],[71,1,74,1],[75,1,78,1],[79,1,82,1],[82,93,82,95],[4,91,5,95],[7,1,10,1],[11,1,14,1],[15,1,18,1],[19,1,22,1],[23,1,26,1],[27,1,30,1],[31,1,34,1],[35,1,38,1],[39,1,42,1],[43,1,46,1],[47,1,50,1],[51,1,54,1],[55,1,58,1],[59,1,62,1]]}
[null,null,null,1,{"$f":"SUM(D1+1)","v":2},{"$f":"SUM(E1+1)","v":3},4,5,6,7,8,9,10,11,12,13,14,15,16,17,18,19,20,21,22,23,24,25,26,27,28,29,30,31,32,33,34,35,36,37,38,39,40,41,42,43,44,45,46,47,48,49,50,51,52,53,54,55,56,57,58,59,{"$f":"SUM(BJ1+1)","v":60},{"$f":"SUM(BK1+1)","v":61},{"$f":"SUM(BL1+1)","v":62}]
[null,null,null,902,531,516,103,904,713,912,426,721,730,726,614,716,533,549,427,126,419,516,721,729,0,312,713,508,137,705,516,818,703,531,903,427,710,726,921,103,549,818,1000,406,902,730,426,703,908,705,136,531,912,126,406,622,1000,332,508,332,710,1000,1000,1000,1000]
[null,null,null,"2023-02-12","2023-02-26","2023-03-05","2023-03-12","2023-03-18","2023-03-19","2023-03-26","2023-04-02","2023-04-09","2023-04-10","2023-04-16","2023-04-22","2023-04-23","2023-04-30","2023-05-01","2023-05-07","2023-05-07","2023-05-13","2023-05-17","2023-05-28","2023-05-29",null,"2023-06-10","2023-06-18","2023-06-18","2023-06-24","2023-06-25","2023-07-01","2023-07-01","2023-07-02","2023-07-08","2023-07-15","2023-07-16","2023-07-21","2023-07-23","2023-07-29","2023-08-06","2023-08-06","2023-08-12",null,"2023-08-20","2023-08-26","2023-08-27","2023-09-02","2023-09-03","2023-09-09","2023-09-10","2023-09-16","2023-09-24","2023-09-24","2023-09-30","2023-10-08","2023-10-14",null,"2023-10-29","2023-11-01","2023-11-05","2023-11-11",null,null,null,null,null,null,null,"2023-03-26","2023-03-25"]
[null,null,null,{"$f":"VLOOKUP(D2,'Kilomètre AR'!$A$1:$B$56,2)","v":"AMC GIJVERINKHOVE"},{"$f":"VLOOKUP(E2,'Kilomètre AR'!$A$1:$B$56,2)","v":"MC HOESELT"},{"$f":"VLOOKUP(F2,'Kilomètre AR'!$A$1:$B$56,2)","v":"MC LOTUS"},{"$f":"VLOOKUP(G2,'Kilomètre AR'!$A$1:$B$56,2)","v":"KAMC HERENTALS"},{"$f":"VLOOKUP(H2,'Kilomètre AR'!$A$1:$B$56,2)","v":"KAMC MENEN"},{"$f":"VLOOKUP(I2,'Kilomètre AR'!$A$1:$B$56,2)","v":"MC ST SERVAIS"},{"$f":"VLOOKUP(J2,'Kilomètre AR'!$A$1:$B$56,2)","v":"MTC ZEDELGEM"},{"$f":"VLOOKUP(K2,'Kilomètre AR'!$A$1:$B$56,2)","v":"MTC WELKENRAEDT"},{"$f":"VLOOKUP(L2,'Kilomètre AR'!$A$1:$B$56,2)","v":"MC LES PETITS GRIS   Warisoulx"},{"$f":"VLOOKUP(M2,'Kilomètre AR'!$A$1:$B$56,2)","v":"MC LES 4 & CO  Assesse"},{"$f":"VLOOKUP(N2,'Kilomètre AR'!$A$1:$B$56,2)","v":"MC BIKE AND TRIKE BELGIUM  Dhuy"},{"$f":"VLOOKUP(O2,'Kilomètre AR'!$A$1:$B$56,2)","v":"MC CHEVY RACING   Libramont-Chevigny"},{"$f":"VLOOKUP(P2,'Kilomètre AR'!$A$1:$B$56,2)","v":"AMC FLOREFFE"},{"$f":"VLOOKUP(Q2,'Kilomètre AR'!$A$1:$B$56,2)","v":"MTC 13  Leopoldsburg"},{"$f":"VLOOKUP(R2,'Kilomètre AR'!$A$1:$B$56,2)","v":"MTC WELLEN"},{"$f":"VLOOKUP(S2,'Kilomètre AR'!$A$1:$B$56,2)","v":"MC ZEBUS"},{"$f":"VLOOKUP(T2,'Kilomètre AR'!$A$1:$B$56,2)","v":"MTC TOERVRIENDEN  Berendrecht"},{"$f":"VLOOKUP(U2,'Kilomètre AR'!$A$1:$B$56,2)","v":"AMC ST VITH"},{"$f":"VLOOKUP(V2,'Kilomètre AR'!$A$1:$B$56,2)","v":"MC LOTUS"},{"$f":"VLOOKUP(W2,'Kilomètre AR'!$A$1:$B$56,2)","v":"MC LES PETITS GRIS   Warisoulx"},{"$f":"VLOOKUP(X2,'Kilomètre AR'!$A$1:$B$56,2)","v":"VIROINVAL MOTOR SPORT Dourbes"},{"$f":"VLOOKUP(Y2,'Kilomètre AR'!$A$1:$B$56,2)","v":"RONDE FMB"},{"$f":"VLOOKUP(Z2,'Kilomètre AR'!$A$1:$B$56,2)","v":"MC RESSAIX"},{"$f":"VLOOKUP(AA2,'Kilomètre AR'!$A$1:$B$56,2)","v":"MC ST SERVAIS"},{"$f":"VLOOKUP(AB2,'Kilomètre AR'!$A$1:$B$56,2)","v":"AMC KOERSEL"},{"$f":"VLOOKUP(AC2,'Kilomètre AR'!$A$1:$B$56,2)","v":"MTC YELLS ARMY   Berchem"},{"$f":"VLOOKUP(AD2,'Kilomètre AR'!$A$1:$B$56,2)","v":"MC DINANT"},{"$f":"VLOOKUP(AE2,'Kilomètre AR'!$A$1:$B$56,2)","v":"MC LOTUS"},{"$f":"VLOOKUP(AF2,'Kilomètre AR'!$A$1:$B$56,2)","v":"MOTORSPORT   Aalst"},{"$f":"VLOOKUP(AG2,'Kilomètre AR'!$A$1:$B$56,2)","v":"R CINEY MC"},{"$f":"VLOOKUP(AH2,'Kilomètre AR'!$A$1:$B$56,2)","v":"MC HOESELT"},{"$f":"VLOOKUP(AI2,'Kilomètre AR'!$A$1:$B$56,2)","v":"AMSC LEIELAND  Wervik"},{"$f":"VLOOKUP(AJ2,'Kilomètre AR'!$A$1:$B$56,2)","v":"MC ZEBUS"},{"$f":"VLOOKUP(AK2,'Kilomètre AR'!$A$1:$B$56,2)","v":"MC MOLIGNARD"},{"$f":"VLOOKUP(AL2,'Kilomètre AR'!$A$1:$B$56,2)","v":"MC BIKE AND TRIKE BELGIUM  Dhuy"},{"$f":"VLOOKUP(AM2,'Kilomètre AR'!$A$1:$B$56,2)","v":"MTC VRIJBOS   Houthulst"},{"$f":"VLOOKUP(AN2,'Kilomètre AR'!$A$1:$B$56,2)","v":"KAMC HERENTALS"},{"$f":"VLOOKUP(AO2,'Kilomètre AR'!$A$1:$B$56,2)","v":"MTC WELLEN"},{"$f":"VLOOKUP(AP2,'Kilomètre AR'!$A$1:$B$56,2)","v":"MOTORSPORT   Aalst"},{"$f":"VLOOKUP(AQ2,'Kilomètre AR'!$A$1:$B$56,2)","v":"FREE"},{"$f":"VLOOKUP(AR2,'Kilomètre AR'!$A$1:$B$56,2)","v":"RAMC EUPEN"},{"$f":"VLOOKUP(AS2,'Kilomètre AR'!$A$1:$B$56,2)","v":"AMC GIJVERINKHOVE"},{"$f":"VLOOKUP(AT2,'Kilomètre AR'!$A$1:$B$56,2)","v":"MC LES 4 & CO  Assesse"},{"$f":"VLOOKUP(AU2,'Kilomètre AR'!$A$1:$B$56,2)","v":"MTC WELKENRAEDT"},{"$f":"VLOOKUP(AV2,'Kilomètre AR'!$A$1:$B$56,2)","v":"R CINEY MC"},{"$f":"VLOOKUP(AW2,'Kilomètre AR'!$A$1:$B$56,2)","v":"AMC POPERINGE"},{"$f":"VLOOKUP(AX2,'Kilomètre AR'!$A$1:$B$56,2)","v":"MC DINANT"},{"$f":"VLOOKUP(AY2,'Kilomètre AR'!$A$1:$B$56,2)","v":"MTC AMIGO'S   Schoten"},{"$f":"VLOOKUP(AZ2,'Kilomètre AR'!$A$1:$B$56,2)","v":"MC HOESELT"},{"$f":"VLOOKUP(BA2,'Kilomètre AR'!$A$1:$B$56,2)","v":"MTC ZEDELGEM"},{"$f":"VLOOKUP(BB2,'Kilomètre AR'!$A$1:$B$56,2)","v":"MTC TOERVRIENDEN  Berendrecht"},{"$f":"VLOOKUP(BC2,'Kilomètre AR'!$A$1:$B$56,2)","v":"RAMC EUPEN"},{"$f":"VLOOKUP(BD2,'Kilomètre AR'!$A$1:$B$56,2)","v":"MC DÜREN"},{"$f":"VLOOKUP(BE2,'Kilomètre AR'!$A$1:$B$56,2)","v":"FREE"},{"$f":"VLOOKUP(BF2,'Kilomètre AR'!$A$1:$B$56,2)","v":"MC BUTZ BIKERS 95   Ecaussinnes"},{"$f":"VLOOKUP(BG2,'Kilomètre AR'!$A$1:$B$56,2)","v":"AMC KOERSEL"},{"$f":"VLOOKUP(BH2,'Kilomètre AR'!$A$1:$B$56,2)","v":"MC BUTZ BIKERS 95   Ecaussinnes"},{"$f":"VLOOKUP(BI2,'Kilomètre AR'!$A$1:$B$56,2)","v":"MC MOLIGNARD"},{"$f":"VLOOKUP(BJ2,'Kilomètre AR'!$A$1:$B$56,2)","v":"FREE"},{"$f":"VLOOKUP(BK2,'Kilomètre AR'!$A$1:$B$56,2)","v":"FREE"},{"$f":"VLOOKUP(BL2,'Kilomètre AR'!$A$1:$B$56,2)","v":"FREE"},{"$f":"VLOOKUP(BM2,'Kilomètre AR'!$A$1:$B$56,2)","v":"FREE"},null,null,null,"Offrez-moi la lune","MTC WALLONIE"]
[null,"Aller-Retour",null,{"$f":"VLOOKUP(D2,'Kilomètre AR'!$A$1:$D$56,4)","v":394},{"$f":"VLOOKUP(E2,'Kilomètre AR'!$A$1:$D$56,4)","v":186},{"$f":"VLOOKUP(F2,'Kilomètre AR'!$A$1:$D$56,4)","v":160},{"$f":"VLOOKUP(G2,'Kilomètre AR'!$A$1:$D$56,4)","v":266},{"$f":"VLOOKUP(H2,'Kilomètre AR'!$A$1:$D$56,4)","v":310},{"$f":"VLOOKUP(I2,'Kilomètre AR'!$A$1:$D$56,4)","v":0},{"$f":"VLOOKUP(J2,'Kilomètre AR'!$A$1:$D$56,4)","v":338},{"$f":"VLOOKUP(K2,'Kilomètre AR'!$A$1:$D$56,4)","v":204},{"$f":"VLOOKUP(L2,'Kilomètre AR'!$A$1:$D$56,4)","v":20},{"$f":"VLOOKUP(M2,'Kilomètre AR'!$A$1:$D$56,4)","v":44},{"$f":"VLOOKUP(N2,'Kilomètre AR'!$A$1:$D$56,4)","v":34},{"$f":"VLOOKUP(O2,'Kilomètre AR'!$A$1:$D$56,4)","v":174},{"$f":"VLOOKUP(P2,'Kilomètre AR'!$A$1:$D$56,4)","v":18},{"$f":"VLOOKUP(Q2,'Kilomètre AR'!$A$1:$D$56,4)","v":268},{"$f":"VLOOKUP(R2,'Kilomètre AR'!$A$1:$D$56,4)","v":156},{"$f":"VLOOKUP(S2,'Kilomètre AR'!$A$1:$D$56,4)","v":118},{"$f":"VLOOKUP(T2,'Kilomètre AR'!$A$1:$D$56,4)","v":254},{"$f":"VLOOKUP(U2,'Kilomètre AR'!$A$1:$D$56,4)","v":284},1462,{"$f":"VLOOKUP(W2,'Kilomètre AR'!$A$1:$D$56,4)","v":20},{"$f":"VLOOKUP(X2,'Kilomètre AR'!$A$1:$D$56,4)","v":164},{"$f":"VLOOKUP(Y2,'Kilomètre AR'!$A$1:$D$56,4)","v":0},{"$f":"VLOOKUP(Z2,'Kilomètre AR'!$A$1:$D$56,4)","v":132},{"$f":"VLOOKUP(AA2,'Kilomètre AR'!$A$1:$D$56,4)","v":0},{"$f":"VLOOKUP(AB2,'Kilomètre AR'!$A$1:$D$56,4)","v":260},{"$f":"VLOOKUP(AC2,'Kilomètre AR'!$A$1:$D$56,4)","v":204},{"$f":"VLOOKUP(AD2,'Kilomètre AR'!$A$1:$D$56,4)","v":86},{"$f":"VLOOKUP(AE2,'Kilomètre AR'!$A$1:$D$56,4)","v":160},{"$f":"VLOOKUP(AF2,'Kilomètre AR'!$A$1:$D$56,4)","v":204},{"$f":"VLOOKUP(AG2,'Kilomètre AR'!$A$1:$D$56,4)","v":68},{"$f":"VLOOKUP(AH2,'Kilomètre AR'!$A$1:$D$56,4)","v":186},{"$f":"VLOOKUP(AI2,'Kilomètre AR'!$A$1:$D$56,4)","v":332},{"$f":"VLOOKUP(AJ2,'Kilomètre AR'!$A$1:$D$56,4)","v":118},{"$f":"VLOOKUP(AK2,'Kilomètre AR'!$A$1:$D$56,4)","v":18},{"$f":"VLOOKUP(AL2,'Kilomètre AR'!$A$1:$D$56,4)","v":34},{"$f":"VLOOKUP(AM2,'Kilomètre AR'!$A$1:$D$56,4)","v":374},{"$f":"VLOOKUP(AN2,'Kilomètre AR'!$A$1:$D$56,4)","v":266},{"$f":"VLOOKUP(AO2,'Kilomètre AR'!$A$1:$D$56,4)","v":156},{"$f":"VLOOKUP(AP2,'Kilomètre AR'!$A$1:$D$56,4)","v":204},{"$f":"VLOOKUP(AQ2,'Kilomètre AR'!$A$1:$D$56,4)","v":0},{"$f":"VLOOKUP(AR2,'Kilomètre AR'!$A$1:$D$56,4)","v":210},{"$f":"VLOOKUP(AS2,'Kilomètre AR'!$A$1:$D$56,4)","v":394},{"$f":"VLOOKUP(AT2,'Kilomètre AR'!$A$1:$D$56,4)","v":44},{"$f":"VLOOKUP(AU2,'Kilomètre AR'!$A$1:$D$56,4)","v":204},{"$f":"VLOOKUP(AV2,'Kilomètre AR'!$A$1:$D$56,4)","v":68},{"$f":"VLOOKUP(AW2,'Kilomètre AR'!$A$1:$D$56,4)","v":376},{"$f":"VLOOKUP(AX2,'Kilomètre AR'!$A$1:$D$56,4)","v":86},{"$f":"VLOOKUP(AY2,'Kilomètre AR'!$A$1:$D$56,4)","v":224},{"$f":"VLOOKUP(AZ2,'Kilomètre AR'!$A$1:$D$56,4)","v":186},{"$f":"VLOOKUP(BA2,'Kilomètre AR'!$A$1:$D$56,4)","v":338},{"$f":"VLOOKUP(BB2,'Kilomètre AR'!$A$1:$D$56,4)","v":254},{"$f":"VLOOKUP(BC2,'Kilomètre AR'!$A$1:$D$56,4)","v":210},{"$f":"VLOOKUP(BD2,'Kilomètre AR'!$A$1:$D$56,4)","v":280},{"$f":"VLOOKUP(BE2,'Kilomètre AR'!$A$1:$D$56,4)","v":0},{"$f":"VLOOKUP(BF2,'Kilomètre AR'!$A$1:$D$56,4)","v":118},164,{"$f":"VLOOKUP(BH2,'Kilomètre AR'!$A$1:$D$56,4)","v":118},{"$f":"VLOOKUP(BI2,'Kilomètre AR'!$A$1:$D$56,4)","v":18},{"$f":"VLOOKUP(BJ2,'Kilomètre AR'!$A$1:$D$56,4)","v":0},{"$f":"VLOOKUP(BK2,'Kilomètre AR'!$A$1:$D$56,4)","v":0},{"$f":"VLOOKUP(BL2,'Kilomètre AR'!$A$1:$D$56,4)","v":0},{"$f":"VLOOKUP(BM2,'Kilomètre AR'!$A$1:$D$56,4)","v":0},null,null,null,35,110,null,null,null,-1,-1,-1,-1,-1,-1,-1,-1,-1,-1,-1,-1,null,null,null,null,null,null,"NATIONAL"]
[null,"Ronde",null,130,150,140,130,120,160,150,134,173,160,160,175,180,179,146,170,270,190,212,200,221,null,175,200,160,150,216,175,285,196,180,160,160,195,167,300,150,185,250,null,200,220,240,200,220,153,188,180,150,130,160,160,160,null,160,130,155,126,null,null,null,null,null,null,null,270,200,null,null,null,-1,-1,-1,-1,-1,-1,-1,-1,-1,-1,-1,-1]
[null,null,null,null,null,null,null,null,null,null,null,null,null,null,null,null,null,null,"Hors\nChampionnat",null,null,"Randonnée de l'amitié\nHolzgau / AU",null,null,null,null,null,null,null,null,null,null,null,null,null,null,null,null,null,null,null,null,null,null,null,null,null,null,null,null,null,null,null,null,null,null,null,"160 km au lieu de 118 km\nDépart de Villerot",null,null,null,null,null,null,null,"Sous-Total\nFMB",null,"Total FMB",null,null,null,null,null,null,null,null,null,null,null,null,null,null,null,null,null,"Sous-Totaux\nPirates",null,"Total Pirates",null,"TOTAL",null,null,null,"FMB","Hors FMB","Total"]
[1,{"$f":"VLOOKUP(A8,'Numéro licences'!$A$4:$B$32,2)","v":"BRIATTE Joëlle"},"Aller-Retour",null,null,null,null,null,null,null,null,null,null,null,null,null,null,null,null,null,null,null,null,null,null,null,null,null,null,null,null,null,null,null,null,null,null,null,null,null,null,null,null,null,null,null,null,null,null,null,null,null,null,null,null,null,null,null,null,null,null,null,null,null,null,{"$f":"SUM(D8:BM8)","v":0},"Km  renseignés",{"$f":"SUM(BN8+BN9)","v":0},null,null,null,null,null,null,null,null,null,null,null,null,null,null,null,null,null,{"$f":"SUM(BQ8:CG8)","v":0},"Km  renseignés",{"$f":"SUM(CH8+CH9)","v":0},"Km  renseignés",{"$f":"SUM(BP8+CJ8)","v":0},null,1,{"$f":"VLOOKUP(CN8,A8:B188,2)","v":"BRIATTE Joëlle"},{"$f":"SUM(BP8)","v":0},{"$f":"SUM(CJ8)","v":0},{"$f":"SUM(CP8+CQ8)","v":0}]
[null,null,"Ronde",null,null,null,null,null,null,null,null,null,null,null,null,null,null,null,null,null,null,null,null,null,null,null,null,null,null,null,null,null,null,null,null,null,null,null,null,null,null,null,null,null,null,null,null,null,null,null,null,null,null,null,null,null,null,null,null,null,null,null,null,null,null,{"$f":"SUM(D9:BM9)","v":0},"Km confirmés",{"$f":"SUM(D11:BM11)","v":0},null,null,null,null,null,null,null,null,null,null,null,null,null,null,null,null,null,{"$f":"SUM(BQ9:CG9)","v":0},"Km confirmés",{"$f":"SUM(BQ11:CG11)","v":0},"Km confirmés",{"$f":"SUM(CJ9+BP9)","v":0},null,2,{"$f":"VLOOKUP(CN9,A8:B188,2)","v":"DEFAUX Michèle"},{"$f":"SUM(BP12)","v":884},{"$f":"SUM(CJ12)","v":0},{"$f":"SUM(CP9+CQ9)","v":884}]
[null,null,null,0,0,0,0,0,0,0,0,0,0,0,0,0,0,0,0,0,0,0,0,0,0,0,0,0,0,0,0,0,0,0,0,0,0,0,0,0,0,0,0,0,0,0,0,0,0,0,0,0,0,0,0,0,0,0,0,0,0,0,0,0,0,null,"Rondes confirmées",{"$f":"SUM(C10:BM10)","v":0},0,0,0,0,0,0,0,0,0,0,0,0,0,0,0,0,0,null,"Rondes confirmées",{"$f":"SUM(BQ10:CH10)","v":0},"Rondes confirmées",{"$f":"SUM(CJ10+BP10)","v":0},null,3,{"$f":"VLOOKUP(CN10,A8:B188,2)","v":"DEL FABBRO Laurence"},{"$f":"SUM(BP16)","v":200},{"$f":"SUM(CJ16)","v":0},{"$f":"SUM(CP10+CQ10)","v":200}]
[null,null,null,{"$f":"SUM((D8+D9)*D10)","v":0},0,0,0,0,0,0,0,0,0,0,0,0,0,0,0,0,0,0,0,0,0,0,0,0,0,0,0,0,0,0,0,0,0,0,0,0,0,0,0,0,0,0,0,0,0,0,0,0,0,0,0,0,0,0,0,0,0,0,{"$f":"SUM((BK8+BK9)*BK10)","v":0},0,0,null,"Rondes effectuées",{"$f":"COUNTIF(D8:BM8,\">0\")","v":0},{"$f":"SUM((BQ8+BQ9)*BQ10)","v":0},0,0,0,0,0,0,0,0,0,0,0,0,0,0,0,0,null,"Rondes Effectuées",{"$f":"COUNTIF(BQ8:CG8,\">0\")","v":0},"Rondes effectuées",{"$f":"SUM(CJ11+BP11)","v":0},null,4,{"$f":"VLOOKUP(CN11,A8:B188,2)","v":"FIEVET Nathalie"},{"$f":"SUM(BP20)","v":0},{"$f":"SUM(CJ20)","v":0},0]
[2,{"$f":"VLOOKUP(A12,'Numéro licences'!$A$4:$B$32,2)","v":"DEFAUX Michèle"},"Aller-Retour",null,null,null,null,null,null,null,null,20,44,null,null,null,null,null,null,null,null,null,null,null,null,null,null,null,null,null,null,null,null,null,null,null,18,null,null,null,null,null,null,null,null,null,null,null,null,86,null,null,null,null,null,null,null,null,null,null,null,null,null,null,null,{"$f":"SUM(D12:BM12)","v":168},"Km  renseignés",{"$f":"SUM(BN12+BN13)","v":884},null,null,null,null,null,null,null,null,null,null,null,null,null,null,null,null,null,{"$f":"SUM(BQ12:CG12)","v":0},"Km  renseignés",{"$f":"SUM(CH12+CH13)","v":0},"Km  renseignés",{"$f":"SUM(BP12+CJ12)","v":884},null,5,{"$f":"VLOOKUP(CN12,A8:B188,2)","v":"GOFFIN Guillaume"},{"$f":"SUM(BP24)","v":0},{"$f":"SUM(CJ24)","v":0},0]
[null,null,"Ronde",null,null,null,null,null,null,null,null,173,160,null,null,null,null,null,null,null,null,null,null,null,null,null,null,null,null,null,null,null,null,null,null,null,195,null,null,null,null,null,null,null,null,null,null,null,null,188,null,null,null,null,null,null,null,null,null,null,null,null,null,null,null,{"$f":"SUM(D13:BM13)","v":716},"Km confirmés",{"$f":"SUM(D15:BM15)","v":884},null,null,null,null,null,null,null,null,null,null,null,null,null,null,null,null,null,{"$f":"SUM(BQ13:CG13)","v":0},"Km confirmés",{"$f":"SUM(BQ15:CG15)","v":0},"Km confirmés",{"$f":"SUM(CJ13+BP13)","v":884},null,6,{"$f":"VLOOKUP(CN13,A8:B188,2)","v":"GOUGEUL Sophie"},{"$f":"SUM(BP28)","v":7173},{"$f":"SUM(CJ28)","v":310},7483]
[null,null,null,0,0,0,0,0,0,0,0,1,1,0,0,0,0,0,0,0,0,0,0,0,0,0,0,0,0,0,0,0,0,0,0,0,1,0,0,0,0,0,0,0,0,0,0,0,0,1,0,0,0,0,0,0,0,0,0,0,0,0,0,0,0,null,"Rondes confirmées",{"$f":"SUM(C14:BM14)","v":4},0,0,0,0,0,0,0,0,0,0,0,0,0,0,0,0,0,null,"Rondes confirmées",{"$f":"SUM(BQ14:CH14)","v":0},"Rondes confirmées",{"$f":"SUM(CJ14+BP14)","v":4},null,7,{"$f":"VLOOKUP(CN14,A8:B188,2)","v":"GREGORICS Kathy"},{"$f":"SUM(BP32)","v":360},{"$f":"SUM(CJ32)","v":0},360]
[null,null,null,{"$f":"SUM((D12+D13)*D14)","v":0},0,0,0,0,0,0,0,193,204,0,0,0,0,0,0,0,0,0,0,0,0,0,0,{"$f":"SUM((AB12+AB13)*AB14)","v":0},{"$f":"SUM((AC12+AC13)*AC14)","v":0},{"$f":"SUM((AD12+AD13)*AD14)","v":0},{"$f":"SUM((AE12+AE13)*AE14)","v":0},0,0,0,0,0,213,0,0,0,0,0,0,0,0,0,0,0,0,274,0,0,0,0,0,0,0,0,0,0,0,0,{"$f":"SUM((BK12+BK13)*BK14)","v":0},{"$f":"SUM((BL12+BL13)*BL14)","v":0},{"$f":"SUM((BM12+BM13)*BM14)","v":0},null,"Rondes effectuées",{"$f":"COUNTIF(D12:BM12,\">0\")","v":4},{"$f":"SUM((BQ12+BQ13)*BQ14)","v":0},0,0,0,0,0,0,0,0,0,0,0,0,0,0,0,0,null,"Rondes Effectuées",{"$f":"COUNTIF(BQ12:CG12,\">0\")","v":0},"Rondes effectuées",{"$f":"SUM(CJ15+BP15)","v":4},null,8,{"$f":"VLOOKUP(CN15,A8:B188,2)","v":"LAMBILLON Anne"},{"$f":"SUM(BP36)","v":360},{"$f":"SUM(CJ36)","v":0},360]
[3,{"$f":"VLOOKUP(A16,'Numéro licences'!$A$4:$B$32,2)","v":"DEL FABBRO Laurence"},"Aller-Retour",null,null,null,null,null,null,null,null,null,null,null,null,null,null,null,null,null,null,null,null,null,null,null,0,null,null,null,null,null,null,null,null,null,null,null,null,null,null,null,null,null,null,null,null,null,null,null,null,null,null,null,null,null,null,null,null,null,null,null,null,null,null,{"$f":"SUM(D16:BM16)","v":0},"Km  renseignés",{"$f":"SUM(BN16+BN17)","v":200},null,null,null,null,null,null,null,null,null,null,null,null,null,null,null,null,null,{"$f":"SUM(BQ16:CG16)","v":0},"Km  renseignés",{"$f":"SUM(CH16+CH17)","v":0},"Km  renseignés",{"$f":"SUM(BP16+CJ16)","v":200},null,9,{"$f":"VLOOKUP(CN16,A8:B188,2)","v":"LAMIROY Anne"},{"$f":"SUM(BP40)","v":0},{"$f":"SUM(CJ40)","v":0},0]
[null,null,"Ronde",null,null,null,null,null,null,null,null,null,null,null,null,null,null,null,null,null,null,null,null,null,null,null,200,null,null,null,null,null,null,null,null,null,null,null,null,null,null,null,null,null,null,null,null,null,null,null,null,null,null,null,null,null,null,null,null,null,null,null,null,null,null,{"$f":"SUM(D17:BM17)","v":200},"Km confirmés",{"$f":"SUM(D19:BM19)","v":200},null,null,null,null,null,null,null,null,null,null,null,null,null,null,null,null,null,{"$f":"SUM(BQ17:CG17)","v":0},"Km confirmés",{"$f":"SUM(BQ19:CG19)","v":0},"Km confirmés",{"$f":"SUM(CJ17+BP17)","v":200},null,10,{"$f":"VLOOKUP(CN17,A8:B188,2)","v":"LEROY Laure"},{"$f":"SUM(BP44)","v":3321},{"$f":"SUM(CJ44)","v":0},3321]
[null,null,null,0,0,0,0,0,0,0,0,0,0,0,0,0,0,0,0,0,0,0,0,0,0,0,1,0,0,0,0,0,0,0,0,0,0,0,0,0,0,0,0,0,0,0,0,0,0,0,0,0,0,0,0,0,0,0,0,0,0,0,0,0,0,null,"Rondes confirmées",{"$f":"SUM(C18:BM18)","v":1},0,0,0,0,0,0,0,0,0,0,0,0,0,0,0,0,0,null,"Rondes confirmées",{"$f":"SUM(BQ18:CH18)","v":0},"Rondes confirmées",{"$f":"SUM(CJ18+BP18)","v":1},null,11,{"$f":"VLOOKUP(CN18,A8:B188,2)","v":"MALLIEN Emelyne"},{"$f":"SUM(BP48)","v":0},{"$f":"SUM(CJ48)","v":0},0]
[null,null,null,{"$f":"SUM((D16+D17)*D18)","v":0},0,0,0,0,0,0,0,0,0,0,0,0,0,0,0,0,0,0,0,0,0,0,200,{"$f":"SUM((AB16+AB17)*AB18)","v":0},{"$f":"SUM((AC16+AC17)*AC18)","v":0},{"$f":"SUM((AD16+AD17)*AD18)","v":0},{"$f":"SUM((AE16+AE17)*AE18)","v":0},0,0,0,0,0,0,0,0,0,0,0,0,0,0,0,0,0,0,0,0,0,0,0,0,0,0,0,0,0,0,0,{"$f":"SUM((BK16+BK17)*BK18)","v":0},{"$f":"SUM((BL16+BL17)*BL18)","v":0},{"$f":"SUM((BM16+BM17)*BM18)","v":0},null,"Rondes effectuées",{"$f":"COUNTIF(D16:BM16,\">0\")","v":0},{"$f":"SUM((BQ16+BQ17)*BQ18)","v":0},0,0,0,0,0,0,0,0,0,0,0,0,0,0,0,0,null,"Rondes Effectuées",{"$f":"COUNTIF(BQ16:CG16,\">0\")","v":0},"Rondes effectuées",{"$f":"SUM(CJ19+BP19)","v":0},null,12,{"$f":"VLOOKUP(CN19,A8:B188,2)","v":"PIERARD Anne-Sophie"},{"$f":"SUM(BP52)","v":0},{"$f":"SUM(CJ52)","v":0},0]
[4,{"$f":"VLOOKUP(A20,'Numéro licences'!$A$4:$B$32,2)","v":"FIEVET Nathalie"},"Aller-Retour",null,null,null,null,null,null,null,null,null,null,null,null,null,null,null,null,null,null,null,null,null,null,null,null,null,null,null,null,null,null,null,null,null,null,null,null,null,null,null,null,null,null,null,null,null,null,null,null,null,null,null,null,null,null,null,null,null,null,null,null,null,null,{"$f":"SUM(D20:BM20)","v":0},"Km  renseignés",{"$f":"SUM(BN20+BN21)","v":0},null,null,null,null,null,null,null,null,null,null,null,null,null,null,null,null,null,{"$f":"SUM(BQ20:CG20)","v":0},"Km  renseignés",{"$f":"SUM(CH20+CH21)","v":0},"Km  renseignés",{"$f":"SUM(BP20+CJ20)","v":0},null,13,{"$f":"VLOOKUP(CN20,A8:B188,2)","v":"PONT Patricia"},{"$f":"SUM(BP56)","v":10021},{"$f":"SUM(CJ56)","v":0},10021]
[null,null,"Ronde",null,null,null,null,null,null,null,null,null,null,null,null,null,null,null,null,null,null,null,null,null,null,null,null,null,null,null,null,null,null,null,null,null,null,null,null,null,null,null,null,null,null,null,null,null,null,null,null,null,null,null,null,null,null,null,null,null,null,null,null,null,null,{"$f":"SUM(D21:BM21)","v":0},"Km confirmés",{"$f":"SUM(D23:BM23)","v":0},null,null,null,null,null,null,null,null,null,null,null,null,null,null,null,null,null,{"$f":"SUM(BQ21:CG21)","v":0},"Km confirmés",{"$f":"SUM(BQ23:CG23)","v":0},"Km confirmés",{"$f":"SUM(CJ21+BP21)","v":0},null,14,{"$f":"VLOOKUP(CN21,A8:B188,2)","v":"MISEUR Carine"},{"$f":"SUM(BP60)","v":5164},{"$f":"SUM(CJ60)","v":0},5164]
[null,null,null,0,0,0,0,0,0,0,0,0,0,0,0,0,0,0,0,0,0,0,0,0,0,0,0,0,0,0,0,0,0,0,0,0,0,0,0,0,0,0,0,0,0,0,0,0,0,0,0,0,0,0,0,0,0,0,0,0,0,0,0,0,0,null,"Rondes confirmées",{"$f":"SUM(C22:BM22)","v":0},0,0,0,0,0,0,0,0,0,0,0,0,0,0,0,0,0,null,"Rondes confirmées",{"$f":"SUM(BQ22:CH22)","v":0},"Rondes confirmées",{"$f":"SUM(CJ22+BP22)","v":0},null,15,{"$f":"VLOOKUP(CN22,A8:B188,2)","v":"ARENZANA Jennifer"},{"$f":"SUM(BP64)","v":779},{"$f":"SUM(CJ64)","v":0},779]
[null,null,null,{"$f":"SUM((D20+D21)*D22)","v":0},0,0,0,0,0,0,0,0,0,0,0,0,0,0,0,0,0,0,0,0,0,0,0,{"$f":"SUM((AB20+AB21)*AB22)","v":0},{"$f":"SUM((AC20+AC21)*AC22)","v":0},{"$f":"SUM((AD20+AD21)*AD22)","v":0},{"$f":"SUM((AE20+AE21)*AE22)","v":0},0,0,0,0,0,0,0,0,0,0,0,0,0,0,0,0,0,0,0,0,0,0,0,0,0,0,0,0,0,0,0,{"$f":"SUM((BK20+BK21)*BK22)","v":0},{"$f":"SUM((BL20+BL21)*BL22)","v":0},{"$f":"SUM((BM20+BM21)*BM22)","v":0},null,"Rondes effectuées",{"$f":"COUNTIF(D20:BM20,\">0\")","v":0},{"$f":"SUM((BQ20+BQ21)*BQ22)","v":0},0,0,0,0,0,0,0,0,0,0,0,0,0,0,0,0,null,"Rondes Effectuées",{"$f":"COUNTIF(BQ20:CG20,\">0\")","v":0},"Rondes effectuées",{"$f":"SUM(CJ23+BP23)","v":0},null,16,{"$f":"VLOOKUP(CN23,A8:B188,2)","v":0},{"$f":"SUM(BP68)","v":0},{"$f":"SUM(CJ68)","v":0},0]
[5,{"$f":"VLOOKUP(A24,'Numéro licences'!$A$4:$B$32,2)","v":"GOFFIN Guillaume"},"Aller-Retour",null,null,null,null,null,null,null,null,null,null,null,null,null,null,null,null,null,null,null,null,null,null,null,null,null,null,null,null,null,null,null,null,null,null,null,null,null,null,null,null,null,null,null,null,null,null,null,null,null,null,null,null,null,null,null,null,null,null,null,null,null,null,{"$f":"SUM(D24:BM24)","v":0},"Km  renseignés",{"$f":"SUM(BN24+BN25)","v":0},null,null,null,null,null,null,null,null,null,null,null,null,null,null,null,null,null,{"$f":"SUM(BQ24:CG24)","v":0},"Km  renseignés",{"$f":"SUM(CH24+CH25)","v":0},"Km  renseignés",{"$f":"SUM(BP24+CJ24)","v":0},null,17,{"$f":"VLOOKUP(CN24,A8:B188,2)","v":0},{"$f":"SUM(BP72)","v":0},{"$f":"SUM(CJ72)","v":0},0]
[null,null,"Ronde",null,null,null,null,null,null,null,null,null,null,null,null,null,null,null,null,null,null,null,null,null,null,null,null,null,null,null,null,null,null,null,null,null,null,null,null,null,null,null,null,null,null,null,null,null,null,null,null,null,null,null,null,null,null,null,null,null,null,null,null,null,null,{"$f":"SUM(D25:BM25)","v":0},"Km confirmés",{"$f":"SUM(D27:BM27)","v":0},null,null,null,null,null,null,null,null,null,null,null,null,null,null,null,null,null,{"$f":"SUM(BQ25:CG25)","v":0},"Km confirmés",{"$f":"SUM(BQ27:CG27)","v":0},"Km confirmés",{"$f":"SUM(CJ25+BP25)","v":0},null,18,{"$f":"VLOOKUP(CN25,A8:B188,2)","v":0},{"$f":"SUM(BP76)","v":0},{"$f":"SUM(CJ76)","v":0},0]
[null,null,null,0,0,0,0,0,0,0,0,0,0,0,0,0,0,0,0,0,0,0,0,0,0,0,0,0,0,0,0,0,0,0,0,0,0,0,0,0,0,0,0,0,0,0,0,0,0,0,0,0,0,0,0,0,0,0,0,0,0,0,0,0,0,null,"Rondes confirmées",{"$f":"SUM(C26:BM26)","v":0},0,0,0,0,0,0,0,0,0,0,0,0,0,0,0,0,0,null,"Rondes confirmées",{"$f":"SUM(BQ26:CH26)","v":0},"Rondes confirmées",{"$f":"SUM(CJ26+BP26)","v":0},null,19,{"$f":"VLOOKUP(CN26,A8:B188,2)","v":0},{"$f":"SUM(BP80)","v":0},{"$f":"SUM(CJ80)","v":0},0]
[null,null,null,{"$f":"SUM((D24+D25)*D26)","v":0},0,0,0,0,0,0,0,0,0,0,0,0,0,0,0,0,0,0,0,0,0,0,0,{"$f":"SUM((AB24+AB25)*AB26)","v":0},{"$f":"SUM((AC24+AC25)*AC26)","v":0},{"$f":"SUM((AD24+AD25)*AD26)","v":0},{"$f":"SUM((AE24+AE25)*AE26)","v":0},0,0,0,0,0,0,0,0,0,0,0,0,0,0,0,0,0,0,0,0,0,0,0,0,0,0,0,0,0,0,0,{"$f":"SUM((BK24+BK25)*BK26)","v":0},{"$f":"SUM((BL24+BL25)*BL26)","v":0},{"$f":"SUM((BM24+BM25)*BM26)","v":0},null,"Rondes effectuées",{"$f":"COUNTIF(D24:BM24,\">0\")","v":0},{"$f":"SUM((BQ24+BQ25)*BQ26)","v":0},0,0,0,0,0,0,0,0,0,0,0,0,0,0,0,0,null,"Rondes Effectuées",{"$f":"COUNTIF(BQ24:CG24,\">0\")","v":0},"Rondes effectuées",{"$f":"SUM(CJ27+BP27)","v":0},null,20,{"$f":"VLOOKUP(CN27,A8:B188,2)","v":0},{"$f":"SUM(BP84)","v":0},{"$f":"SUM(CJ84)","v":0},0]
[6,{"$f":"VLOOKUP(A28,'Numéro licences'!$A$4:$B$32,2)","v":"GOUGEUL Sophie"},"Aller-Retour",394,186,160,266,null,null,null,204,20,44,34,null,null,null,156,null,254,284,null,null,164,null,132,0,null,null,null,null,null,null,186,null,118,18,null,null,null,null,null,null,null,null,null,204,68,null,null,null,null,null,null,210,null,null,null,null,118,18,null,null,null,null,{"$f":"SUM(D28:BM28)","v":3238},"Km  renseignés",{"$f":"SUM(BN28+BN29)","v":7173},null,110,null,null,null,null,null,null,null,null,null,null,null,null,null,null,null,{"$f":"SUM(BQ28:CG28)","v":110},"Km  renseignés",{"$f":"SUM(CH28+CH29)","v":310},"Km  renseignés",{"$f":"SUM(BP28+CJ28)","v":7483},null,21,{"$f":"VLOOKUP(CN28,A8:B188,2)","v":0},{"$f":"SUM(BP88)","v":0},{"$f":"SUM(CJ88)","v":0},0]
[null,null,"Ronde",130,150,140,130,null,160,null,134,173,160,160,null,null,null,146,null,270,190,null,null,221,null,175,200,null,null,null,null,null,null,180,null,160,195,null,null,null,null,null,null,null,null,null,200,220,null,null,null,null,null,null,160,null,null,null,null,155,126,null,null,null,null,{"$f":"SUM(D29:BM29)","v":3935},"Km confirmés",{"$f":"SUM(D31:BM31)","v":7173},null,200,null,null,null,null,null,null,null,null,null,null,null,null,null,null,null,{"$f":"SUM(BQ29:CG29)","v":200},"Km confirmés",{"$f":"SUM(BQ31:CG31)","v":310},"Km confirmés",{"$f":"SUM(CJ29+BP29)","v":7483},null,22,{"$f":"VLOOKUP(CN29,A8:B188,2)","v":0},{"$f":"SUM(BP92)","v":0},{"$f":"SUM(CJ92)","v":0},0]
[null,null,null,1,1,1,1,0,1,0,1,1,1,1,0,0,0,1,0,1,1,0,0,1,0,1,1,0,0,0,0,0,0,1,0,1,1,0,0,0,0,0,0,0,0,0,1,1,0,0,0,0,0,0,1,0,0,0,0,1,1,0,0,0,0,null,"Rondes confirmées",{"$f":"SUM(C30:BM30)","v":23},0,1,0,0,0,0,0,0,0,0,0,0,0,0,0,0,0,null,"Rondes confirmées",{"$f":"SUM(BQ30:CH30)","v":1},"Rondes confirmées",{"$f":"SUM(CJ30+BP30)","v":24},null,23,{"$f":"VLOOKUP(CN30,A8:B188,2)","v":0},{"$f":"SUM(BP96)","v":0},{"$f":"SUM(CJ96)","v":0},0]
[null,null,null,{"$f":"SUM((D28+D29)*D30)","v":524},336,300,396,0,160,0,338,193,204,194,0,0,0,302,0,524,474,0,0,385,0,307,200,{"$f":"SUM((AB28+AB29)*AB30)","v":0},{"$f":"SUM((AC28+AC29)*AC30)","v":0},{"$f":"SUM((AD28+AD29)*AD30)","v":0},{"$f":"SUM((AE28+AE29)*AE30)","v":0},0,0,366,0,278,213,0,0,0,0,0,0,0,0,0,404,288,0,0,0,0,0,0,370,0,0,0,0,273,144,0,{"$f":"SUM((BK28+BK29)*BK30)","v":0},{"$f":"SUM((BL28+BL29)*BL30)","v":0},{"$f":"SUM((BM28+BM29)*BM30)","v":0},null,"Rondes effectuées",{"$f":"COUNTIF(D28:BM28,\">0\")","v":21},{"$f":"SUM((BQ28+BQ29)*BQ30)","v":0},310,0,0,0,0,0,0,0,0,0,0,0,0,0,0,0,null,"Rondes Effectuées",{"$f":"COUNTIF(BQ28:CG28,\">0\")","v":1},"Rondes effectuées",{"$f":"SUM(CJ31+BP31)","v":22},null,24,{"$f":"VLOOKUP(CN31,A8:B188,2)","v":0},{"$f":"SUM(BP100)","v":0},{"$f":"SUM(CJ100)","v":0},0]
[7,{"$f":"VLOOKUP(A32,'Numéro licences'!$A$4:$B$32,2)","v":"GREGORICS Kathy"},"Aller-Retour",null,null,null,null,null,null,null,null,null,null,null,null,null,null,null,null,null,null,null,null,null,null,null,0,null,null,null,null,null,null,null,null,null,null,null,null,null,null,null,null,null,null,null,null,null,null,null,null,null,null,null,null,null,null,null,null,null,null,null,null,null,null,{"$f":"SUM(D32:BM32)","v":0},"Km  renseignés",{"$f":"SUM(BN32+BN33)","v":360},null,null,null,null,null,null,null,null,null,null,null,null,null,null,null,null,null,{"$f":"SUM(BQ32:CG32)","v":0},"Km  renseignés",{"$f":"SUM(CH32+CH33)","v":0},"Km  renseignés",{"$f":"SUM(BP32+CJ32)","v":360},null,25,{"$f":"VLOOKUP(CN32,A8:B188,2)","v":0},{"$f":"SUM(BP104)","v":0},{"$f":"SUM(CJ104)","v":0},0]
[null,null,"Ronde",null,null,null,null,null,160,null,null,null,null,null,null,null,null,null,null,null,null,null,null,null,null,null,200,null,null,null,null,null,null,null,null,null,null,null,null,null,null,null,null,null,null,null,null,null,null,null,null,null,null,null,null,null,null,null,null,null,null,null,null,null,null,{"$f":"SUM(D33:BM33)","v":360},"Km confirmés",{"$f":"SUM(D35:BM35)","v":0},null,null,null,null,null,null,null,null,null,null,null,null,null,null,null,null,null,{"$f":"SUM(BQ33:CG33)","v":0},"Km confirmés",{"$f":"SUM(BQ35:CG35)","v":0},"Km confirmés",{"$f":"SUM(CJ33+BP33)","v":0},null,26,{"$f":"VLOOKUP(CN33,A8:B188,2)","v":0},{"$f":"SUM(BP108)","v":0},{"$f":"SUM(CJ108)","v":0},0]
[null,null,null,0,0,0,0,0,0,0,0,0,0,0,0,0,0,0,0,0,0,0,0,0,0,0,0,0,0,0,0,0,0,0,0,0,0,0,0,0,0,0,0,0,0,0,0,0,0,0,0,0,0,0,0,0,0,0,0,0,0,0,0,0,0,null,"Rondes confirmées",{"$f":"SUM(C34:BM34)","v":0},0,0,0,0,0,0,0,0,0,0,0,0,0,0,0,0,0,null,"Rondes confirmées",{"$f":"SUM(BQ34:CH34)","v":0},"Rondes confirmées",{"$f":"SUM(CJ34+BP34)","v":0},null,27,{"$f":"VLOOKUP(CN34,A8:B188,2)","v":0},{"$f":"SUM(BP112)","v":0},{"$f":"SUM(CJ112)","v":0},0]
[null,null,null,{"$f":"SUM((D32+D33)*D34)","v":0},0,0,0,0,0,0,0,0,0,0,0,0,0,0,0,0,0,0,0,0,0,0,0,{"$f":"SUM((AB32+AB33)*AB34)","v":0},{"$f":"SUM((AC32+AC33)*AC34)","v":0},{"$f":"SUM((AD32+AD33)*AD34)","v":0},{"$f":"SUM((AE32+AE33)*AE34)","v":0},0,0,0,0,0,0,0,0,0,0,0,0,0,0,0,0,0,0,0,0,0,0,0,0,0,0,0,0,0,0,0,{"$f":"SUM((BK32+BK33)*BK34)","v":0},{"$f":"SUM((BL32+BL33)*BL34)","v":0},{"$f":"SUM((BM32+BM33)*BM34)","v":0},null,"Rondes effectuées",{"$f":"COUNTIF(D32:BM32,\">0\")","v":0},{"$f":"SUM((BQ32+BQ33)*BQ34)","v":0},0,0,0,0,0,0,0,0,0,0,0,0,0,0,0,0,null,"Rondes Effectuées",{"$f":"COUNTIF(BQ32:CG32,\">0\")","v":0},"Rondes effectuées",{"$f":"SUM(CJ35+BP35)","v":0},null,28,{"$f":"VLOOKUP(CN35,A8:B188,2)","v":0},{"$f":"SUM(BP116)","v":0},{"$f":"SUM(CJ116)","v":0},0]
[8,{"$f":"VLOOKUP(A36,'Numéro licences'!$A$4:$B$32,2)","v":"LAMBILLON Anne"},"Aller-Retour",null,null,null,null,null,null,null,null,null,null,null,null,null,null,null,null,null,null,null,null,null,null,null,0,null,null,null,null,null,null,null,null,null,null,null,null,null,null,null,null,null,null,null,null,null,null,null,null,null,null,null,null,null,null,null,null,null,null,null,null,null,null,{"$f":"SUM(D36:BM36)","v":0},"Km  renseignés",{"$f":"SUM(BN36+BN37)","v":360},null,null,null,null,null,null,null,null,null,null,null,null,null,null,null,null,null,{"$f":"SUM(BQ36:CG36)","v":0},"Km  renseignés",{"$f":"SUM(CH36+CH37)","v":0},"Km  renseignés",{"$f":"SUM(BP36+CJ36)","v":360},null,29,{"$f":"VLOOKUP(CN36,A8:B188,2)","v":0},{"$f":"SUM(BP120)","v":0},{"$f":"SUM(CJ120)","v":0},0]
[null,null,"Ronde",null,null,null,null,null,160,null,null,null,null,null,null,null,null,null,null,null,null,null,null,null,null,null,200,null,null,null,null,null,null,null,null,null,null,null,null,null,null,null,null,null,null,null,null,null,null,null,null,null,null,null,null,null,null,null,null,null,null,null,null,null,null,{"$f":"SUM(D37:BM37)","v":360},"Km confirmés",{"$f":"SUM(D39:BM39)","v":360},null,null,null,null,null,null,null,null,null,null,null,null,null,null,null,null,null,{"$f":"SUM(BQ37:CG37)","v":0},"Km confirmés",{"$f":"SUM(BQ39:CG39)","v":0},"Km confirmés",{"$f":"SUM(CJ37+BP37)","v":360}]
[null,null,null,0,0,0,0,0,1,0,0,0,0,0,0,0,0,0,0,0,0,0,0,0,0,0,1,0,0,0,0,0,0,0,0,0,0,0,0,0,0,0,0,0,0,0,0,0,0,0,0,0,0,0,0,0,0,0,0,0,0,0,0,0,0,null,"Rondes confirmées",{"$f":"SUM(C38:BM38)","v":2},0,0,0,0,0,0,0,0,0,0,0,0,0,0,0,0,0,null,"Rondes confirmées",{"$f":"SUM(BQ38:CH38)","v":0},"Rondes confirmées",{"$f":"SUM(CJ38+BP38)","v":2}]
[null,null,null,{"$f":"SUM((D36+D37)*D38)","v":0},0,0,0,0,160,0,0,0,0,0,0,0,0,0,0,0,0,0,0,0,0,0,200,{"$f":"SUM((AB36+AB37)*AB38)","v":0},{"$f":"SUM((AC36+AC37)*AC38)","v":0},{"$f":"SUM((AD36+AD37)*AD38)","v":0},{"$f":"SUM((AE36+AE37)*AE38)","v":0},0,0,0,0,0,0,0,0,0,0,0,0,0,0,0,0,0,0,0,0,0,0,0,0,0,0,0,0,0,0,0,{"$f":"SUM((BK36+BK37)*BK38)","v":0},{"$f":"SUM((BL36+BL37)*BL38)","v":0},{"$f":"SUM((BM36+BM37)*BM38)","v":0},null,"Rondes effectuées",{"$f":"COUNTIF(D36:BM36,\">0\")","v":0},{"$f":"SUM((BQ36+BQ37)*BQ38)","v":0},0,0,0,0,0,0,0,0,0,0,0,0,0,0,0,0,null,"Rondes Effectuées",{"$f":"COUNTIF(BQ36:CG36,\">0\")","v":0},"Rondes effectuées",{"$f":"SUM(CJ39+BP39)","v":0}]
[9,{"$f":"VLOOKUP(A40,'Numéro licences'!$A$4:$B$32,2)","v":"LAMIROY Anne"},"Aller-Retour",null,null,null,null,null,null,null,null,null,null,null,null,null,null,null,null,null,null,null,null,null,null,null,null,null,null,null,null,null,null,null,null,null,null,null,null,null,null,null,null,null,null,null,null,null,null,null,null,null,null,null,null,null,null,null,null,null,null,null,null,null,null,{"$f":"SUM(D40:BM40)","v":0},"Km  renseignés",{"$f":"SUM(BN40+BN41)","v":0},null,null,null,null,null,null,null,null,null,null,null,null,null,null,null,null,null,{"$f":"SUM(BQ40:CG40)","v":0},"Km  renseignés",{"$f":"SUM(CH40+CH41)","v":0},"Km  renseignés",{"$f":"SUM(BP40+CJ40)","v":0}]
[null,null,"Ronde",null,null,null,null,null,null,null,null,null,null,null,null,null,null,null,null,null,null,null,null,null,null,null,null,null,null,null,null,null,null,null,null,null,null,null,null,null,null,null,null,null,null,null,null,null,null,null,null,null,null,null,null,null,null,null,null,null,null,null,null,null,null,{"$f":"SUM(D41:BM41)","v":0},"Km confirmés",{"$f":"SUM(D43:BM43)","v":0},null,null,null,null,null,null,null,null,null,null,null,null,null,null,null,null,null,{"$f":"SUM(BQ41:CG41)","v":0},"Km confirmés",{"$f":"SUM(BQ43:CG43)","v":0},"Km confirmés",{"$f":"SUM(CJ41+BP41)","v":0}]
[null,null,null,0,0,0,0,0,0,0,0,0,0,0,0,0,0,0,0,0,0,0,0,0,0,0,0,0,0,0,0,0,0,0,0,0,0,0,0,0,0,0,0,0,0,0,0,0,0,0,0,0,0,0,0,0,0,0,0,0,0,0,0,0,0,null,"Rondes confirmées",{"$f":"SUM(C42:BM42)","v":0},0,0,0,0,0,0,0,0,0,0,0,0,0,0,0,0,0,null,"Rondes confirmées",{"$f":"SUM(BQ42:CH42)","v":0},"Rondes confirmées",{"$f":"SUM(CJ42+BP42)","v":0},null,null,null,{"$f":"SUM(CP9:CP36)","v":28262},{"$f":"SUM(CQ9:CQ36)","v":310},{"$f":"SUM(CR8:CR36)","v":28572}]
[null,null,null,{"$f":"SUM((D40+D41)*D42)","v":0},0,0,0,0,0,0,0,0,0,0,0,0,0,0,0,0,0,0,0,0,0,0,0,{"$f":"SUM((AB40+AB41)*AB42)","v":0},{"$f":"SUM((AC40+AC41)*AC42)","v":0},{"$f":"SUM((AD40+AD41)*AD42)","v":0},{"$f":"SUM((AE40+AE41)*AE42)","v":0},0,0,0,0,0,0,0,0,0,0,0,0,0,0,0,0,0,0,0,0,0,0,0,0,0,0,0,0,0,0,0,{"$f":"SUM((BK40+BK41)*BK42)","v":0},{"$f":"SUM((BL40+BL41)*BL42)","v":0},{"$f":"SUM((BM40+BM41)*BM42)","v":0},null,"Rondes effectuées",{"$f":"COUNTIF(D40:BM40,\">0\")","v":0},{"$f":"SUM((BQ40+BQ41)*BQ42)","v":0},0,0,0,0,0,0,0,0,0,0,0,0,0,0,0,0,null,"Rondes Effectuées",{"$f":"COUNTIF(BQ40:CG40,\">0\")","v":0},"Rondes effectuées",{"$f":"SUM(CJ43+BP43)","v":0},null,null,null,{"$f":"SUM(CP42/CR42)","v":0.98915021699566008},{"$f":"SUM(CQ42/CR42)","v":1.0849783004339914E-2}]
[10,{"$f":"VLOOKUP(A44,'Numéro licences'!$A$4:$B$32,2)","v":"LEROY Laure"},"Aller-Retour",394,null,null,null,null,null,null,null,null,null,34,null,18,null,null,null,null,null,1545,null,null,null,132,0,null,null,null,null,null,null,null,null,null,null,null,null,null,null,null,null,210,null,null,null,68,null,null,null,null,null,null,null,null,null,null,null,null,18,null,null,null,null,{"$f":"SUM(D44:BM44)","v":2419},"Km  renseignés",{"$f":"SUM(BN44+BN45)","v":3321},null,null,null,null,null,null,null,null,null,null,null,null,null,null,null,null,null,{"$f":"SUM(BQ44:CG44)","v":0},"Km  renseignés",{"$f":"SUM(CH44+CH45)","v":0},"Km  renseignés",{"$f":"SUM(BP44+CJ44)","v":3321},null,null,null,"FMB","Hors FMB"]
[null,null,"Ronde",0,null,null,null,null,null,null,null,null,null,164,null,0,null,null,null,null,null,212,null,null,null,0,200,null,null,null,null,null,null,null,null,null,null,null,null,null,null,null,null,200,null,null,null,0,null,null,null,null,null,null,null,null,null,null,null,null,126,null,null,null,null,{"$f":"SUM(D45:BM45)","v":902},"Km confirmés",{"$f":"SUM(D47:BM47)","v":3321},null,null,null,null,null,null,null,null,null,null,null,null,null,null,null,null,null,{"$f":"SUM(BQ45:CG45)","v":0},"Km confirmés",{"$f":"SUM(BQ47:CG47)","v":0},"Km confirmés",{"$f":"SUM(CJ45+BP45)","v":3321}]
[null,null,null,1,0,0,0,0,0,0,0,0,0,1,0,1,0,0,0,0,0,1,0,0,0,1,1,0,0,0,0,0,0,0,0,0,0,0,0,0,0,0,0,1,0,0,0,1,0,0,0,0,0,0,0,0,0,0,0,0,1,0,0,0,0,null,"Rondes confirmées",{"$f":"SUM(C46:BM46)","v":9},0,0,0,0,0,0,0,0,0,0,0,0,0,0,0,0,0,null,"Rondes confirmées",{"$f":"SUM(BQ46:CH46)","v":0},"Rondes confirmées",{"$f":"SUM(CJ46+BP46)","v":9}]
[null,null,null,{"$f":"SUM((D44+D45)*D46)","v":394},0,0,0,0,0,0,0,0,0,198,0,18,0,0,0,0,0,1757,0,0,0,132,200,{"$f":"SUM((AB44+AB45)*AB46)","v":0},{"$f":"SUM((AC44+AC45)*AC46)","v":0},{"$f":"SUM((AD44+AD45)*AD46)","v":0},{"$f":"SUM((AE44+AE45)*AE46)","v":0},0,0,0,0,0,0,0,0,0,0,0,0,410,0,0,0,68,0,0,0,0,0,0,0,0,0,0,0,0,144,0,{"$f":"SUM((BK44+BK45)*BK46)","v":0},{"$f":"SUM((BL44+BL45)*BL46)","v":0},{"$f":"SUM((BM44+BM45)*BM46)","v":0},null,"Rondes effectuées",{"$f":"COUNTIF(D44:BM44,\">0\")","v":8},{"$f":"SUM((BQ44+BQ45)*BQ46)","v":0},0,0,0,0,0,0,0,0,0,0,0,0,0,0,0,0,null,"Rondes Effectuées",{"$f":"COUNTIF(BQ44:CG44,\">0\")","v":0},"Rondes effectuées",{"$f":"SUM(CJ47+BP47)","v":8}]
[11,{"$f":"VLOOKUP(A48,'Numéro licences'!$A$4:$B$32,2)","v":"MALLIEN Emelyne"},"Aller-Retour",null,null,null,null,null,null,null,null,null,null,null,null,null,null,null,null,null,null,null,null,null,null,null,null,null,null,null,null,null,null,null,null,null,null,null,null,null,null,null,null,null,null,null,null,null,null,null,null,null,null,null,null,null,null,null,null,null,null,null,null,null,null,{"$f":"SUM(D48:BM48)","v":0},"Km  renseignés",{"$f":"SUM(BN48+BN49)","v":0},null,null,null,null,null,null,null,null,null,null,null,null,null,null,null,null,null,{"$f":"SUM(BQ48:CG48)","v":0},"Km  renseignés",{"$f":"SUM(CH48+CH49)","v":0},"Km  renseignés",{"$f":"SUM(BP48+CJ48)","v":0}]
[null,null,"Ronde",null,null,null,null,null,null,null,null,null,null,null,null,null,null,null,null,null,null,null,null,null,null,null,null,null,null,null,null,null,null,null,null,null,null,null,null,null,null,null,null,null,null,null,null,null,null,null,null,null,null,null,null,null,null,null,null,null,null,null,null,null,null,{"$f":"SUM(D49:BM49)","v":0},"Km confirmés",{"$f":"SUM(D51:BM51)","v":0},null,null,null,null,null,null,null,null,null,null,null,null,null,null,null,null,null,{"$f":"SUM(BQ49:CG49)","v":0},"Km confirmés",{"$f":"SUM(BQ51:CG51)","v":0},"Km confirmés",{"$f":"SUM(CJ49+BP49)","v":0}]
[null,null,null,0,0,0,0,0,0,0,0,0,0,0,0,0,0,0,0,0,0,0,0,0,0,0,0,0,0,0,0,0,0,0,0,0,0,0,0,0,0,0,0,0,0,0,0,0,0,0,0,0,0,0,0,0,0,0,0,0,0,0,0,0,0,null,"Rondes confirmées",{"$f":"SUM(C50:BM50)","v":0},0,0,0,0,0,0,0,0,0,0,0,0,0,0,0,0,0,null,"Rondes confirmées",{"$f":"SUM(BQ50:CH50)","v":0},"Rondes confirmées",{"$f":"SUM(CJ50+BP50)","v":0}]
[null,null,null,{"$f":"SUM((D48+D49)*D50)","v":0},0,0,0,0,0,0,0,0,0,0,0,0,0,0,0,0,0,0,0,0,0,0,0,{"$f":"SUM((AB48+AB49)*AB50)","v":0},{"$f":"SUM((AC48+AC49)*AC50)","v":0},{"$f":"SUM((AD48+AD49)*AD50)","v":0},{"$f":"SUM((AE48+AE49)*AE50)","v":0},0,0,0,0,0,0,0,0,0,0,0,0,0,0,0,0,0,0,0,0,0,0,0,0,0,0,0,0,0,0,0,{"$f":"SUM((BK48+BK49)*BK50)","v":0},{"$f":"SUM((BL48+BL49)*BL50)","v":0},{"$f":"SUM((BM48+BM49)*BM50)","v":0},null,"Rondes effectuées",{"$f":"COUNTIF(D48:BM48,\">0\")","v":0},{"$f":"SUM((BQ48+BQ49)*BQ50)","v":0},0,0,0,0,0,0,0,0,0,0,0,0,0,0,0,0,null,"Rondes Effectuées",{"$f":"COUNTIF(BQ48:CG48,\">0\")","v":0},"Rondes effectuées",{"$f":"SUM(CJ51+BP51)","v":0}]
[12,{"$f":"VLOOKUP(A52,'Numéro licences'!$A$4:$B$32,2)","v":"PIERARD Anne-Sophie"},"Aller-Retour",null,null,null,null,null,null,null,null,null,null,null,null,null,null,null,null,null,null,null,null,null,null,null,null,null,null,null,null,null,null,null,null,null,null,null,null,null,null,null,null,null,null,null,null,null,null,null,null,null,null,null,null,null,null,null,null,null,null,null,null,null,null,{"$f":"SUM(D52:BM52)","v":0},"Km  renseignés",{"$f":"SUM(BN52+BN53)","v":0},null,null,null,null,null,null,null,null,null,null,null,null,null,null,null,null,null,{"$f":"SUM(BQ52:CG52)","v":0},"Km  renseignés",{"$f":"SUM(CH52+CH53)","v":0},"Km  renseignés",{"$f":"SUM(BP52+CJ52)","v":0}]
[null,null,"Ronde",null,null,null,null,null,null,null,null,null,null,null,null,null,null,null,null,null,null,null,null,null,null,null,null,null,null,null,null,null,null,null,null,null,null,null,null,null,null,null,null,null,null,null,null,null,null,null,null,null,null,null,null,null,null,null,null,null,null,null,null,null,null,{"$f":"SUM(D53:BM53)","v":0},"Km confirmés",{"$f":"SUM(D55:BM55)","v":0},null,null,null,null,null,null,null,null,null,null,null,null,null,null,null,null,null,{"$f":"SUM(BQ53:CG53)","v":0},"Km confirmés",{"$f":"SUM(BQ55:CG55)","v":0},"Km confirmés",{"$f":"SUM(CJ53+BP53)","v":0}]
[null,null,null,0,0,0,0,0,0,0,0,0,0,0,0,0,0,0,0,0,0,0,0,0,0,0,0,0,0,0,0,0,0,0,0,0,0,0,0,0,0,0,0,0,0,0,0,0,0,0,0,0,0,0,0,0,0,0,0,0,0,0,0,0,0,null,"Rondes confirmées",0,0,0,0,0,0,0,0,0,0,0,0,0,0,0,0,0,0,null,"Rondes confirmées",{"$f":"SUM(BQ54:CH54)","v":0},"Rondes confirmées",{"$f":"SUM(CJ54+BP54)","v":0}]
[null,null,null,{"$f":"SUM((D52+D53)*D54)","v":0},0,0,0,0,0,0,0,0,0,0,0,0,0,0,0,0,0,0,0,0,0,0,0,{"$f":"SUM((AB52+AB53)*AB54)","v":0},{"$f":"SUM((AC52+AC53)*AC54)","v":0},{"$f":"SUM((AD52+AD53)*AD54)","v":0},{"$f":"SUM((AE52+AE53)*AE54)","v":0},0,0,0,0,0,0,0,0,0,0,0,0,0,0,0,0,0,0,0,0,0,0,0,0,0,0,0,0,0,0,0,{"$f":"SUM((BK52+BK53)*BK54)","v":0},{"$f":"SUM((BL52+BL53)*BL54)","v":0},{"$f":"SUM((BM52+BM53)*BM54)","v":0},null,"Rondes effectuées",{"$f":"COUNTIF(D52:BM52,\">0\")","v":0},{"$f":"SUM((BQ52+BQ53)*BQ54)","v":0},0,0,0,0,0,0,0,0,0,0,0,0,0,0,0,0,null,"Rondes Effectuées",{"$f":"COUNTIF(BQ52:CG52,\">0\")","v":0},"Rondes effectuées",{"$f":"SUM(CJ55+BP55)","v":0}]
[13,{"$f":"VLOOKUP(A56,'Numéro licences'!$A$4:$B$32,2)","v":"PONT Patricia"},"Aller-Retour",null,null,null,266,null,null,338,204,20,44,34,null,18,268,156,118,null,284,null,20,164,null,132,0,null,null,86,null,null,68,null,null,118,18,34,null,null,null,null,null,210,null,44,204,68,null,86,null,null,338,null,210,280,null,160,164,118,18,null,null,null,null,{"$f":"SUM(D56:BM56)","v":4290},"Km  renseignés",{"$f":"SUM(BN56+BN57)","v":10021},null,null,null,null,null,null,null,null,null,null,null,null,null,null,null,null,null,{"$f":"SUM(BQ56:CG56)","v":0},"Km  renseignés",{"$f":"SUM(CH56+CH57)","v":0},"Km  renseignés",{"$f":"SUM(BP56+CJ56)","v":10021}]
[null,null,"Ronde",null,null,null,130,null,160,150,134,173,160,160,null,180,179,146,170,null,190,null,200,221,null,175,200,null,null,216,null,null,196,null,null,160,195,167,null,null,null,null,null,200,null,240,200,220,null,188,null,null,130,null,160,160,null,160,130,155,126,null,null,null,null,{"$f":"SUM(D57:BM57)","v":5731},"Km confirmés",{"$f":"SUM(D59:BM59)","v":10021},null,null,null,null,null,null,null,null,null,null,null,null,null,null,null,null,null,{"$f":"SUM(BQ57:CG57)","v":0},"Km confirmés",{"$f":"SUM(BQ59:CG59)","v":0},"Km confirmés",{"$f":"SUM(CJ57+BP57)","v":10021}]
[null,null,null,0,0,0,1,0,1,1,1,1,1,1,0,1,1,1,1,0,1,0,1,1,0,1,1,0,0,1,0,0,1,0,0,1,1,1,0,0,0,0,0,1,0,1,1,1,0,1,0,0,1,0,1,1,0,1,1,1,1,0,0,0,0,null,"Rondes confirmées",{"$f":"SUM(C58:BM58)","v":33},0,0,0,0,0,0,0,0,0,0,0,0,0,0,0,0,0,null,"Rondes confirmées",{"$f":"SUM(BQ58:CH58)","v":0},"Rondes confirmées",{"$f":"SUM(CJ58+BP58)","v":33}]
[null,null,null,{"$f":"SUM((D56+D57)*D58)","v":0},0,0,396,0,160,488,338,193,204,194,0,198,447,302,288,0,474,0,220,385,0,307,200,{"$f":"SUM((AB56+AB57)*AB58)","v":0},{"$f":"SUM((AC56+AC57)*AC58)","v":0},{"$f":"SUM((AD56+AD57)*AD58)","v":302},{"$f":"SUM((AE56+AE57)*AE58)","v":0},0,264,0,0,278,213,201,0,0,0,0,0,410,0,284,404,288,0,274,0,0,468,0,370,440,0,320,294,273,144,{"$f":"SUM((BJ56+BJ57)*BJ58)","v":0},{"$f":"SUM((BK56+BK57)*BK58)","v":0},{"$f":"SUM((BL56+BL57)*BL58)","v":0},{"$f":"SUM((BM56+BM57)*BM58)","v":0},null,"Rondes effectuées",{"$f":"COUNTIF(D56:BM56,\">0\")","v":31},{"$f":"SUM((BQ56+BQ57)*BQ58)","v":0},0,0,0,0,0,0,0,0,0,0,0,0,0,0,0,0,null,"Rondes Effectuées",{"$f":"COUNTIF(BQ56:CG56,\">0\")","v":0},"Rondes effectuées",{"$f":"SUM(CJ59+BP59)","v":31}]
[14,{"$f":"VLOOKUP(A60,'Numéro licences'!$A$4:$B$32,2)","v":"MISEUR Carine"},"Aller-Retour",null,null,null,null,null,null,null,null,null,null,null,null,null,null,null,null,null,null,null,null,null,null,null,null,null,null,86,null,null,68,186,null,null,null,34,null,null,null,null,null,210,null,44,204,null,null,86,224,null,null,254,210,280,null,160,164,118,18,null,null,null,null,{"$f":"SUM(D60:BM60)","v":2346},"Km  renseignés",{"$f":"SUM(BN60+BN61)","v":5164},null,null,null,null,null,null,null,null,null,null,null,null,null,null,null,null,null,{"$f":"SUM(BQ60:CG60)","v":0},"Km  renseignés",{"$f":"SUM(CH60+CH61)","v":0},"Km  renseignés",{"$f":"SUM(BP60+CJ60)","v":5164}]
[null,null,"Ronde",null,null,null,null,null,null,null,null,null,null,null,null,null,null,null,null,null,null,null,null,null,null,null,null,null,null,216,null,null,196,180,null,null,null,167,null,null,null,null,null,200,null,240,200,null,null,188,180,null,null,160,160,160,null,160,130,155,126,null,null,null,null,{"$f":"SUM(D61:BM61)","v":2818},"Km confirmés",{"$f":"SUM(D63:BM63)","v":5164},null,null,null,null,null,null,null,null,null,null,null,null,null,null,null,null,null,{"$f":"SUM(BQ61:CG61)","v":0},"Km confirmés",{"$f":"SUM(BQ63:CG63)","v":0},"Km confirmés",{"$f":"SUM(CJ61+BP61)","v":5164}]
[null,null,null,0,0,0,0,0,0,0,0,0,0,0,0,0,0,0,0,0,0,0,0,0,0,0,0,0,0,1,0,0,1,1,0,0,0,1,0,0,0,0,0,1,0,1,1,0,0,1,1,0,0,1,1,1,0,1,1,1,1,0,0,0,0,null,"Rondes confirmées",{"$f":"SUM(C62:BM62)","v":16},0,0,0,0,0,0,0,0,0,0,0,0,0,0,0,0,0,null,"Rondes confirmées",{"$f":"SUM(BQ62:CH62)","v":0},"Rondes confirmées",{"$f":"SUM(CJ62+BP62)","v":16}]
[null,null,null,{"$f":"SUM((D60+D61)*D62)","v":0},0,0,0,0,0,0,0,0,0,0,0,0,0,0,0,0,0,0,0,0,0,0,0,{"$f":"SUM((AB60+AB61)*AB62)","v":0},{"$f":"SUM((AC60+AC61)*AC62)","v":0},{"$f":"SUM((AD60+AD61)*AD62)","v":302},{"$f":"SUM((AE60+AE61)*AE62)","v":0},0,264,366,0,0,0,201,0,0,0,0,0,410,0,284,404,0,0,274,404,0,0,414,370,440,0,320,294,273,144,0,{"$f":"SUM((BK60+BK61)*BK62)","v":0},{"$f":"SUM((BL60+BL61)*BL62)","v":0},{"$f":"SUM((BM60+BM61)*BM62)","v":0},null,"Rondes effectuées",{"$f":"COUNTIF(D60:BM60,\">0\")","v":16},{"$f":"SUM((BQ60+BQ61)*BQ62)","v":0},0,0,0,0,0,0,0,0,0,0,0,0,0,0,0,0,null,"Rondes Effectuées",{"$f":"COUNTIF(BQ60:CG60,\">0\")","v":0},"Rondes effectuées",{"$f":"SUM(CJ63+BP63)","v":16}]
[15,{"$f":"VLOOKUP(A64,'Numéro licences'!$A$4:$B$32,2)","v":"ARENZANA Jennifer"},"Aller-Retour",null,null,null,null,null,null,null,null,null,null,null,null,null,null,null,null,null,null,null,null,null,null,null,null,null,null,null,null,null,null,null,null,118,18,null,null,null,null,null,null,null,null,null,null,68,null,null,null,null,null,null,null,null,null,null,null,null,null,null,null,null,null,{"$f":"SUM(D64:BM64)","v":204},"Km  renseignés",{"$f":"SUM(BN64+BN65)","v":779},null,null,null,null,null,null,null,null,null,null,null,null,null,null,null,null,null,{"$f":"SUM(BQ64:CG64)","v":0},"Km  renseignés",{"$f":"SUM(CH64+CH65)","v":0},"Km  renseignés",{"$f":"SUM(BP64+CJ64)","v":779}]
[null,null,"Ronde",null,null,null,null,null,null,null,null,null,null,null,null,null,null,null,null,null,null,null,null,null,null,null,null,null,null,null,null,null,null,null,null,160,195,null,null,null,null,null,null,null,null,null,null,220,null,null,null,null,null,null,null,null,null,null,null,null,null,null,null,null,null,{"$f":"SUM(D65:BM65)","v":575},"Km confirmés",{"$f":"SUM(D67:BM67)","v":0},null,null,null,null,null,null,null,null,null,null,null,null,null,null,null,null,null,{"$f":"SUM(BQ65:CG65)","v":0},"Km confirmés",{"$f":"SUM(BQ67:CG67)","v":0},"Km confirmés",{"$f":"SUM(CJ65+BP65)","v":0}]
[null,null,null,0,0,0,0,0,0,0,0,0,0,0,0,0,0,0,0,0,0,0,0,0,0,0,0,0,0,0,0,0,0,0,0,0,0,0,0,0,0,0,0,0,0,0,0,0,0,0,0,0,0,0,0,0,0,0,0,0,0,0,0,0,0,null,"Rondes confirmées",{"$f":"SUM(C66:BM66)","v":0},0,0,0,0,0,0,0,0,0,0,0,0,0,0,0,0,0,null,"Rondes confirmées",{"$f":"SUM(BQ66:CH66)","v":0},"Rondes confirmées",{"$f":"SUM(CJ66+BP66)","v":0}]
[null,null,null,{"$f":"SUM((D64+D65)*D66)","v":0},0,0,0,0,0,0,0,0,0,0,0,0,0,0,0,0,0,0,0,0,0,0,0,{"$f":"SUM((AB64+AB65)*AB66)","v":0},{"$f":"SUM((AC64+AC65)*AC66)","v":0},{"$f":"SUM((AD64+AD65)*AD66)","v":0},{"$f":"SUM((AE64+AE65)*AE66)","v":0},0,0,0,0,0,0,0,0,0,0,0,0,0,0,0,0,0,0,0,0,0,0,0,0,0,0,0,0,0,0,0,{"$f":"SUM((BK64+BK65)*BK66)","v":0},0,0,null,"Rondes effectuées",{"$f":"COUNTIF(D64:BM64,\">0\")","v":3},{"$f":"SUM((BQ64+BQ65)*BQ66)","v":0},0,0,0,0,0,0,0,0,0,0,0,0,0,0,0,0,null,"Rondes Effectuées",{"$f":"COUNTIF(BQ64:CG64,\">0\")","v":0},"Rondes effectuées",{"$f":"SUM(CJ67+BP67)","v":3}]
[16,{"$f":"VLOOKUP(A68,'Numéro licences'!$A$4:$B$32,2)","v":0},"Aller-Retour",null,null,null,null,null,null,null,null,null,null,null,null,null,null,null,null,null,null,null,null,null,null,null,null,null,null,null,null,null,null,null,null,null,null,null,null,null,null,null,null,null,null,null,null,null,null,null,null,null,null,null,null,null,null,null,null,null,null,null,null,null,null,{"$f":"SUM(D68:BM68)","v":0},"Km  renseignés",{"$f":"SUM(BN68+BN69)","v":0},null,null,null,null,null,null,null,null,null,null,null,null,null,null,null,null,null,{"$f":"SUM(BQ68:CG68)","v":0},"Km  renseignés",{"$f":"SUM(CH68+CH69)","v":0},"Km  renseignés",{"$f":"SUM(BP68+CJ68)","v":0}]
[null,null,"Ronde",null,null,null,null,null,null,null,null,null,null,null,null,null,null,null,null,null,null,null,null,null,null,null,null,null,null,null,null,null,null,null,null,null,null,null,null,null,null,null,null,null,null,null,null,null,null,null,null,null,null,null,null,null,null,null,null,null,null,null,null,null,null,{"$f":"SUM(D69:BM69)","v":0},"Km confirmés",{"$f":"SUM(D71:BM71)","v":0},null,null,null,null,null,null,null,null,null,null,null,null,null,null,null,null,null,{"$f":"SUM(BQ69:CG69)","v":0},"Km confirmés",{"$f":"SUM(BQ71:CG71)","v":0},"Km confirmés",{"$f":"SUM(CJ69+BP69)","v":0}]
[null,null,null,0,0,0,0,0,0,0,0,0,0,0,0,0,0,0,0,0,0,0,0,0,0,0,0,0,0,0,0,0,0,0,0,0,0,0,0,0,0,0,0,0,0,0,0,0,0,0,0,0,0,0,0,0,0,0,0,0,0,0,0,0,0,null,"Rondes confirmées",{"$f":"SUM(C70:BM70)","v":0},0,0,0,0,0,0,0,0,0,0,0,0,0,0,0,0,0,null,"Rondes confirmées",{"$f":"SUM(BQ70:CH70)","v":0},"Rondes confirmées",{"$f":"SUM(CJ70+BP70)","v":0}]
[null,null,null,{"$f":"SUM((D68+D69)*D70)","v":0},0,0,0,0,0,0,0,0,0,0,0,0,0,0,0,0,0,0,0,0,0,0,0,{"$f":"SUM((AB68+AB69)*AB70)","v":0},{"$f":"SUM((AC68+AC69)*AC70)","v":0},{"$f":"SUM((AD68+AD69)*AD70)","v":0},{"$f":"SUM((AE68+AE69)*AE70)","v":0},0,0,0,0,0,0,0,0,0,0,0,0,0,0,0,0,0,0,0,0,0,0,0,0,0,0,0,0,0,0,0,{"$f":"SUM((BK68+BK69)*BK70)","v":0},0,0,null,"Rondes effectuées",{"$f":"COUNTIF(D68:BM68,\">0\")","v":0},{"$f":"SUM((BQ68+BQ69)*BQ70)","v":0},0,0,0,0,0,0,0,0,0,0,0,0,0,0,0,0,null,"Rondes Effectuées",{"$f":"COUNTIF(BQ68:CG68,\">0\")","v":0},"Rondes effectuées",{"$f":"SUM(CJ71+BP71)","v":0}]
[17,{"$f":"VLOOKUP(A72,'Numéro licences'!$A$4:$B$32,2)","v":0},"Aller-Retour",null,null,null,null,null,null,null,null,null,null,null,null,null,null,null,null,null,null,null,null,null,null,null,null,null,null,null,null,null,null,null,null,null,null,null,null,null,null,null,null,null,null,null,null,null,null,null,null,null,null,null,null,null,null,null,null,null,null,null,null,null,null,{"$f":"SUM(D72:BM72)","v":0},"Km  renseignés",{"$f":"SUM(BN72+BN73)","v":0},null,null,null,null,null,null,null,null,null,null,null,null,null,null,null,null,null,{"$f":"SUM(BQ72:CG72)","v":0},"Km  renseignés",{"$f":"SUM(CH72+CH73)","v":0},"Km  renseignés",{"$f":"SUM(BP72+CJ72)","v":0}]
[null,null,"Ronde",null,null,null,null,null,null,null,null,null,null,null,null,null,null,null,null,null,null,null,null,null,null,null,null,null,null,null,null,null,null,null,null,null,null,null,null,null,null,null,null,null,null,null,null,null,null,null,null,null,null,null,null,null,null,null,null,null,null,null,null,null,null,{"$f":"SUM(D73:BM73)","v":0},"Km confirmés",{"$f":"SUM(D75:BM75)","v":0},null,null,null,null,null,null,null,null,null,null,null,null,null,null,null,null,null,{"$f":"SUM(BQ73:CG73)","v":0},"Km confirmés",{"$f":"SUM(BQ75:CG75)","v":0},"Km confirmés",{"$f":"SUM(CJ73+BP73)","v":0}]
[null,null,null,0,0,0,0,0,0,0,0,0,0,0,0,0,0,0,0,0,0,0,0,0,0,0,0,0,0,0,0,0,0,0,0,0,0,0,0,0,0,0,0,0,0,0,0,0,0,0,0,0,0,0,0,0,0,0,0,0,0,0,0,0,0,null,"Rondes confirmées",{"$f":"SUM(C74:BM74)","v":0},0,0,0,0,0,0,0,0,0,0,0,0,0,0,0,0,0,null,"Rondes confirmées",{"$f":"SUM(BQ74:CH74)","v":0},"Rondes confirmées",{"$f":"SUM(CJ74+BP74)","v":0}]
[null,null,null,{"$f":"SUM((D72+D73)*D74)","v":0},0,0,0,0,0,0,0,0,0,0,0,0,0,0,0,0,0,0,0,0,0,0,0,0,0,0,0,0,0,0,0,0,0,0,0,0,0,0,0,0,0,0,0,0,0,0,0,0,0,0,0,0,0,0,0,0,0,0,{"$f":"SUM((BK72+BK73)*BK74)","v":0},0,0,null,"Rondes effectuées",{"$f":"COUNTIF(D72:BM72,\">0\")","v":0},{"$f":"SUM((BQ72+BQ73)*BQ74)","v":0},0,0,0,0,0,0,0,0,0,0,0,0,0,0,0,0,null,"Rondes Effectuées",{"$f":"COUNTIF(BQ72:CG72,\">0\")","v":0},"Rondes effectuées",{"$f":"SUM(CJ75+BP75)","v":0}]
[18,{"$f":"VLOOKUP(A76,'Numéro licences'!$A$4:$B$32,2)","v":0},"Aller-Retour",null,null,null,null,null,null,null,null,null,null,null,null,null,null,null,null,null,null,null,null,null,null,null,null,null,null,null,null,null,null,null,null,null,null,null,null,null,null,null,null,null,null,null,null,null,null,null,null,null,null,null,null,null,null,null,null,null,null,null,null,null,null,{"$f":"SUM(D76:BM76)","v":0},"Km  renseignés",{"$f":"SUM(BN76+BN77)","v":0},null,null,null,null,null,null,null,null,null,null,null,null,null,null,null,null,null,{"$f":"SUM(BQ76:CG76)","v":0},"Km  renseignés",{"$f":"SUM(CH76+CH77)","v":0},"Km  renseignés",{"$f":"SUM(BP76+CJ76)","v":0}]
[null,null,"Ronde",null,null,null,null,null,null,null,null,null,null,null,null,null,null,null,null,null,null,null,null,null,null,null,null,null,null,null,null,null,null,null,null,null,null,null,null,null,null,null,null,null,null,null,null,null,null,null,null,null,null,null,null,null,null,null,null,null,null,null,null,null,null,{"$f":"SUM(D77:BM77)","v":0},"Km confirmés",{"$f":"SUM(D79:BM79)","v":0},null,null,null,null,null,null,null,null,null,null,null,null,null,null,null,null,null,{"$f":"SUM(BQ77:CG77)","v":0},"Km confirmés",{"$f":"SUM(BQ79:CG79)","v":0},"Km confirmés",{"$f":"SUM(CJ77+BP77)","v":0}]
[null,null,null,0,0,0,0,0,0,0,0,0,0,0,0,0,0,0,0,0,0,0,0,0,0,0,0,0,0,0,0,0,0,0,0,0,0,0,0,0,0,0,0,0,0,0,0,0,0,0,0,0,0,0,0,0,0,0,0,0,0,0,0,0,0,null,"Rondes confirmées",{"$f":"SUM(C78:BM78)","v":0},0,0,0,0,0,0,0,0,0,0,0,0,0,0,0,0,0,null,"Rondes confirmées",{"$f":"SUM(BQ78:CH78)","v":0},"Rondes confirmées",{"$f":"SUM(CJ78+BP78)","v":0}]
[null,null,null,{"$f":"SUM((D76+D77)*D78)","v":0},0,0,0,0,0,0,0,0,0,0,0,0,0,0,0,0,0,0,0,0,0,0,0,0,0,0,0,0,0,0,0,0,0,0,0,0,0,0,0,0,0,0,0,0,0,0,0,0,0,0,0,0,0,0,0,0,0,0,{"$f":"SUM((BK76+BK77)*BK78)","v":0},0,0,null,"Rondes effectuées",{"$f":"COUNTIF(D76:BM76,\">0\")","v":0},{"$f":"SUM((BQ76+BQ77)*BQ78)","v":0},0,0,0,0,0,0,0,0,0,0,0,0,0,0,0,0,null,"Rondes Effectuées",{"$f":"COUNTIF(BQ76:CG76,\">0\")","v":0},"Rondes effectuées",{"$f":"SUM(CJ79+BP79)","v":0}]
[19,{"$f":"VLOOKUP(A80,'Numéro licences'!$A$4:$B$32,2)","v":0},"Aller-Retour",null,null,null,null,null,null,null,null,null,null,null,null,null,null,null,null,null,null,null,null,null,null,null,null,null,null,null,null,null,null,null,null,null,null,null,null,null,null,null,null,null,null,null,null,null,null,null,null,null,null,null,null,null,null,null,null,null,null,null,null,null,null,{"$f":"SUM(D80:BM80)","v":0},"Km  renseignés",{"$f":"SUM(BN80+BN81)","v":0},null,null,null,null,null,null,null,null,null,null,null,null,null,null,null,null,null,{"$f":"SUM(BQ80:CG80)","v":0},"Km  renseignés",{"$f":"SUM(CH80+CH81)","v":0},"Km  renseignés",{"$f":"SUM(BP80+CJ80)","v":0}]
[null,null,"Ronde",null,null,null,null,null,null,null,null,null,null,null,null,null,null,null,null,null,null,null,null,null,null,null,null,null,null,null,null,null,null,null,null,null,null,null,null,null,null,null,null,null,null,null,null,null,null,null,null,null,null,null,null,null,null,null,null,null,null,null,null,null,null,{"$f":"SUM(D81:BM81)","v":0},"Km confirmés",{"$f":"SUM(D83:BM83)","v":0},null,null,null,null,null,null,null,null,null,null,null,null,null,null,null,null,null,{"$f":"SUM(BQ81:CG81)","v":0},"Km confirmés",{"$f":"SUM(BQ83:CG83)","v":0},"Km confirmés",{"$f":"SUM(CJ81+BP81)","v":0}]
[null,null,null,0,0,0,0,0,0,0,0,0,0,0,0,0,0,0,0,0,0,0,0,0,0,0,0,0,0,0,0,0,0,0,0,0,0,0,0,0,0,0,0,0,0,0,0,0,0,0,0,0,0,0,0,0,0,0,0,0,0,0,0,0,0,null,"Rondes confirmées",{"$f":"SUM(C82:BM82)","v":0},0,0,0,0,0,0,0,0,0,0,0,0,0,0,0,0,0,null,"Rondes confirmées",{"$f":"SUM(BQ82:CH82)","v":0},"Rondes confirmées",{"$f":"SUM(CJ82+BP82)","v":0}]
[null,null,null,{"$f":"SUM((D80+D81)*D82)","v":0},0,0,0,0,0,0,0,0,0,0,0,0,0,0,0,0,0,0,0,0,0,0,0,0,0,0,0,0,0,0,0,0,0,0,0,0,0,0,0,0,0,0,0,0,0,0,0,0,0,0,0,0,0,0,0,0,0,0,{"$f":"SUM((BK80+BK81)*BK82)","v":0},0,0,null,"Rondes effectuées",{"$f":"COUNTIF(D80:BM80,\">0\")","v":0},{"$f":"SUM((BQ80+BQ81)*BQ82)","v":0},0,0,0,0,0,0,0,0,0,0,0,0,0,0,0,0,null,"Rondes Effectuées",{"$f":"COUNTIF(BQ80:CG80,\">0\")","v":0},"Rondes effectuées",{"$f":"SUM(CJ83+BP83)","v":0}]
[20,{"$f":"VLOOKUP(A84,'Numéro licences'!$A$4:$B$32,2)","v":0},"Aller-Retour",null,null,null,null,null,null,null,null,null,null,null,null,null,null,null,null,null,null,null,null,null,null,null,null,null,null,null,null,null,null,null,null,null,null,null,null,null,null,null,null,null,null,null,null,null,null,null,null,null,null,null,null,null,null,null,null,null,null,null,null,null,null,{"$f":"SUM(D84:BM84)","v":0},"Km  renseignés",{"$f":"SUM(BN84+BN85)","v":0},null,null,null,null,null,null,null,null,null,null,null,null,null,null,null,null,null,{"$f":"SUM(BQ84:CG84)","v":0},"Km  renseignés",{"$f":"SUM(CH84+CH85)","v":0},"Km  renseignés",{"$f":"SUM(BP84+CJ84)","v":0}]
[null,null,"Ronde",null,null,null,null,null,null,null,null,null,null,null,null,null,null,null,null,null,null,null,null,null,null,null,null,null,null,null,null,null,null,null,null,null,null,null,null,null,null,null,null,null,null,null,null,null,null,null,null,null,null,null,null,null,null,null,null,null,null,null,null,null,null,{"$f":"SUM(D85:BM85)","v":0},"Km confirmés",{"$f":"SUM(D87:BM87)","v":0},null,null,null,null,null,null,null,null,null,null,null,null,null,null,null,null,null,{"$f":"SUM(BQ85:CG85)","v":0},"Km confirmés",{"$f":"SUM(BQ87:CG87)","v":0},"Km confirmés",{"$f":"SUM(CJ85+BP85)","v":0}]
[null,null,null,0,0,0,0,0,0,0,0,0,0,0,0,0,0,0,0,0,0,0,0,0,0,0,0,0,0,0,0,0,0,0,0,0,0,0,0,0,0,0,0,0,0,0,0,0,0,0,0,0,0,0,0,0,0,0,0,0,0,0,0,0,0,null,"Rondes confirmées",{"$f":"SUM(C86:BM86)","v":0},0,0,0,0,0,0,0,0,0,0,0,0,0,0,0,0,0,null,"Rondes confirmées",{"$f":"SUM(BQ86:CH86)","v":0},"Rondes confirmées",{"$f":"SUM(CJ86+BP86)","v":0}]
[null,null,null,{"$f":"SUM((D84+D85)*D86)","v":0},0,0,0,0,0,0,0,0,0,0,0,0,0,0,0,0,0,0,0,0,0,0,0,0,0,0,0,0,0,0,0,0,0,0,0,0,0,0,0,0,0,0,0,0,0,0,0,0,0,0,0,0,0,0,0,0,0,0,{"$f":"SUM((BK84+BK85)*BK86)","v":0},0,0,null,"Rondes effectuées",{"$f":"COUNTIF(D84:BM84,\">0\")","v":0},{"$f":"SUM((BQ84+BQ85)*BQ86)","v":0},0,0,0,0,0,0,0,0,0,0,0,0,0,0,0,0,null,"Rondes Effectuées",{"$f":"COUNTIF(BQ84:CG84,\">0\")","v":0},"Rondes effectuées",{"$f":"SUM(CJ87+BP87)","v":0}]
[21,{"$f":"VLOOKUP(A88,'Numéro licences'!$A$4:$B$32,2)","v":0},"Aller-Retour",null,null,null,null,null,null,null,null,null,null,null,null,null,null,null,null,null,null,null,null,null,null,null,null,null,null,null,null,null,null,null,null,null,null,null,null,null,null,null,null,null,null,null,null,null,null,null,null,null,null,null,null,null,null,null,null,null,null,null,null,null,null,{"$f":"SUM(D88:BM88)","v":0},"Km  renseignés",{"$f":"SUM(BN88+BN89)","v":0},null,null,null,null,null,null,null,null,null,null,null,null,null,null,null,null,null,{"$f":"SUM(BQ88:CG88)","v":0},"Km  renseignés",{"$f":"SUM(CH88+CH89)","v":0},"Km  renseignés",{"$f":"SUM(BP88+CJ88)","v":0}]
[null,null,"Ronde",null,null,null,null,null,null,null,null,null,null,null,null,null,null,null,null,null,null,null,null,null,null,null,null,null,null,null,null,null,null,null,null,null,null,null,null,null,null,null,null,null,null,null,null,null,null,null,null,null,null,null,null,null,null,null,null,null,null,null,null,null,null,{"$f":"SUM(D89:BM89)","v":0},"Km confirmés",{"$f":"SUM(D91:BM91)","v":0},null,null,null,null,null,null,null,null,null,null,null,null,null,null,null,null,null,{"$f":"SUM(BQ89:CG89)","v":0},"Km confirmés",{"$f":"SUM(BQ91:CG91)","v":0},"Km confirmés",{"$f":"SUM(CJ89+BP89)","v":0}]
[null,null,null,0,0,0,0,0,0,0,0,0,0,0,0,0,0,0,0,0,0,0,0,0,0,0,0,0,0,0,0,0,0,0,0,0,0,0,0,0,0,0,0,0,0,0,0,0,0,0,0,0,0,0,0,0,0,0,0,0,0,0,0,0,0,null,"Rondes confirmées",{"$f":"SUM(C90:BM90)","v":0},0,0,0,0,0,0,0,0,0,0,0,0,0,0,0,0,0,null,"Rondes confirmées",{"$f":"SUM(BQ90:CH90)","v":0},"Rondes confirmées",{"$f":"SUM(CJ90+BP90)","v":0}]
[null,null,null,{"$f":"SUM((D88+D89)*D90)","v":0},0,0,0,0,0,0,0,0,0,0,0,0,0,0,0,0,0,0,0,0,0,0,0,0,0,0,0,0,0,0,0,0,0,0,0,0,0,0,0,0,0,0,0,0,0,0,0,0,0,0,0,0,0,0,0,0,0,0,{"$f":"SUM((BK88+BK89)*BK90)","v":0},0,0,null,"Rondes effectuées",{"$f":"COUNTIF(D88:BM88,\">0\")","v":0},{"$f":"SUM((BQ88+BQ89)*BQ90)","v":0},0,0,0,0,0,0,0,0,0,0,0,0,0,0,0,0,null,"Rondes Effectuées",{"$f":"COUNTIF(BQ88:CG88,\">0\")","v":0},"Rondes effectuées",{"$f":"SUM(CJ91+BP91)","v":0}]
[22,{"$f":"VLOOKUP(A92,'Numéro licences'!$A$4:$B$32,2)","v":0},"Aller-Retour",null,null,null,null,null,null,null,null,null,null,null,null,null,null,null,null,null,null,null,null,null,null,null,null,null,null,null,null,null,null,null,null,null,null,null,null,null,null,null,null,null,null,null,null,null,null,null,null,null,null,null,null,null,null,null,null,null,null,null,null,null,null,{"$f":"SUM(D92:BM92)","v":0},"Km  renseignés",{"$f":"SUM(BN92+BN93)","v":0},null,null,null,null,null,null,null,null,null,null,null,null,null,null,null,null,null,{"$f":"SUM(BQ92:CG92)","v":0},"Km  renseignés",{"$f":"SUM(CH92+CH93)","v":0},"Km  renseignés",{"$f":"SUM(BP92+CJ92)","v":0}]
[null,null,"Ronde",null,null,null,null,null,null,null,null,null,null,null,null,null,null,null,null,null,null,null,null,null,null,null,null,null,null,null,null,null,null,null,null,null,null,null,null,null,null,null,null,null,null,null,null,null,null,null,null,null,null,null,null,null,null,null,null,null,null,null,null,null,null,{"$f":"SUM(D93:BM93)","v":0},"Km confirmés",{"$f":"SUM(D95:BM95)","v":0},null,null,null,null,null,null,null,null,null,null,null,null,null,null,null,null,null,{"$f":"SUM(BQ93:CG93)","v":0},"Km confirmés",{"$f":"SUM(BQ95:CG95)","v":0},"Km confirmés",{"$f":"SUM(CJ93+BP93)","v":0}]
[null,null,null,0,0,0,0,0,0,0,0,0,0,0,0,0,0,0,0,0,0,0,0,0,0,0,0,0,0,0,0,0,0,0,0,0,0,0,0,0,0,0,0,0,0,0,0,0,0,0,0,0,0,0,0,0,0,0,0,0,0,0,0,0,0,null,"Rondes confirmées",{"$f":"SUM(C94:BM94)","v":0},0,0,0,0,0,0,0,0,0,0,0,0,0,0,0,0,0,null,"Rondes confirmées",{"$f":"SUM(BQ94:CH94)","v":0},"Rondes confirmées",{"$f":"SUM(CJ94+BP94)","v":0}]
[null,null,null,{"$f":"SUM((D92+D93)*D94)","v":0},0,0,0,0,0,0,0,0,0,0,0,0,0,0,0,0,0,0,0,0,0,0,0,0,0,0,0,0,0,0,0,0,0,0,0,0,0,0,0,0,0,0,0,0,0,0,0,0,0,0,0,0,0,0,0,0,0,0,{"$f":"SUM((BK92+BK93)*BK94)","v":0},0,0,null,"Rondes effectuées",{"$f":"COUNTIF(D92:BM92,\">0\")","v":0},{"$f":"SUM((BQ92+BQ93)*BQ94)","v":0},0,0,0,0,0,0,0,0,0,0,0,0,0,0,0,0,null,"Rondes Effectuées",{"$f":"COUNTIF(BQ92:CG92,\">0\")","v":0},"Rondes effectuées",{"$f":"SUM(CJ95+BP95)","v":0}]
[23,{"$f":"VLOOKUP(A96,'Numéro licences'!$A$4:$B$32,2)","v":0},"Aller-Retour",null,null,null,null,null,null,null,null,null,null,null,null,null,null,null,null,null,null,null,null,null,null,null,null,null,null,null,null,null,null,null,null,null,null,null,null,null,null,null,null,null,null,null,null,null,null,null,null,null,null,null,null,null,null,null,null,null,null,null,null,null,null,{"$f":"SUM(D96:BM96)","v":0},"Km  renseignés",{"$f":"SUM(BN96+BN97)","v":0},null,null,null,null,null,null,null,null,null,null,null,null,null,null,null,null,null,{"$f":"SUM(BQ96:CG96)","v":0},"Km  renseignés",{"$f":"SUM(CH96+CH97)","v":0},"Km  renseignés",{"$f":"SUM(BP96+CJ96)","v":0}]
[null,null,"Ronde",null,null,null,null,null,null,null,null,null,null,null,null,null,null,null,null,null,null,null,null,null,null,null,null,null,null,null,null,null,null,null,null,null,null,null,null,null,null,null,null,null,null,null,null,null,null,null,null,null,null,null,null,null,null,null,null,null,null,null,null,null,null,{"$f":"SUM(D97:BM97)","v":0},"Km confirmés",{"$f":"SUM(D99:BM99)","v":0},null,null,null,null,null,null,null,null,null,null,null,null,null,null,null,null,null,{"$f":"SUM(BQ97:CG97)","v":0},"Km confirmés",{"$f":"SUM(BQ99:CG99)","v":0},"Km confirmés",{"$f":"SUM(CJ97+BP97)","v":0}]
[null,null,null,0,0,0,0,0,0,0,0,0,0,0,0,0,0,0,0,0,0,0,0,0,0,0,0,0,0,0,0,0,0,0,0,0,0,0,0,0,0,0,0,0,0,0,0,0,0,0,0,0,0,0,0,0,0,0,0,0,0,0,0,0,0,null,"Rondes confirmées",{"$f":"SUM(C98:BM98)","v":0},0,0,0,0,0,0,0,0,0,0,0,0,0,0,0,0,0,null,"Rondes confirmées",{"$f":"SUM(BQ98:CH98)","v":0},"Rondes confirmées",{"$f":"SUM(CJ98+BP98)","v":0}]
[null,null,null,{"$f":"SUM((D96+D97)*D98)","v":0},0,0,0,0,0,0,0,0,0,0,0,0,0,0,0,0,0,0,0,0,0,0,0,0,0,0,0,0,0,0,0,0,0,0,0,0,0,0,0,0,0,0,0,0,0,0,0,0,0,0,0,0,0,0,0,0,0,0,{"$f":"SUM((BK96+BK97)*BK98)","v":0},0,0,null,"Rondes effectuées",{"$f":"COUNTIF(D96:BM96,\">0\")","v":0},{"$f":"SUM((BQ96+BQ97)*BQ98)","v":0},0,0,0,0,0,0,0,0,0,0,0,0,0,0,0,0,null,"Rondes Effectuées",{"$f":"COUNTIF(BQ96:CG96,\">0\")","v":0},"Rondes effectuées",{"$f":"SUM(CJ99+BP99)","v":0}]
[24,{"$f":"VLOOKUP(A100,'Numéro licences'!$A$4:$B$32,2)","v":0},"Aller-Retour",null,null,null,null,null,null,null,null,null,null,null,null,null,null,null,null,null,null,null,null,null,null,null,null,null,null,null,null,null,null,null,null,null,null,null,null,null,null,null,null,null,null,null,null,null,null,null,null,null,null,null,null,null,null,null,null,null,null,null,null,null,null,{"$f":"SUM(D100:BM100)","v":0},"Km  renseignés",{"$f":"SUM(BN100+BN101)","v":0},null,null,null,null,null,null,null,null,null,null,null,null,null,null,null,null,null,{"$f":"SUM(BQ100:CG100)","v":0},"Km  renseignés",{"$f":"SUM(CH100+CH101)","v":0},"Km  renseignés",{"$f":"SUM(BP100+CJ100)","v":0}]
[null,null,"Ronde",null,null,null,null,null,null,null,null,null,null,null,null,null,null,null,null,null,null,null,null,null,null,null,null,null,null,null,null,null,null,null,null,null,null,null,null,null,null,null,null,null,null,null,null,null,null,null,null,null,null,null,null,null,null,null,null,null,null,null,null,null,null,{"$f":"SUM(D101:BM101)","v":0},"Km confirmés",{"$f":"SUM(D103:BM103)","v":0},null,null,null,null,null,null,null,null,null,null,null,null,null,null,null,null,null,{"$f":"SUM(BQ101:CG101)","v":0},"Km confirmés",{"$f":"SUM(BQ103:CG103)","v":0},"Km confirmés",{"$f":"SUM(CJ101+BP101)","v":0}]
[null,null,null,0,0,0,0,0,0,0,0,0,0,0,0,0,0,0,0,0,0,0,0,0,0,0,0,0,0,0,0,0,0,0,0,0,0,0,0,0,0,0,0,0,0,0,0,0,0,0,0,0,0,0,0,0,0,0,0,0,0,0,0,0,0,null,"Rondes confirmées",{"$f":"SUM(C102:BM102)","v":0},0,0,0,0,0,0,0,0,0,0,0,0,0,0,0,0,0,null,"Rondes confirmées",{"$f":"SUM(BQ102:CH102)","v":0},"Rondes confirmées",{"$f":"SUM(CJ102+BP102)","v":0}]
[null,null,null,{"$f":"SUM((D100+D101)*D102)","v":0},0,0,0,0,0,0,0,0,0,0,0,0,0,0,0,0,0,0,0,0,0,0,0,0,0,0,0,0,0,0,0,0,0,0,0,0,0,0,0,0,0,0,0,0,0,0,0,0,0,0,0,0,0,0,0,0,0,0,{"$f":"SUM((BK100+BK101)*BK102)","v":0},0,0,null,"Rondes effectuées",{"$f":"COUNTIF(D100:BM100,\">0\")","v":0},{"$f":"SUM((BQ100+BQ101)*BQ102)","v":0},0,0,0,0,0,0,0,0,0,0,0,0,0,0,0,0,null,"Rondes Effectuées",{"$f":"COUNTIF(BQ100:CG100,\">0\")","v":0},"Rondes effectuées",{"$f":"SUM(CJ103+BP103)","v":0}]
[25,{"$f":"VLOOKUP(A104,'Numéro licences'!$A$4:$B$32,2)","v":0},"Aller-Retour",null,null,null,null,null,null,null,null,null,null,null,null,null,null,null,null,null,null,null,null,null,null,null,null,null,null,null,null,null,null,null,null,null,null,null,null,null,null,null,null,null,null,null,null,null,null,null,null,null,null,null,null,null,null,null,null,null,null,null,null,null,null,{"$f":"SUM(D104:BM104)","v":0},"Km  renseignés",{"$f":"SUM(BN104+BN105)","v":0},null,null,null,null,null,null,null,null,null,null,null,null,null,null,null,null,null,{"$f":"SUM(BQ104:CG104)","v":0},"Km  renseignés",{"$f":"SUM(CH104+CH105)","v":0},"Km  renseignés",{"$f":"SUM(BP104+CJ104)","v":0}]
[null,null,"Ronde",null,null,null,null,null,null,null,null,null,null,null,null,null,null,null,null,null,null,null,null,null,null,null,null,null,null,null,null,null,null,null,null,null,null,null,null,null,null,null,null,null,null,null,null,null,null,null,null,null,null,null,null,null,null,null,null,null,null,null,null,null,null,{"$f":"SUM(D105:BM105)","v":0},"Km confirmés",{"$f":"SUM(D107:BM107)","v":0},null,null,null,null,null,null,null,null,null,null,null,null,null,null,null,null,null,{"$f":"SUM(BQ105:CG105)","v":0},"Km confirmés",{"$f":"SUM(BQ107:CG107)","v":0},"Km confirmés",{"$f":"SUM(CJ105+BP105)","v":0}]
[null,null,null,0,0,0,0,0,0,0,0,0,0,0,0,0,0,0,0,0,0,0,0,0,0,0,0,0,0,0,0,0,0,0,0,0,0,0,0,0,0,0,0,0,0,0,0,0,0,0,0,0,0,0,0,0,0,0,0,0,0,0,0,0,0,null,"Rondes confirmées",{"$f":"SUM(C106:BM106)","v":0},0,0,0,0,0,0,0,0,0,0,0,0,0,0,0,0,0,null,"Rondes confirmées",{"$f":"SUM(BQ106:CH106)","v":0},"Rondes confirmées",{"$f":"SUM(CJ106+BP106)","v":0}]
[null,null,null,{"$f":"SUM((D104+D105)*D106)","v":0},0,0,0,0,0,0,0,0,0,0,0,0,0,0,0,0,0,0,0,0,0,0,0,0,0,0,0,0,0,0,0,0,0,0,0,0,0,0,0,0,0,0,0,0,0,0,0,0,0,0,0,0,0,0,0,0,0,0,{"$f":"SUM((BK104+BK105)*BK106)","v":0},0,0,null,"Rondes effectuées",{"$f":"COUNTIF(D104:BM104,\">0\")","v":0},{"$f":"SUM((BQ104+BQ105)*BQ106)","v":0},0,0,0,0,0,0,0,0,0,0,0,0,0,0,0,0,null,"Rondes Effectuées",{"$f":"COUNTIF(BQ104:CG104,\">0\")","v":0},"Rondes effectuées",{"$f":"SUM(CJ107+BP107)","v":0}]
[26,{"$f":"VLOOKUP(A108,'Numéro licences'!$A$4:$B$32,2)","v":0},"Aller-Retour",null,null,null,null,null,null,null,null,null,null,null,null,null,null,null,null,null,null,null,null,null,null,null,null,null,null,null,null,null,null,null,null,null,null,null,null,null,null,null,null,null,null,null,null,null,null,null,null,null,null,null,null,null,null,null,null,null,null,null,null,null,null,{"$f":"SUM(D108:BM108)","v":0},"Km  renseignés",{"$f":"SUM(BN108+BN109)","v":0},null,null,null,null,null,null,null,null,null,null,null,null,null,null,null,null,null,{"$f":"SUM(BQ108:CG108)","v":0},"Km  renseignés",{"$f":"SUM(CH108+CH109)","v":0},"Km  renseignés",{"$f":"SUM(BP108+CJ108)","v":0}]
[null,null,"Ronde",null,null,null,null,null,null,null,null,null,null,null,null,null,null,null,null,null,null,null,null,null,null,null,null,null,null,null,null,null,null,null,null,null,null,null,null,null,null,null,null,null,null,null,null,null,null,null,null,null,null,null,null,null,null,null,null,null,null,null,null,null,null,{"$f":"SUM(D109:BM109)","v":0},"Km confirmés",{"$f":"SUM(D111:BM111)","v":0},null,null,null,null,null,null,null,null,null,null,null,null,null,null,null,null,null,{"$f":"SUM(BQ109:CG109)","v":0},"Km confirmés",{"$f":"SUM(BQ111:CG111)","v":0},"Km confirmés",{"$f":"SUM(CJ109+BP109)","v":0}]
[null,null,null,0,0,0,0,0,0,0,0,0,0,0,0,0,0,0,0,0,0,0,0,0,0,0,0,0,0,0,0,0,0,0,0,0,0,0,0,0,0,0,0,0,0,0,0,0,0,0,0,0,0,0,0,0,0,0,0,0,0,0,0,0,0,null,"Rondes confirmées",{"$f":"SUM(C110:BM110)","v":0},0,0,0,0,0,0,0,0,0,0,0,0,0,0,0,0,0,null,"Rondes confirmées",{"$f":"SUM(BQ110:CH110)","v":0},"Rondes confirmées",{"$f":"SUM(CJ110+BP110)","v":0}]
[null,null,null,{"$f":"SUM((D108+D109)*D110)","v":0},0,0,0,0,0,0,0,0,0,0,0,0,0,0,0,0,0,0,0,0,0,0,0,0,0,0,0,0,0,0,0,0,0,0,0,0,0,0,0,0,0,0,0,0,0,0,0,0,0,0,0,0,0,0,0,0,0,0,{"$f":"SUM((BK108+BK109)*BK110)","v":0},0,0,null,"Rondes effectuées",{"$f":"COUNTIF(D108:BM108,\">0\")","v":0},{"$f":"SUM((BQ108+BQ109)*BQ110)","v":0},0,0,0,0,0,0,0,0,0,0,0,0,0,0,0,0,null,"Rondes Effectuées",{"$f":"COUNTIF(BQ108:CG108,\">0\")","v":0},"Rondes effectuées",{"$f":"SUM(CJ111+BP111)","v":0}]
[27,{"$f":"VLOOKUP(A112,'Numéro licences'!$A$4:$B$32,2)","v":0},"Aller-Retour",null,null,null,null,null,null,null,null,null,null,null,null,null,null,null,null,null,null,null,null,null,null,null,null,null,null,null,null,null,null,null,null,null,null,null,null,null,null,null,null,null,null,null,null,null,null,null,null,null,null,null,null,null,null,null,null,null,null,null,null,null,null,{"$f":"SUM(D112:BM112)","v":0},"Km  renseignés",{"$f":"SUM(BN112+BN113)","v":0},null,null,null,null,null,null,null,null,null,null,null,null,null,null,null,null,null,{"$f":"SUM(BQ112:CG112)","v":0},"Km  renseignés",{"$f":"SUM(CH112+CH113)","v":0},"Km  renseignés",{"$f":"SUM(BP112+CJ112)","v":0}]
[null,null,"Ronde",null,null,null,null,null,null,null,null,null,null,null,null,null,null,null,null,null,null,null,null,null,null,null,null,null,null,null,null,null,null,null,null,null,null,null,null,null,null,null,null,null,null,null,null,null,null,null,null,null,null,null,null,null,null,null,null,null,null,null,null,null,null,{"$f":"SUM(D113:BM113)","v":0},"Km confirmés",{"$f":"SUM(D115:BM115)","v":0},null,null,null,null,null,null,null,null,null,null,null,null,null,null,null,null,null,{"$f":"SUM(BQ113:CG113)","v":0},"Km confirmés",{"$f":"SUM(BQ115:CG115)","v":0},"Km confirmés",{"$f":"SUM(CJ113+BP113)","v":0}]
[null,null,null,0,0,0,0,0,0,0,0,0,0,0,0,0,0,0,0,0,0,0,0,0,0,0,0,0,0,0,0,0,0,0,0,0,0,0,0,0,0,0,0,0,0,0,0,0,0,0,0,0,0,0,0,0,0,0,0,0,0,0,0,0,0,null,"Rondes confirmées",{"$f":"SUM(C114:BM114)","v":0},0,0,0,0,0,0,0,0,0,0,0,0,0,0,0,0,0,null,"Rondes confirmées",{"$f":"SUM(BQ114:CH114)","v":0},"Rondes confirmées",{"$f":"SUM(CJ114+BP114)","v":0}]
[null,null,null,{"$f":"SUM((D112+D113)*D114)","v":0},0,0,0,0,0,0,0,0,0,0,0,0,0,0,0,0,0,0,0,0,0,0,0,0,0,0,0,0,0,0,0,0,0,0,0,0,0,0,0,0,0,0,0,0,0,0,0,0,0,0,0,0,0,0,0,0,0,0,{"$f":"SUM((BK112+BK113)*BK114)","v":0},0,0,null,"Rondes effectuées",{"$f":"COUNTIF(D112:BM112,\">0\")","v":0},{"$f":"SUM((BQ112+BQ113)*BQ114)","v":0},0,0,0,0,0,0,0,0,0,0,0,0,0,0,0,0,null,"Rondes Effectuées",{"$f":"COUNTIF(BQ112:CG112,\">0\")","v":0},"Rondes effectuées",{"$f":"SUM(CJ115+BP115)","v":0}]
[28,{"$f":"VLOOKUP(A116,'Numéro licences'!$A$4:$B$32,2)","v":0},"Aller-Retour",null,null,null,null,null,null,null,null,null,null,null,null,null,null,null,null,null,null,null,null,null,null,null,null,null,null,null,null,null,null,null,null,null,null,null,null,null,null,null,null,null,null,null,null,null,null,null,null,null,null,null,null,null,null,null,null,null,null,null,null,null,null,{"$f":"SUM(D116:BM116)","v":0},"Km  renseignés",{"$f":"SUM(BN116+BN117)","v":0},null,null,null,null,null,null,null,null,null,null,null,null,null,null,null,null,null,{"$f":"SUM(BQ116:CG116)","v":0},"Km  renseignés",{"$f":"SUM(CH116+CH117)","v":0},"Km  renseignés",{"$f":"SUM(BP116+CJ116)","v":0}]
[null,null,"Ronde",null,null,null,null,null,null,null,null,null,null,null,null,null,null,null,null,null,null,null,null,null,null,null,null,null,null,null,null,null,null,null,null,null,null,null,null,null,null,null,null,null,null,null,null,null,null,null,null,null,null,null,null,null,null,null,null,null,null,null,null,null,null,{"$f":"SUM(D117:BM117)","v":0},"Km confirmés",{"$f":"SUM(D119:BM119)","v":0},null,null,null,null,null,null,null,null,null,null,null,null,null,null,null,null,null,{"$f":"SUM(BQ117:CG117)","v":0},"Km confirmés",{"$f":"SUM(BQ119:CG119)","v":0},"Km confirmés",{"$f":"SUM(CJ117+BP117)","v":0}]
[null,null,null,0,0,0,0,0,0,0,0,0,0,0,0,0,0,0,0,0,0,0,0,0,0,0,0,0,0,0,0,0,0,0,0,0,0,0,0,0,0,0,0,0,0,0,0,0,0,0,0,0,0,0,0,0,0,0,0,0,0,0,0,0,0,null,"Rondes confirmées",{"$f":"SUM(C118:BM118)","v":0},0,0,0,0,0,0,0,0,0,0,0,0,0,0,0,0,0,null,"Rondes confirmées",{"$f":"SUM(BQ118:CH118)","v":0},"Rondes confirmées",{"$f":"SUM(CJ118+BP118)","v":0}]
[null,null,null,{"$f":"SUM((D116+D117)*D118)","v":0},0,0,0,0,0,0,0,0,0,0,0,0,0,0,0,0,0,0,0,0,0,0,0,0,0,0,0,0,0,0,0,0,0,0,0,0,0,0,0,0,0,0,0,0,0,0,0,0,0,0,0,0,0,0,0,0,0,0,{"$f":"SUM((BK116+BK117)*BK118)","v":0},0,0,null,"Rondes effectuées",{"$f":"COUNTIF(D116:BM116,\">0\")","v":0},{"$f":"SUM((BQ116+BQ117)*BQ118)","v":0},0,0,0,0,0,0,0,0,0,0,0,0,0,0,0,0,null,"Rondes Effectuées",{"$f":"COUNTIF(BQ116:CG116,\">0\")","v":0},"Rondes effectuées",{"$f":"SUM(CJ119+BP119)","v":0}]
[29,{"$f":"VLOOKUP(A120,'Numéro licences'!$A$4:$B$32,2)","v":0},"Aller-Retour",null,null,null,null,null,null,null,null,null,null,null,null,null,null,null,null,null,null,null,null,null,null,null,null,null,null,null,null,null,null,null,null,null,null,null,null,null,null,null,null,null,null,null,null,null,null,null,null,null,null,null,null,null,null,null,null,null,null,null,null,null,null,{"$f":"SUM(D120:BM120)","v":0},"Km  renseignés",{"$f":"SUM(BN120+BN121)","v":0},null,null,null,null,null,null,null,null,null,null,null,null,null,null,null,null,null,{"$f":"SUM(BQ120:CG120)","v":0},"Km  renseignés",{"$f":"SUM(CH120+CH121)","v":0},"Km  renseignés",{"$f":"SUM(BP120+CJ120)","v":0}]
[null,null,"Ronde",null,null,null,null,null,null,null,null,null,null,null,null,null,null,null,null,null,null,null,null,null,null,null,null,null,null,null,null,null,null,null,null,null,null,null,null,null,null,null,null,null,null,null,null,null,null,null,null,null,null,null,null,null,null,null,null,null,null,null,null,null,null,{"$f":"SUM(D121:BM121)","v":0},"Km confirmés",{"$f":"SUM(D123:BM123)","v":0},null,null,null,null,null,null,null,null,null,null,null,null,null,null,null,null,null,{"$f":"SUM(BQ121:CG121)","v":0},"Km confirmés",{"$f":"SUM(BQ123:CG123)","v":0},"Km confirmés",{"$f":"SUM(CJ121+BP121)","v":0}]
[null,null,null,0,0,0,0,0,0,0,0,0,0,0,0,0,0,0,0,0,0,0,0,0,0,0,0,0,0,0,0,0,0,0,0,0,0,0,0,0,0,0,0,0,0,0,0,0,0,0,0,0,0,0,0,0,0,0,0,0,0,0,0,0,0,null,"Rondes confirmées",{"$f":"SUM(C122:BM122)","v":0},0,0,0,0,0,0,0,0,0,0,0,0,0,0,0,0,0,null,"Rondes confirmées",{"$f":"SUM(BQ122:CH122)","v":0},"Rondes confirmées",{"$f":"SUM(CJ122+BP122)","v":0}]
[null,null,null,{"$f":"SUM((D120+D121)*D122)","v":0},0,0,0,0,0,0,0,0,0,0,0,0,0,0,0,0,0,0,0,0,0,0,0,0,0,0,0,0,0,0,0,0,0,0,0,0,0,0,0,0,0,0,0,0,0,0,0,0,0,0,0,0,0,0,0,0,0,0,{"$f":"SUM((BK120+BK121)*BK122)","v":0},0,0,null,"Rondes effectuées",{"$f":"COUNTIF(D120:BM120,\">0\")","v":0},{"$f":"SUM((BQ120+BQ121)*BQ122)","v":0},0,0,0,0,0,0,0,0,0,0,0,0,0,0,0,0,null,"Rondes Effectuées",{"$f":"COUNTIF(BQ120:CG120,\">0\")","v":0},"Rondes effectuées",{"$f":"SUM(CJ123+BP123)","v":0}]
[null,null,"Nat.Pirates-Hors/FMB"]
[null,null,"Inconnu ou non-confirmé"]
[]
[null,null,"Concentres",{"$f":"COUNTIF(D8:D120,D5)","v":3},{"$f":"COUNTIF(E8:E120,E5)","v":1},1,2,0,50,1,2,3,3,3,0,3,1,2,1,1,2,0,1,2,56,4,52,0,0,2,0,0,2,2,0,3,4,2,0,0,0,0,56,3,0,2,3,5,0,3,1,0,1,1,3,2,56,0,2,3,4,{"$f":"COUNTIF(BJ8:BJ120,BJ5)","v":56},{"$f":"COUNTIF(BK8:BK120,BK5)","v":56},56,56,276,"Concentres",null,{"$f":"COUNTIF(BQ8:BQ120,BQ5)","v":0},1,56,56,56,0,0,0,0,0,0,0,0,0,0,0,0,552,"Concentres",null,"Concentres",828]
[null,null,"Rondes",{"$f":"COUNTIF(D9:D123,D6)","v":1},{"$f":"COUNTIF(E9:E123,E6)","v":1},1,2,0,7,1,2,3,3,2,0,1,1,2,1,1,2,1,1,2,58,2,11,0,0,2,0,0,2,2,0,3,4,2,0,0,0,0,58,3,0,2,3,3,0,3,1,0,1,1,3,2,58,4,2,3,4,{"$f":"COUNTIF(BJ9:BJ123,BJ6)","v":58},{"$f":"COUNTIF(BK9:BK123,BK6)","v":58},58,58,5521,"Rondes",null,{"$f":"COUNTIF(BQ9:BQ123,BQ6)","v":0},1,58,58,58,0,0,0,0,0,0,0,0,0,0,0,0,552,"Rondes",null,"Rondes",6073]
[]
[]
[]
[]
[null,"Colonne1"]
[1,"ALAIMO Rosa"]
[{"$f":"SUM(A134+1)","v":2},"BRIDOUX Jacqueline"]
[{"$f":"SUM(A135+1)","v":3},"COSYNS Carine"]
[4,"DEHAUT Stéphane"]
[5,"GREGORICS Kathy"]
[6,"INGELS Chantal"]
[7,"LAMBILLON Anne"]
[8,"LAMIROY Anne"]
[9,"LEQUEUX Anne"]
[10,"LEROY Laure"]
[11,"PRESTI Rose"]
[12]
[13]
[14]
[15]
[16]
[17]
[18]
[19]
[20]
[21]
[22]
[23]
[24]
[25]
[26]
[27]
[28]
[29]
[30]
[31]
[32]
[33]
[34]
[35]
[36]
[37]
[38]
[39]
[40]
[41]
[42]
[43]
[{"$f":"SUM(A176+1)","v":44}]
[45]
[46]

{"sheet":"Pilotes Inter","index":6,"n_rows":246,"n_cols":108,"rows_kept":246,"cut":false,"hidden":false,"merged":[[182,1,185,1],[186,1,189,1],[162,1,165,1],[166,1,169,1],[170,1,173,1],[174,1,177,1],[178,1,181,1],[142,1,145,1],[146,1,149,1],[150,1,153,1],[154,1,157,1],[158,1,161,1],[122,1,125,1],[126,1,129,1],[130,1,133,1],[134,1,137,1],[138,1,141,1],[102,1,105,1],[106,1,109,1],[110,1,113,1],[114,1,117,1],[118,1,121,1],[82,1,85,1],[86,1,89,1],[90,1,93,1],[94,1,97,1],[98,1,101,1],[62,1,65,1],[66,1,69,1],[70,1,73,1],[74,1,77,1],[78,1,81,1],[0,81,0,99],[98,105,98,107],[6,1,9,1],[10,1,13,1],[14,1,17,1],[18,1,21,1],[22,1,25,1],[26,1,29,1],[30,1,33,1],[34,1,37,1],[38,1,41,1],[42,1,45,1],[46,1,49,1],[50,1,53,1],[54,1,57,1],[58,1,61,1]]}
[null,null,null,1,{"$f":"SUM(D1+1)","v":2},{"$f":"SUM(E1+1)","v":3},4,5,6,7,8,9,10,11,12,13,14,15,16,17,18,19,20,21,22,23,24,25,26,27,28,29,30,31,32,33,34,35,36,37,38,39,40,41,42,43,44,45,46,47,48,49,50,51,52,53,54,55,{"$f":"SUM(BF1+1)","v":56},57,58,59,60,61,62,{"$f":"SUM(BM1+1)","v":63},{"$f":"SUM(BN1+1)","v":64},{"$f":"SUM(BO1+1)","v":65},{"$f":"SUM(BP1+1)","v":66},{"$f":"SUM(BQ1+1)","v":67},{"$f":"SUM(BR1+1)","v":68},{"$f":"SUM(BS1+1)","v":69},{"$f":"SUM(BT1+1)","v":70},{"$f":"SUM(BU1+1)","v":71},{"$f":"SUM(BV1+1)","v":72},{"$f":"SUM(BW1+1)","v":73},74,null,null,null,null,"Hors FMB"]
[null,null,null,null,null,null,null,null,null,null,null,null,null,"2023-04-29",null,null,null,null,null,null,null,"2023-05-17",null,null,null,null,null,null,null,null,null,null,null,null,null,null,"2023-05-21",null,null,null,null,null,null,null,"2023-07-29",null,null,"2023-08-04",null,null,null,null,null,null,null,null,null,null,null,null,null,null,null,null,null,"2023-09-22",null,null,"2023-09-30",null,null,null,null,null,null,null,null,null,null,null,"2023-04-15","2023-04-29","2023-09-07"]
[null,null,null,null,null,null,null,null,null,null,null,null,null,"CFT Quincey",null,null,null,null,null,null,null,"MC LOTUS",null,null,null,null,null,null,null,null,null,null,null,null,null,null,"Zaragosa",null,null,null,null,null,null,null,"Del Laghi delle Garfagnana / Gramollazo / IT",null,null,"Beo Bikers / Thun /CH",null,null,null,null,null,null,null,null,null,null,null,null,null,null,null,null,null,"Les Epesses (85)",null,null,"Eu-Mers-Tréport (76)",null,null,null,null,null,null,null,null,null,null,null,"1000 Km Limbourg","CFT Vesoul","Sorite Club Orbey"]
[null,"Aller-Retour",null,-1,-1,-1,-1,-1,-1,-1,null,-1,null,-1,null,-1,-1,-1,null,-1,null,1462,-1,null,-1,-1,null,-1,null,null,null,null,null,null,-1,-1,2760,null,null,-1,null,-1,-1,null,2119,null,null,1386,null,null,null,-1,-1,-1,null,null,null,null,null,null,null,null,-1,-1,-1,1351,null,null,549,null,null,null,null,-1,-1,-1,null,null,null,null,null,null,802]
[null,"Ronde",null,-1,-1,-1,-1,-1,-1,-1,null,-1,-1,-1,null,-1,-1,-1,null,-1,null,212,-1,null,-1,-1,-1,-1,null,null,null,null,null,null,-1,-1,0,null,null,-1,-1,-1,-1,null,0,null,null,0,null,null,null,-1,-1,-1,null,null,null,null,null,null,null,null,-1,-1,-1,0,null,null,0,null,null,null,null,-1,-1,-1,null,null,null,null,1000,null,330]
[null,null,null,null,null,null,null,null,null,null,null,null,null,null,null,null,null,null,null,null,null,"Randonnée de l'amitié\nHolzgau / AU",null,null,null,null,null,null,null,null,null,null,null,null,null,null,null,null,null,null,null,null,null,null,null,null,null,null,null,null,null,null,null,null,null,null,null,null,null,null,null,null,null,null,null,null,null,null,null,null,null,null,null,null,null,null,null,"Sous-Total\nFMB",null,"Total FMB",null,null,null,null,null,null,null,null,null,null,null,null,null,null,null,null,null,"Sous-Totaux\nPirates",null,"Total Pirates",null,"TOTAL",null,null,null,"FMB","Hors FMB","Total"]
[1,{"$f":"VLOOKUP(A7,'Numéro licences'!$H$4:$I$47,2)","v":"BALLION Pierre"},"Aller-Retour",null,null,null,null,null,null,null,null,null,null,null,null,null,null,null,null,null,null,null,null,null,null,null,null,null,null,null,null,null,null,null,null,null,null,null,null,null,null,null,null,null,null,null,null,null,null,null,null,null,null,null,null,null,null,null,null,null,null,null,null,null,null,null,null,null,null,null,null,null,null,null,null,null,null,{"$f":"SUM(D7:BY7)","v":0},"Km  renseignés",{"$f":"SUM(BZ7+BZ8)","v":0},null,null,794,null,null,null,null,null,null,null,null,null,null,null,null,null,null,{"$f":"SUM(CC7:CS7)","v":794},"Km  renseignés",{"$f":"SUM(CT7+CT8)","v":1124},"Km  renseignés",{"$f":"SUM(CB7+CV7)","v":1124},null,1,{"$f":"VLOOKUP(CZ7,A7:B187,2)","v":"BALLION Pierre"},{"$f":"SUM(CB7)","v":0},{"$f":"SUM(CV7)","v":1124},{"$f":"SUM(DB7+DC7)","v":1124}]
[null,null,"Ronde",null,null,null,null,null,null,null,null,null,null,null,null,null,null,null,null,null,null,null,null,null,null,null,null,null,null,null,null,null,null,null,null,null,null,null,null,null,null,null,null,null,null,null,null,null,null,null,null,null,null,null,null,null,null,null,null,null,null,null,null,null,null,null,null,null,null,null,null,null,null,null,null,null,null,{"$f":"SUM(D8:BY8)","v":0},"Km confirmés",{"$f":"SUM(D10:BY10)","v":0},null,null,330,null,null,null,null,null,null,null,null,null,null,null,null,null,null,{"$f":"SUM(CC8:CS8)","v":330},"Km confirmés",{"$f":"SUM(CC10:CS10)","v":1124},"Km confirmés",{"$f":"SUM(CV8+CB8)","v":1124},null,2,{"$f":"VLOOKUP(CZ8,A7:B187,2)","v":"BENET Jean-Pol"},{"$f":"SUM(CB11)","v":0},{"$f":"SUM(CV11)","v":0},{"$f":"SUM(DB8+DC8)","v":0}]
[null,null,null,0,0,0,0,0,0,0,0,0,0,0,0,0,0,0,0,0,0,0,0,0,0,0,0,0,0,0,0,0,0,0,0,0,0,0,0,0,0,0,0,0,0,0,0,0,0,0,0,0,0,0,0,0,0,0,0,0,0,0,0,0,0,0,0,0,0,0,0,0,0,0,0,0,0,null,"Rondes confirmées",{"$f":"SUM(C9:BY9)","v":0},0,0,1,0,0,0,0,0,0,0,0,0,0,0,0,0,0,null,"Rondes confirmées",{"$f":"SUM(CC9:CT9)","v":1},"Rondes confirmées",{"$f":"SUM(CV9+CB9)","v":1},null,3,{"$f":"VLOOKUP(CZ9,A7:B187,2)","v":"BERDOYES Yannick"},{"$f":"SUM(CB15)","v":0},{"$f":"SUM(CV15)","v":0},{"$f":"SUM(DB9+DC9)","v":0}]
[null,null,null,{"$f":"SUM((D7+D8)*D9)","v":0},0,0,0,0,0,0,0,0,0,0,0,0,0,0,0,0,0,0,0,0,0,0,0,0,0,0,0,0,0,0,0,0,0,0,0,0,0,0,0,0,0,0,0,0,0,0,0,0,0,0,0,0,0,0,0,0,0,0,0,0,0,{"$f":"SUM((BN7+BN8)*BN9)","v":0},0,0,0,0,0,0,0,{"$f":"SUM((BV7+BV8)*BV9)","v":0},0,0,0,null,"Rondes effectuées",{"$f":"COUNTIF(D7:BY7,\">0\")","v":0},{"$f":"SUM((CC7+CC8)*CC9)","v":0},0,1124,0,0,0,0,0,0,0,0,0,0,0,0,0,0,null,"Rondes Effectuées",{"$f":"COUNTIF(CC7:CS7,\">0\")","v":1},"Rondes effectuées",{"$f":"SUM(CV10+CB10)","v":1},null,4,{"$f":"VLOOKUP(CZ10,A7:B187,2)","v":"BRUNEAU Denis-Claude"},{"$f":"SUM(CB19)","v":0},{"$f":"SUM(CV19)","v":1342},1342]
[2,{"$f":"VLOOKUP(A11,'Numéro licences'!$H$4:$I$47,2)","v":"BENET Jean-Pol"},"Aller-Retour",null,null,null,null,null,null,null,null,null,null,null,null,null,null,null,null,null,null,null,null,null,null,null,null,null,null,null,null,null,null,null,null,null,null,null,null,null,null,null,null,null,null,null,null,null,null,null,null,null,null,null,null,null,null,null,null,null,null,null,null,null,null,null,null,null,null,null,null,null,null,null,null,null,null,{"$f":"SUM(D11:BY11)","v":0},"Km  renseignés",{"$f":"SUM(BZ11+BZ12)","v":0},null,null,null,null,null,null,null,null,null,null,null,null,null,null,null,null,null,{"$f":"SUM(CC11:CS11)","v":0},"Km  renseignés",{"$f":"SUM(CT11+CT12)","v":0},"Km  renseignés",{"$f":"SUM(CB11+CV11)","v":0},null,5,{"$f":"VLOOKUP(CZ11,A7:B187,2)","v":"DAVIN Philippe"},{"$f":"SUM(CB23)","v":0},{"$f":"SUM(CV23)","v":1076},1076]
[null,null,"Ronde",null,null,null,null,null,null,null,null,null,null,null,null,null,null,null,null,null,null,null,null,null,null,null,null,null,null,null,null,null,null,null,null,null,null,null,null,null,null,null,null,null,null,null,null,null,null,null,null,null,null,null,null,null,null,null,null,null,null,null,null,null,null,null,null,null,null,null,null,null,null,null,null,null,null,{"$f":"SUM(D12:BY12)","v":0},"Km confirmés",{"$f":"SUM(D14:BY14)","v":0},null,null,null,null,null,null,null,null,null,null,null,null,null,null,null,null,null,{"$f":"SUM(CC12:CS12)","v":0},"Km confirmés",{"$f":"SUM(CC14:CS14)","v":0},"Km confirmés",{"$f":"SUM(CV12+CB12)","v":0},null,6,{"$f":"VLOOKUP(CZ12,A7:B187,2)","v":"DESCAMPS Geoffrey"},{"$f":"SUM(CB27)","v":0},{"$f":"SUM(CV27)","v":1250},1250]
[null,null,null,0,0,0,0,0,0,0,0,0,0,0,0,0,0,0,0,0,0,0,0,0,0,0,0,0,0,0,0,0,0,0,0,0,0,0,0,0,0,0,0,0,0,0,0,0,0,0,0,0,0,0,0,0,0,0,0,0,0,0,0,0,0,0,0,0,0,0,0,0,0,0,0,0,0,null,"Rondes confirmées",{"$f":"SUM(C13:BY13)","v":0},0,0,0,0,0,0,0,0,0,0,0,0,0,0,0,0,0,null,"Rondes confirmées",{"$f":"SUM(CC13:CT13)","v":0},"Rondes confirmées",{"$f":"SUM(CV13+CB13)","v":0},null,7,{"$f":"VLOOKUP(CZ13,A7:B187,2)","v":"DESMAREE Francis"},{"$f":"SUM(CB31)","v":0},{"$f":"SUM(CV31)","v":0},0]
[null,null,null,{"$f":"SUM((D11+D12)*D13)","v":0},0,0,0,0,0,0,0,0,0,0,0,0,0,0,0,0,0,0,0,0,0,0,0,0,0,0,0,0,0,0,0,0,0,0,0,0,0,0,0,0,0,0,0,0,0,0,0,0,0,0,0,0,0,0,0,0,0,0,0,0,0,{"$f":"SUM((BN11+BN12)*BN13)","v":0},0,0,0,0,0,0,0,{"$f":"SUM((BV11+BV12)*BV13)","v":0},0,0,0,null,"Rondes effectuées",{"$f":"COUNTIF(D11:BY11,\">0\")","v":0},{"$f":"SUM((CC11+CC12)*CC13)","v":0},0,0,0,0,0,0,0,0,0,0,0,0,0,0,0,0,null,"Rondes Effectuées",{"$f":"COUNTIF(CC11:CS11,\">0\")","v":0},"Rondes effectuées",{"$f":"SUM(CV14+CB14)","v":0},null,8,{"$f":"VLOOKUP(CZ14,A7:B187,2)","v":"DEWAERSEGHERS Francis"},{"$f":"SUM(CB35)","v":0},{"$f":"SUM(CV35)","v":0},0]
[3,{"$f":"VLOOKUP(A15,'Numéro licences'!$H$4:$I$47,2)","v":"BERDOYES Yannick"},"Aller-Retour",null,null,null,null,null,null,null,null,null,null,null,null,null,null,null,null,null,null,null,null,null,null,null,null,null,null,null,null,null,null,null,null,null,null,null,null,null,null,null,null,null,null,null,null,null,null,null,null,null,null,null,null,null,null,null,null,null,null,null,null,null,null,null,null,null,null,null,null,null,null,null,null,null,null,{"$f":"SUM(D15:BY15)","v":0},"Km  renseignés",{"$f":"SUM(BZ15+BZ16)","v":0},null,null,null,null,null,null,null,null,null,null,null,null,null,null,null,null,null,{"$f":"SUM(CC15:CS15)","v":0},"Km  renseignés",{"$f":"SUM(CT15+CT16)","v":0},"Km  renseignés",{"$f":"SUM(CB15+CV15)","v":0},null,9,{"$f":"VLOOKUP(CZ15,A7:B187,2)","v":"DHONDT Jerry"},{"$f":"SUM(CB39)","v":0},{"$f":"SUM(CV39)","v":0},0]
[null,null,"Ronde",null,null,null,null,null,null,null,null,null,null,null,null,null,null,null,null,null,null,null,null,null,null,null,null,null,null,null,null,null,null,null,null,null,null,null,null,null,null,null,null,null,null,null,null,null,null,null,null,null,null,null,null,null,null,null,null,null,null,null,null,null,null,null,null,null,null,null,null,null,null,null,null,null,null,{"$f":"SUM(D16:BY16)","v":0},"Km confirmés",{"$f":"SUM(D18:BY18)","v":0},null,null,null,null,null,null,null,null,null,null,null,null,null,null,null,null,null,{"$f":"SUM(CC16:CS16)","v":0},"Km confirmés",{"$f":"SUM(CC18:CS18)","v":0},"Km confirmés",{"$f":"SUM(CV16+CB16)","v":0},null,10,{"$f":"VLOOKUP(CZ16,A7:B187,2)","v":"DONY Marc"},{"$f":"SUM(CB43)","v":0},{"$f":"SUM(CV43)","v":1220},1220]
[null,null,null,0,0,0,0,0,0,0,0,0,0,0,0,0,0,0,0,0,0,0,0,0,0,0,0,0,0,0,0,0,0,0,0,0,0,0,0,0,0,0,0,0,0,0,0,0,0,0,0,0,0,0,0,0,0,0,0,0,0,0,0,0,0,0,0,0,0,0,0,0,0,0,0,0,0,null,"Rondes confirmées",{"$f":"SUM(C17:BY17)","v":0},0,0,0,0,0,0,0,0,0,0,0,0,0,0,0,0,0,null,"Rondes confirmées",{"$f":"SUM(CC17:CT17)","v":0},"Rondes confirmées",{"$f":"SUM(CV17+CB17)","v":0},null,11,{"$f":"VLOOKUP(CZ17,A7:B187,2)","v":"FAVRESSSE René"},{"$f":"SUM(CB47)","v":0},{"$f":"SUM(CV47)","v":1222},1222]
[null,null,null,{"$f":"SUM((D15+D16)*D17)","v":0},0,0,0,0,0,0,0,0,0,0,0,0,0,0,0,0,0,0,0,0,0,0,0,0,0,0,0,0,0,0,0,0,0,0,0,0,0,0,0,0,0,0,0,0,0,0,0,0,0,0,0,0,0,0,0,0,0,0,0,0,0,{"$f":"SUM((BN15+BN16)*BN17)","v":0},0,0,0,0,0,0,0,{"$f":"SUM((BV15+BV16)*BV17)","v":0},0,0,0,null,"Rondes effectuées",{"$f":"COUNTIF(D15:BY15,\">0\")","v":0},{"$f":"SUM((CC15+CC16)*CC17)","v":0},0,0,0,0,0,0,0,0,0,0,0,0,0,0,0,0,null,"Rondes Effectuées",{"$f":"COUNTIF(CC15:CS15,\">0\")","v":0},"Rondes effectuées",{"$f":"SUM(CV18+CB18)","v":0},null,12,{"$f":"VLOOKUP(CZ18,A7:B187,2)","v":"GOFFIN Amaury"},{"$f":"SUM(CB51)","v":0},{"$f":"SUM(CV51)","v":0},0]
[4,{"$f":"VLOOKUP(A19,'Numéro licences'!$H$4:$I$47,2)","v":"BRUNEAU Denis-Claude"},"Aller-Retour",null,null,null,null,null,null,null,null,null,null,null,null,null,null,null,null,null,null,null,null,null,null,null,null,null,null,null,null,null,null,null,null,null,null,null,null,null,null,null,null,null,null,null,null,null,null,null,null,null,null,null,null,null,null,null,null,null,null,null,null,null,null,null,null,null,null,null,null,null,null,null,null,null,null,{"$f":"SUM(D19:BY19)","v":0},"Km  renseignés",{"$f":"SUM(BZ19+BZ20)","v":0},null,null,1012,null,null,null,null,null,null,null,null,null,null,null,null,null,null,{"$f":"SUM(CC19:CS19)","v":1012},"Km  renseignés",{"$f":"SUM(CT19+CT20)","v":1342},"Km  renseignés",{"$f":"SUM(CB19+CV19)","v":1342},null,13,{"$f":"VLOOKUP(CZ19,A7:B187,2)","v":"HINYOT Thierry"},{"$f":"SUM(CB55)","v":0},{"$f":"SUM(CV55)","v":0},0]
[null,null,"Ronde",null,null,null,null,null,null,null,null,null,null,null,null,null,null,null,null,null,null,null,null,null,null,null,null,null,null,null,null,null,null,null,null,null,null,null,null,null,null,null,null,null,null,null,null,null,null,null,null,null,null,null,null,null,null,null,null,null,null,null,null,null,null,null,null,null,null,null,null,null,null,null,null,null,null,{"$f":"SUM(D20:BY20)","v":0},"Km confirmés",{"$f":"SUM(D22:BY22)","v":0},null,null,330,null,null,null,null,null,null,null,null,null,null,null,null,null,null,{"$f":"SUM(CC20:CS20)","v":330},"Km confirmés",{"$f":"SUM(CC22:CS22)","v":1342},"Km confirmés",{"$f":"SUM(CV20+CB20)","v":1342},null,14,{"$f":"VLOOKUP(CZ20,A7:B187,2)","v":"JAMOTTE Jean"},{"$f":"SUM(CB59)","v":0},{"$f":"SUM(CV59)","v":1156},1156]
[null,null,null,0,0,0,0,0,0,0,0,0,0,0,0,0,0,0,0,0,0,0,0,0,0,0,0,0,0,0,0,0,0,0,0,0,0,0,0,0,0,0,0,0,0,0,0,0,0,0,0,0,0,0,0,0,0,0,0,0,0,0,0,0,0,0,0,0,0,0,0,0,0,0,0,0,0,null,"Rondes confirmées",{"$f":"SUM(C21:BY21)","v":0},0,0,1,0,0,0,0,0,0,0,0,0,0,0,0,0,0,null,"Rondes confirmées",{"$f":"SUM(CC21:CT21)","v":1},"Rondes confirmées",{"$f":"SUM(CV21+CB21)","v":1},null,15,{"$f":"VLOOKUP(CZ21,A7:B187,2)","v":"LAMBOTTE Didier"},{"$f":"SUM(CB63)","v":0},{"$f":"SUM(CV63)","v":0},0]
[null,null,null,{"$f":"SUM((D19+D20)*D21)","v":0},0,0,0,0,0,0,0,0,0,0,0,0,0,0,0,0,0,0,0,0,0,0,0,0,0,0,0,0,0,0,0,0,0,0,0,0,0,0,0,0,0,0,0,0,0,0,0,0,0,0,0,0,0,0,0,0,0,0,0,0,0,{"$f":"SUM((BN19+BN20)*BN21)","v":0},0,0,0,0,0,0,0,{"$f":"SUM((BV19+BV20)*BV21)","v":0},0,0,0,null,"Rondes effectuées",{"$f":"COUNTIF(D19:BY19,\">0\")","v":0},{"$f":"SUM((CC19+CC20)*CC21)","v":0},0,1342,0,0,0,0,0,0,0,0,0,0,0,0,0,0,null,"Rondes Effectuées",{"$f":"COUNTIF(CC19:CS19,\">0\")","v":1},"Rondes effectuées",{"$f":"SUM(CV22+CB22)","v":1},null,16,{"$f":"VLOOKUP(CZ22,A7:B187,2)","v":"LESCAL Thierry"},{"$f":"SUM(CB67)","v":0},{"$f":"SUM(CV67)","v":0},0]
[5,{"$f":"VLOOKUP(A23,'Numéro licences'!$H$4:$I$47,2)","v":"DAVIN Philippe"},"Aller-Retour",null,null,null,null,null,null,null,null,null,null,null,null,null,null,null,null,null,null,null,null,null,null,null,null,null,null,null,null,null,null,null,null,null,null,null,null,null,null,null,null,null,null,null,null,null,null,null,null,null,null,null,null,null,null,null,null,null,null,null,null,null,null,null,null,null,null,null,null,null,null,null,null,null,null,{"$f":"SUM(D23:BY23)","v":0},"Km  renseignés",{"$f":"SUM(BZ23+BZ24)","v":0},null,null,746,null,null,null,null,null,null,null,null,null,null,null,null,null,null,{"$f":"SUM(CC23:CS23)","v":746},"Km  renseignés",{"$f":"SUM(CT23+CT24)","v":1076},"Km  renseignés",{"$f":"SUM(CB23+CV23)","v":1076},null,17,{"$f":"VLOOKUP(CZ23,A7:B187,2)","v":"MALLIEN Philippe"},{"$f":"SUM(CB71)","v":0},{"$f":"SUM(CV71)","v":0},0]
[null,null,"Ronde",null,null,null,null,null,null,null,null,null,null,null,null,null,null,null,null,null,null,null,null,null,null,null,null,null,null,null,null,null,null,null,null,null,null,null,null,null,null,null,null,null,null,null,null,null,null,null,null,null,null,null,null,null,null,null,null,null,null,null,null,null,null,null,null,null,null,null,null,null,null,null,null,null,null,{"$f":"SUM(D24:BY24)","v":0},"Km confirmés",{"$f":"SUM(D26:BY26)","v":0},null,null,330,null,null,null,null,null,null,null,null,null,null,null,null,null,null,{"$f":"SUM(CC24:CS24)","v":330},"Km confirmés",{"$f":"SUM(CC26:CS26)","v":1076},"Km confirmés",{"$f":"SUM(CV24+CB24)","v":1076},null,18,{"$f":"VLOOKUP(CZ24,A7:B187,2)","v":"MANZANO Pascal"},{"$f":"SUM(CB75)","v":11055},{"$f":"SUM(CV75)","v":1248},12303]
[null,null,null,0,0,0,0,0,0,0,0,0,0,0,0,0,0,0,0,0,0,0,0,0,0,0,0,0,0,0,0,0,0,0,0,0,0,0,0,0,0,0,0,0,0,0,0,0,0,0,0,0,0,0,0,0,0,0,0,0,0,0,0,0,0,0,0,0,0,0,0,0,0,0,0,0,0,null,"Rondes confirmées",{"$f":"SUM(C25:BY25)","v":0},0,0,1,0,0,0,0,0,0,0,0,0,0,0,0,0,0,null,"Rondes confirmées",{"$f":"SUM(CC25:CT25)","v":1},"Rondes confirmées",{"$f":"SUM(CV25+CB25)","v":1},null,19,{"$f":"VLOOKUP(CZ25,A7:B187,2)","v":"MARIEL Didier"},{"$f":"SUM(CB79)","v":0},{"$f":"SUM(CV79)","v":0},0]
[null,null,null,{"$f":"SUM((D23+D24)*D25)","v":0},0,0,0,0,0,0,0,0,0,0,0,0,0,0,0,0,0,0,0,0,0,0,0,0,0,0,0,0,0,0,0,0,0,0,0,0,0,0,0,0,0,0,0,0,0,0,0,0,0,0,0,0,0,0,0,0,0,0,0,0,0,{"$f":"SUM((BN23+BN24)*BN25)","v":0},0,0,0,0,0,0,0,{"$f":"SUM((BV23+BV24)*BV25)","v":0},0,0,0,null,"Rondes effectuées",{"$f":"COUNTIF(D23:BY23,\">0\")","v":0},{"$f":"SUM((CC23+CC24)*CC25)","v":0},0,1076,0,0,0,0,0,0,0,0,0,0,0,0,0,0,null,"Rondes Effectuées",{"$f":"COUNTIF(CC23:CS23,\">0\")","v":1},"Rondes effectuées",{"$f":"SUM(CV26+CB26)","v":1},null,20,{"$f":"VLOOKUP(CZ26,A7:B187,2)","v":"MILET Benoit"},{"$f":"SUM(CB83)","v":0},{"$f":"SUM(CV83)","v":1056},1056]
[6,{"$f":"VLOOKUP(A27,'Numéro licences'!$H$4:$I$47,2)","v":"DESCAMPS Geoffrey"},"Aller-Retour",null,null,null,null,null,null,null,null,null,null,null,null,null,null,null,null,null,null,null,null,null,null,null,null,null,null,null,null,null,null,null,null,null,null,null,null,null,null,null,null,null,null,null,null,null,null,null,null,null,null,null,null,null,null,null,null,null,null,null,null,null,null,null,null,null,null,null,null,null,null,null,null,null,null,{"$f":"SUM(D27:BY27)","v":0},"Km  renseignés",{"$f":"SUM(BZ27+BZ28)","v":0},null,null,920,null,null,null,null,null,null,null,null,null,null,null,null,null,null,{"$f":"SUM(CC27:CS27)","v":920},"Km  renseignés",{"$f":"SUM(CT27+CT28)","v":1250},"Km  renseignés",{"$f":"SUM(CB27+CV27)","v":1250},null,21,{"$f":"VLOOKUP(CZ27,A7:B187,2)","v":"NIHOUL Dany"},{"$f":"SUM(CB87)","v":0},{"$f":"SUM(CV87)","v":0},0]
[null,null,"Ronde",null,null,null,null,null,null,null,null,null,null,null,null,null,null,null,null,null,null,null,null,null,null,null,null,null,null,null,null,null,null,null,null,null,null,null,null,null,null,null,null,null,null,null,null,null,null,null,null,null,null,null,null,null,null,null,null,null,null,null,null,null,null,null,null,null,null,null,null,null,null,null,null,null,null,{"$f":"SUM(D28:BY28)","v":0},"Km confirmés",{"$f":"SUM(D30:BY30)","v":0},null,null,330,null,null,null,null,null,null,null,null,null,null,null,null,null,null,{"$f":"SUM(CC28:CS28)","v":330},"Km confirmés",{"$f":"SUM(CC30:CS30)","v":1250},"Km confirmés",{"$f":"SUM(CV28+CB28)","v":1250},null,22,{"$f":"VLOOKUP(CZ28,A7:B187,2)","v":"PARMENTIER Dominique"},{"$f":"SUM(CB91)","v":0},{"$f":"SUM(CV91)","v":0},0]
[null,null,null,0,0,0,0,0,0,0,0,0,0,0,0,0,0,0,0,0,0,0,0,0,0,0,0,0,0,0,0,0,0,0,0,0,0,0,0,0,0,0,0,0,0,0,0,0,0,0,0,0,0,0,0,0,0,0,0,0,0,0,0,0,0,0,0,0,0,0,0,0,0,0,0,0,0,null,"Rondes confirmées",{"$f":"SUM(C29:BY29)","v":0},0,0,1,0,0,0,0,0,0,0,0,0,0,0,0,0,0,null,"Rondes confirmées",{"$f":"SUM(CC29:CT29)","v":1},"Rondes confirmées",{"$f":"SUM(CV29+CB29)","v":1},null,23,{"$f":"VLOOKUP(CZ29,A7:B187,2)","v":"RAMEAU Didier"},{"$f":"SUM(CB95)","v":0},{"$f":"SUM(CV95)","v":0},0]
[null,null,null,{"$f":"SUM((D27+D28)*D29)","v":0},0,0,0,0,0,0,0,0,0,0,0,0,0,0,0,0,0,0,0,0,0,0,0,0,0,0,0,0,0,0,0,0,0,0,0,0,0,0,0,0,0,0,0,0,0,0,0,0,0,0,0,0,0,0,0,0,0,0,0,0,0,{"$f":"SUM((BN27+BN28)*BN29)","v":0},0,0,0,0,0,0,0,{"$f":"SUM((BV27+BV28)*BV29)","v":0},0,0,0,null,"Rondes effectuées",{"$f":"COUNTIF(D27:BY27,\">0\")","v":0},{"$f":"SUM((CC27+CC28)*CC29)","v":0},0,1250,0,0,0,0,0,0,0,0,0,0,0,0,0,0,null,"Rondes Effectuées",{"$f":"COUNTIF(CC27:CS27,\">0\")","v":1},"Rondes effectuées",{"$f":"SUM(CV30+CB30)","v":1},null,24,{"$f":"VLOOKUP(CZ30,A7:B187,2)","v":"SMEETS Carine"},{"$f":"SUM(CB99)","v":0},{"$f":"SUM(CV99)","v":0},0]
[7,{"$f":"VLOOKUP(A31,'Numéro licences'!$H$4:$I$47,2)","v":"DESMAREE Francis"},"Aller-Retour",null,null,null,null,null,null,null,null,null,null,null,null,null,null,null,null,null,null,null,null,null,null,null,null,null,null,null,null,null,null,null,null,null,null,null,null,null,null,null,null,null,null,null,null,null,null,null,null,null,null,null,null,null,null,null,null,null,null,null,null,null,null,null,null,null,null,null,null,null,null,null,null,null,null,{"$f":"SUM(D31:BY31)","v":0},"Km  renseignés",{"$f":"SUM(BZ31+BZ32)","v":0},null,null,null,null,null,null,null,null,null,null,null,null,null,null,null,null,null,{"$f":"SUM(CC31:CS31)","v":0},"Km  renseignés",{"$f":"SUM(CT31+CT32)","v":0},"Km  renseignés",{"$f":"SUM(CB31+CV31)","v":0},null,25,{"$f":"VLOOKUP(CZ31,A7:B187,2)","v":"STRYPSTEIN Nicolas"},{"$f":"SUM(CB103)","v":0},{"$f":"SUM(CV103)","v":2570},2570]
[null,null,"Ronde",null,null,null,null,null,null,null,null,null,null,null,null,null,null,null,null,null,null,null,null,null,null,null,null,null,null,null,null,null,null,null,null,null,null,null,null,null,null,null,null,null,null,null,null,null,null,null,null,null,null,null,null,null,null,null,null,null,null,null,null,null,null,null,null,null,null,null,null,null,null,null,null,null,null,{"$f":"SUM(D32:BY32)","v":0},"Km confirmés",{"$f":"SUM(D34:BY34)","v":0},null,null,null,null,null,null,null,null,null,null,null,null,null,null,null,null,null,{"$f":"SUM(CC32:CS32)","v":0},"Km confirmés",{"$f":"SUM(CC34:CS34)","v":0},"Km confirmés",{"$f":"SUM(CV32+CB32)","v":0},null,26,{"$f":"VLOOKUP(CZ32,A7:B187,2)","v":"URBAIN Philippe"},{"$f":"SUM(CB107)","v":0},{"$f":"SUM(CV107)","v":1194},1194]
[null,null,null,0,0,0,0,0,0,0,0,0,0,0,0,0,0,0,0,0,0,0,0,0,0,0,0,0,0,0,0,0,0,0,0,0,0,0,0,0,0,0,0,0,0,0,0,0,0,0,0,0,0,0,0,0,0,0,0,0,0,0,0,0,0,0,0,0,0,0,0,0,0,0,0,0,0,null,"Rondes confirmées",{"$f":"SUM(C33:BY33)","v":0},0,0,0,0,0,0,0,0,0,0,0,0,0,0,0,0,0,null,"Rondes confirmées",{"$f":"SUM(CC33:CT33)","v":0},"Rondes confirmées",{"$f":"SUM(CV33+CB33)","v":0},null,27,{"$f":"VLOOKUP(CZ33,A7:B187,2)","v":"VANBELLINGEN Jean-Claude"},{"$f":"SUM(CB111)","v":2203},{"$f":"SUM(CV111)","v":0},2203]
[null,null,null,{"$f":"SUM((D31+D32)*D33)","v":0},0,0,0,0,0,0,0,0,0,0,0,0,0,0,0,0,0,0,0,0,0,0,0,0,0,0,0,0,0,0,0,0,0,0,0,0,0,0,0,0,0,0,0,0,0,0,0,0,0,0,0,0,0,0,0,0,0,0,0,0,0,{"$f":"SUM((BN31+BN32)*BN33)","v":0},0,0,0,0,0,0,0,{"$f":"SUM((BV31+BV32)*BV33)","v":0},0,0,0,null,"Rondes effectuées",{"$f":"COUNTIF(D31:BY31,\">0\")","v":0},{"$f":"SUM((CC31+CC32)*CC33)","v":0},0,0,0,0,0,0,0,0,0,0,0,0,0,0,0,0,null,"Rondes Effectuées",{"$f":"COUNTIF(CC31:CS31,\">0\")","v":0},"Rondes effectuées",{"$f":"SUM(CV34+CB34)","v":0},null,28,{"$f":"VLOOKUP(CZ34,A7:B187,2)","v":"VAN DER BEETEN Pascal"},{"$f":"SUM(CB115)","v":0},{"$f":"SUM(CV115)","v":0},0]
[8,{"$f":"VLOOKUP(A35,'Numéro licences'!$H$4:$I$47,2)","v":"DEWAERSEGHERS Francis"},"Aller-Retour",null,null,null,null,null,null,null,null,null,null,null,null,null,null,null,null,null,null,null,null,null,null,null,null,null,null,null,null,null,null,null,null,null,null,null,null,null,null,null,null,null,null,null,null,null,null,null,null,null,null,null,null,null,null,null,null,null,null,null,null,null,null,null,null,null,null,null,null,null,null,null,null,null,null,{"$f":"SUM(D35:BY35)","v":0},"Km  renseignés",{"$f":"SUM(BZ35+BZ36)","v":0},null,null,null,null,null,null,null,null,null,null,null,null,null,null,null,null,null,{"$f":"SUM(CC35:CS35)","v":0},"Km  renseignés",{"$f":"SUM(CT35+CT36)","v":0},"Km  renseignés",{"$f":"SUM(CB35+CV35)","v":0},null,29,{"$f":"VLOOKUP(CZ35,A7:B187,2)","v":"VANSTEYVOORT André"},{"$f":"SUM(CB119)","v":4000},{"$f":"SUM(CV119)","v":0},4000]
[null,null,"Ronde",null,null,null,null,null,null,null,null,null,null,null,null,null,null,null,null,null,null,null,null,null,null,null,null,null,null,null,null,null,null,null,null,null,null,null,null,null,null,null,null,null,null,null,null,null,null,null,null,null,null,null,null,null,null,null,null,null,null,null,null,null,null,null,null,null,null,null,null,null,null,null,null,null,null,{"$f":"SUM(D36:BY36)","v":0},"Km confirmés",{"$f":"SUM(D38:BY38)","v":0},null,null,null,null,null,null,null,null,null,null,null,null,null,null,null,null,null,{"$f":"SUM(CC36:CS36)","v":0},"Km confirmés",{"$f":"SUM(CC38:CS38)","v":0},"Km confirmés",{"$f":"SUM(CV36+CB36)","v":0},null,30,{"$f":"VLOOKUP(CZ36,A7:B187,2)","v":"WOUTERS Olivier"},{"$f":"SUM(CB123)","v":0},{"$f":"SUM(CV123)","v":0},0]
[null,null,null,0,0,0,0,0,0,0,0,0,0,0,0,0,0,0,0,0,0,0,0,0,0,0,0,0,0,0,0,0,0,0,0,0,0,0,0,0,0,0,0,0,0,0,0,0,0,0,0,0,0,0,0,0,0,0,0,0,0,0,0,0,0,0,0,0,0,0,0,0,0,0,0,0,0,null,"Rondes confirmées",{"$f":"SUM(C37:BY37)","v":0},0,0,0,0,0,0,0,0,0,0,0,0,0,0,0,0,0,null,"Rondes confirmées",{"$f":"SUM(CC37:CT37)","v":0},"Rondes confirmées",{"$f":"SUM(CV37+CB37)","v":0},null,31,{"$f":"VLOOKUP(CZ37,A7:B187,2)","v":"THIRIFAYS Vincent"},{"$f":"SUM(CB127)","v":0},{"$f":"SUM(CV127)","v":0},0]
[null,null,null,{"$f":"SUM((D35+D36)*D37)","v":0},0,0,0,0,0,0,0,0,0,0,0,0,0,0,0,0,0,0,0,0,0,0,0,0,0,0,0,0,0,0,0,0,0,0,0,0,0,0,0,0,0,0,0,0,0,0,0,0,0,0,0,0,0,0,0,0,0,0,0,0,0,{"$f":"SUM((BN35+BN36)*BN37)","v":0},0,0,0,0,0,0,0,{"$f":"SUM((BV35+BV36)*BV37)","v":0},0,0,0,null,"Rondes effectuées",{"$f":"COUNTIF(D35:BY35,\">0\")","v":0},{"$f":"SUM((CC35+CC36)*CC37)","v":0},0,0,0,0,0,0,0,0,0,0,0,0,0,0,0,0,null,"Rondes Effectuées",{"$f":"COUNTIF(CC35:CS35,\">0\")","v":0},"Rondes effectuées",{"$f":"SUM(CV38+CB38)","v":0},null,32,{"$f":"VLOOKUP(CZ38,A7:B187,2)","v":"VANDY Rudi"},{"$f":"SUM(CB131)","v":0},{"$f":"SUM(CV131)","v":0},0]
[9,{"$f":"VLOOKUP(A39,'Numéro licences'!$H$4:$I$47,2)","v":"DHONDT Jerry"},"Aller-Retour",null,null,null,null,null,null,null,null,null,null,null,null,null,null,null,null,null,null,null,null,null,null,null,null,null,null,null,null,null,null,null,null,null,null,null,null,null,null,null,null,null,null,null,null,null,null,null,null,null,null,null,null,null,null,null,null,null,null,null,null,null,null,null,null,null,null,null,null,null,null,null,null,null,null,{"$f":"SUM(D39:BY39)","v":0},"Km  renseignés",{"$f":"SUM(BZ39+BZ40)","v":0},null,null,null,null,null,null,null,null,null,null,null,null,null,null,null,null,null,{"$f":"SUM(CC39:CS39)","v":0},"Km  renseignés",{"$f":"SUM(CT39+CT40)","v":0},"Km  renseignés",{"$f":"SUM(CB39+CV39)","v":0},null,33,{"$f":"VLOOKUP(CZ39,A7:B187,2)","v":"LEFRANT Sébastien"},{"$f":"SUM(CB135)","v":0},{"$f":"SUM(CV135)","v":0},0]
[null,null,"Ronde",null,null,null,null,null,null,null,null,null,null,null,null,null,null,null,null,null,null,null,null,null,null,null,null,null,null,null,null,null,null,null,null,null,null,null,null,null,null,null,null,null,null,null,null,null,null,null,null,null,null,null,null,null,null,null,null,null,null,null,null,null,null,null,null,null,null,null,null,null,null,null,null,null,null,{"$f":"SUM(D40:BY40)","v":0},"Km confirmés",{"$f":"SUM(D42:BY42)","v":0},null,null,null,null,null,null,null,null,null,null,null,null,null,null,null,null,null,{"$f":"SUM(CC40:CS40)","v":0},"Km confirmés",{"$f":"SUM(CC42:CS42)","v":0},"Km confirmés",{"$f":"SUM(CV40+CB40)","v":0},null,34,{"$f":"VLOOKUP(CZ40,A7:B187,2)","v":0},{"$f":"SUM(CB139)","v":0},{"$f":"SUM(CV139)","v":0},0]
[null,null,null,0,0,0,0,0,0,0,0,0,0,0,0,0,0,0,0,0,0,0,0,0,0,0,0,0,0,0,0,0,0,0,0,0,0,0,0,0,0,0,0,0,0,0,0,0,0,0,0,0,0,0,0,0,0,0,0,0,0,0,0,0,0,0,0,0,0,0,0,0,0,0,0,0,0,null,"Rondes confirmées",{"$f":"SUM(C41:BY41)","v":0},0,0,0,0,0,0,0,0,0,0,0,0,0,0,0,0,0,null,"Rondes confirmées",{"$f":"SUM(CC41:CT41)","v":0},"Rondes confirmées",{"$f":"SUM(CV41+CB41)","v":0},null,35,{"$f":"VLOOKUP(CZ41,A7:B187,2)","v":0},{"$f":"SUM(CB143)","v":0},{"$f":"SUM(CV143)","v":0},0]
[null,null,null,{"$f":"SUM((D39+D40)*D41)","v":0},0,0,0,0,0,0,0,0,0,0,0,0,0,0,0,0,0,0,0,0,0,0,0,0,0,0,0,0,0,0,0,0,0,0,0,0,0,0,0,0,0,0,0,0,0,0,0,0,0,0,0,0,0,0,0,0,0,0,0,0,0,{"$f":"SUM((BN39+BN40)*BN41)","v":0},0,0,0,0,0,0,0,{"$f":"SUM((BV39+BV40)*BV41)","v":0},0,0,0,null,"Rondes effectuées",{"$f":"COUNTIF(D39:BY39,\">0\")","v":0},{"$f":"SUM((CC39+CC40)*CC41)","v":0},0,0,0,0,0,0,0,0,0,0,0,0,0,0,0,0,null,"Rondes Effectuées",{"$f":"COUNTIF(CC39:CS39,\">0\")","v":0},"Rondes effectuées",{"$f":"SUM(CV42+CB42)","v":0},null,36,{"$f":"VLOOKUP(CZ42,A7:B187,2)","v":0},{"$f":"SUM(CB147)","v":0},{"$f":"SUM(CV147)","v":0},0]
[10,{"$f":"VLOOKUP(A43,'Numéro licences'!$H$4:$I$47,2)","v":"DONY Marc"},"Aller-Retour",null,null,null,null,null,null,null,null,null,null,null,null,null,null,null,null,null,null,null,null,null,null,null,null,null,null,null,null,null,null,null,null,null,null,null,null,null,null,null,null,null,null,null,null,null,null,null,null,null,null,null,null,null,null,null,null,null,null,null,null,null,null,null,null,null,null,null,null,null,null,null,null,null,null,{"$f":"SUM(D43:BY43)","v":0},"Km  renseignés",{"$f":"SUM(BZ43+BZ44)","v":0},null,null,890,null,null,null,null,null,null,null,null,null,null,null,null,null,null,{"$f":"SUM(CC43:CS43)","v":890},"Km  renseignés",{"$f":"SUM(CT43+CT44)","v":1220},"Km  renseignés",{"$f":"SUM(CB43+CV43)","v":1220},null,37,{"$f":"VLOOKUP(CZ43,A7:B187,2)","v":0},{"$f":"SUM(CB151)","v":0},{"$f":"SUM(CV151)","v":0},0]
[null,null,"Ronde",null,null,null,null,null,null,null,null,null,null,null,null,null,null,null,null,null,null,null,null,null,null,null,null,null,null,null,null,null,null,null,null,null,null,null,null,null,null,null,null,null,null,null,null,null,null,null,null,null,null,null,null,null,null,null,null,null,null,null,null,null,null,null,null,null,null,null,null,null,null,null,null,null,null,{"$f":"SUM(D44:BY44)","v":0},"Km confirmés",{"$f":"SUM(D46:BY46)","v":0},null,null,330,null,null,null,null,null,null,null,null,null,null,null,null,null,null,{"$f":"SUM(CC44:CS44)","v":330},"Km confirmés",{"$f":"SUM(CC46:CS46)","v":1220},"Km confirmés",{"$f":"SUM(CV44+CB44)","v":1220},null,38,{"$f":"VLOOKUP(CZ44,A7:B187,2)","v":0},{"$f":"SUM(CB155)","v":0},{"$f":"SUM(CV155)","v":0},0]
[null,null,null,0,0,0,0,0,0,0,0,0,0,0,0,0,0,0,0,0,0,0,0,0,0,0,0,0,0,0,0,0,0,0,0,0,0,0,0,0,0,0,0,0,0,0,0,0,0,0,0,0,0,0,0,0,0,0,0,0,0,0,0,0,0,0,0,0,0,0,0,0,0,0,0,0,0,null,"Rondes confirmées",{"$f":"SUM(C45:BY45)","v":0},0,0,1,0,0,0,0,0,0,0,0,0,0,0,0,0,0,null,"Rondes confirmées",{"$f":"SUM(CC45:CT45)","v":1},"Rondes confirmées",{"$f":"SUM(CV45+CB45)","v":1},null,39,{"$f":"VLOOKUP(CZ45,A7:B187,2)","v":0},{"$f":"SUM(CB159)","v":0},{"$f":"SUM(CV159)","v":0},0]
[null,null,null,{"$f":"SUM((D43+D44)*D45)","v":0},0,0,0,0,0,0,0,0,0,0,0,0,0,0,0,0,0,0,0,0,0,0,0,0,0,0,0,0,0,0,0,0,0,0,0,0,0,0,0,0,{"$f":"SUM((AS43+AS44)*AS45)","v":0},0,0,0,0,0,0,0,0,0,0,0,0,0,0,0,0,0,0,0,0,{"$f":"SUM((BN43+BN44)*BN45)","v":0},0,0,0,0,0,0,0,{"$f":"SUM((BV43+BV44)*BV45)","v":0},0,0,0,null,"Rondes effectuées",{"$f":"COUNTIF(D43:BY43,\">0\")","v":0},{"$f":"SUM((CC43+CC44)*CC45)","v":0},0,1220,0,0,0,0,0,0,0,0,0,0,0,0,0,0,null,"Rondes Effectuées",{"$f":"COUNTIF(CC43:CS43,\">0\")","v":1},"Rondes effectuées",{"$f":"SUM(CV46+CB46)","v":1},null,40,{"$f":"VLOOKUP(CZ46,A7:B187,2)","v":0},{"$f":"SUM(CB163)","v":0},{"$f":"SUM(CV163)","v":0},0]
[11,{"$f":"VLOOKUP(A47,'Numéro licences'!$H$4:$I$47,2)","v":"FAVRESSSE René"},"Aller-Retour",null,null,null,null,null,null,null,null,null,null,null,null,null,null,null,null,null,null,null,null,null,null,null,null,null,null,null,null,null,null,null,null,null,null,null,null,null,null,null,null,null,null,null,null,null,null,null,null,null,null,null,null,null,null,null,null,null,null,null,null,null,null,null,null,null,null,null,null,null,null,null,null,null,null,{"$f":"SUM(D47:BY47)","v":0},"Km  renseignés",{"$f":"SUM(BZ47+BZ48)","v":0},222,null,null,null,null,null,null,null,null,null,null,null,null,null,null,null,null,{"$f":"SUM(CC47:CS47)","v":222},"Km  renseignés",{"$f":"SUM(CT47+CT48)","v":1222},"Km  renseignés",{"$f":"SUM(CB47+CV47)","v":1222},null,41,{"$f":"VLOOKUP(CZ47,A7:B187,2)","v":0},{"$f":"SUM(CB167)","v":0},{"$f":"SUM(CV167)","v":0},0]
[null,null,"Ronde",null,null,null,null,null,null,null,null,null,null,null,null,null,null,null,null,null,null,null,null,null,null,null,null,null,null,null,null,null,null,null,null,null,null,null,null,null,null,null,null,null,null,null,null,null,null,null,null,null,null,null,null,null,null,null,null,null,null,null,null,null,null,null,null,null,null,null,null,null,null,null,null,null,null,{"$f":"SUM(D48:BY48)","v":0},"Km confirmés",{"$f":"SUM(D50:BY50)","v":0},1000,null,null,null,null,null,null,null,null,null,null,null,null,null,null,null,null,{"$f":"SUM(CC48:CS48)","v":1000},"Km confirmés",{"$f":"SUM(CC50:CS50)","v":1222},"Km confirmés",{"$f":"SUM(CV48+CB48)","v":1222},null,42,{"$f":"VLOOKUP(CZ48,A7:B187,2)","v":0},{"$f":"SUM(CB171)","v":0},{"$f":"SUM(CV171)","v":0},0]
[null,null,null,0,0,0,0,0,0,0,0,0,0,0,0,0,0,0,0,0,0,0,0,0,0,0,0,0,0,0,0,0,0,0,0,0,0,0,0,0,0,0,0,0,0,0,0,0,0,0,0,0,0,0,0,0,0,0,0,0,0,0,0,0,0,0,0,0,0,0,0,0,0,0,0,0,0,null,"Rondes confirmées",{"$f":"SUM(C49:BY49)","v":0},1,0,0,0,0,0,0,0,0,0,0,0,0,0,0,0,0,null,"Rondes confirmées",{"$f":"SUM(CC49:CT49)","v":1},"Rondes confirmées",{"$f":"SUM(CV49+CB49)","v":1},null,43,{"$f":"VLOOKUP(CZ49,A7:B187,2)","v":0},{"$f":"SUM(CB175)","v":0},{"$f":"SUM(CV175)","v":0},0]
[null,null,null,{"$f":"SUM((D47+D48)*D49)","v":0},0,0,0,0,0,0,0,0,0,0,0,0,0,0,0,0,0,0,0,0,0,0,0,0,0,0,0,0,0,0,0,0,0,0,0,0,0,0,0,0,0,0,0,0,0,0,0,0,0,0,0,0,0,0,0,0,0,0,0,0,0,{"$f":"SUM((BN47+BN48)*BN49)","v":0},0,0,0,0,0,0,0,{"$f":"SUM((BV47+BV48)*BV49)","v":0},0,0,0,null,"Rondes effectuées",{"$f":"COUNTIF(D47:BY47,\">0\")","v":0},{"$f":"SUM((CC47+CC48)*CC49)","v":1222},0,0,0,0,0,0,0,0,0,0,0,0,0,0,0,0,null,"Rondes Effectuées",{"$f":"COUNTIF(CC47:CS47,\">0\")","v":1},"Rondes effectuées",{"$f":"SUM(CV50+CB50)","v":1},null,44,{"$f":"VLOOKUP(CZ50,A7:B187,2)","v":0},{"$f":"SUM(CB179)","v":0},{"$f":"SUM(CV179)","v":0},0]
[12,{"$f":"VLOOKUP(A51,'Numéro licences'!$H$4:$I$47,2)","v":"GOFFIN Amaury"},"Aller-Retour",null,null,null,null,null,null,null,null,null,null,null,null,null,null,null,null,null,null,null,null,null,null,null,null,null,null,null,null,null,null,null,null,null,null,null,null,null,null,null,null,null,null,null,null,null,null,null,null,null,null,null,null,null,null,null,null,null,null,null,null,null,null,null,null,null,null,null,null,null,null,null,null,null,null,{"$f":"SUM(D51:BY51)","v":0},"Km  renseignés",{"$f":"SUM(BZ51+BZ52)","v":0},null,null,null,null,null,null,null,null,null,null,null,null,null,null,null,null,null,{"$f":"SUM(CC51:CS51)","v":0},"Km  renseignés",{"$f":"SUM(CT51+CT52)","v":0},"Km  renseignés",{"$f":"SUM(CB51+CV51)","v":0},null,45,{"$f":"VLOOKUP(CZ51,A7:B187,2)","v":0},{"$f":"SUM(CB183)","v":0},{"$f":"SUM(CV183)","v":0},0]
[null,null,"Ronde",null,null,null,null,null,null,null,null,null,null,null,null,null,null,null,null,null,null,null,null,null,null,null,null,null,null,null,null,null,null,null,null,null,null,null,null,null,null,null,null,null,null,null,null,null,null,null,null,null,null,null,null,null,null,null,null,null,null,null,null,null,null,null,null,null,null,null,null,null,null,null,null,null,null,{"$f":"SUM(D52:BY52)","v":0},"Km confirmés",{"$f":"SUM(D54:BY54)","v":0},null,null,null,null,null,null,null,null,null,null,null,null,null,null,null,null,null,{"$f":"SUM(CC52:CS52)","v":0},"Km confirmés",{"$f":"SUM(CC54:CS54)","v":0},"Km confirmés",{"$f":"SUM(CV52+CB52)","v":0},null,46,{"$f":"VLOOKUP(CZ52,A7:B187,2)","v":0},{"$f":"SUM(CB187)","v":0},{"$f":"SUM(CV187)","v":0},0]
[null,null,null,0,0,0,0,0,0,0,0,0,0,0,0,0,0,0,0,0,0,0,0,0,0,0,0,0,0,0,0,0,0,0,0,0,0,0,0,0,0,0,0,0,0,0,0,0,0,0,0,0,0,0,0,0,0,0,0,0,0,0,0,0,0,0,0,0,0,0,0,0,0,0,0,0,0,null,"Rondes confirmées",{"$f":"SUM(C53:BY53)","v":0},0,0,0,0,0,0,0,0,0,0,0,0,0,0,0,0,0,null,"Rondes confirmées",{"$f":"SUM(CC53:CT53)","v":0},"Rondes confirmées",{"$f":"SUM(CV53+CB53)","v":0}]
[null,null,null,{"$f":"SUM((D51+D52)*D53)","v":0},0,0,0,0,0,0,0,0,0,0,0,0,0,0,0,0,0,0,0,0,0,0,0,0,0,0,0,0,0,0,0,0,0,0,0,0,0,0,0,0,0,0,0,0,0,0,0,0,0,0,0,0,0,0,0,0,0,0,0,0,0,{"$f":"SUM((BN51+BN52)*BN53)","v":0},0,0,0,0,0,0,0,{"$f":"SUM((BV51+BV52)*BV53)","v":0},0,0,0,null,"Rondes effectuées",{"$f":"COUNTIF(D51:BY51,\">0\")","v":0},{"$f":"SUM((CC51+CC52)*CC53)","v":0},0,0,0,0,0,0,0,0,0,0,0,0,0,0,0,0,null,"Rondes Effectuées",{"$f":"COUNTIF(CC51:CS51,\">0\")","v":0},"Rondes effectuées",{"$f":"SUM(CV54+CB54)","v":0}]
[13,{"$f":"VLOOKUP(A55,'Numéro licences'!$H$4:$I$47,2)","v":"HINYOT Thierry"},"Aller-Retour",null,null,null,null,null,null,null,null,null,null,null,null,null,null,null,null,null,null,null,null,null,null,null,null,null,null,null,null,null,null,null,null,null,null,null,null,null,null,null,null,null,null,null,null,null,null,null,null,null,null,null,null,null,null,null,null,null,null,null,null,null,null,null,null,null,null,null,null,null,null,null,null,null,null,{"$f":"SUM(D55:BY55)","v":0},"Km  renseignés",{"$f":"SUM(BZ55+BZ56)","v":0},null,null,null,null,null,null,null,null,null,null,null,null,null,null,null,null,null,{"$f":"SUM(CC55:CS55)","v":0},"Km  renseignés",{"$f":"SUM(CT55+CT56)","v":0},"Km  renseignés",{"$f":"SUM(CB55+CV55)","v":0}]
[null,null,"Ronde",null,null,null,null,null,null,null,null,null,null,null,null,null,null,null,null,null,null,null,null,null,null,null,null,null,null,null,null,null,null,null,null,null,null,null,null,null,null,null,null,null,null,null,null,null,null,null,null,null,null,null,null,null,null,null,null,null,null,null,null,null,null,null,null,null,null,null,null,null,null,null,null,null,null,{"$f":"SUM(D56:BY56)","v":0},"Km confirmés",{"$f":"SUM(D58:BY58)","v":0},null,null,null,null,null,null,null,null,null,null,null,null,null,null,null,null,null,{"$f":"SUM(CC56:CS56)","v":0},"Km confirmés",{"$f":"SUM(CC58:CS58)","v":0},"Km confirmés",{"$f":"SUM(CV56+CB56)","v":0}]
[null,null,null,0,0,0,0,0,0,0,0,0,0,0,0,0,0,0,0,0,0,0,0,0,0,0,0,0,0,0,0,0,0,0,0,0,0,0,0,0,0,0,0,0,0,0,0,0,0,0,0,0,0,0,0,0,0,0,0,0,0,0,0,0,0,0,0,0,0,0,0,0,0,0,0,0,0,null,"Rondes confirmées",{"$f":"SUM(C57:BY57)","v":0},0,0,0,0,0,0,0,0,0,0,0,0,0,0,0,0,0,null,"Rondes confirmées",{"$f":"SUM(CC57:CT57)","v":0},"Rondes confirmées",{"$f":"SUM(CV57+CB57)","v":0}]
[null,null,null,{"$f":"SUM((D55+D56)*D57)","v":0},0,0,0,0,0,0,0,0,0,0,0,0,0,0,0,0,0,0,0,0,0,0,0,0,0,0,0,0,0,0,0,0,0,0,0,0,0,0,0,0,0,0,0,0,0,0,0,0,0,0,0,0,0,0,0,0,0,0,0,0,0,{"$f":"SUM((BN55+BN56)*BN57)","v":0},0,0,0,0,0,0,0,{"$f":"SUM((BV55+BV56)*BV57)","v":0},0,0,0,null,"Rondes effectuées",{"$f":"COUNTIF(D55:BY55,\">0\")","v":0},{"$f":"SUM((CC55+CC56)*CC57)","v":0},0,0,0,0,0,0,0,0,0,0,0,0,0,0,0,0,null,"Rondes Effectuées",{"$f":"COUNTIF(CC55:CS55,\">0\")","v":0},"Rondes effectuées",{"$f":"SUM(CV58+CB58)","v":0},null,null,null,{"$f":"SUM(DB8:DB52)","v":17258},{"$f":"SUM(DC8:DC52)","v":13334},{"$f":"SUM(DD7:DD52)","v":31716}]
[14,{"$f":"VLOOKUP(A59,'Numéro licences'!$H$4:$I$47,2)","v":"JAMOTTE Jean"},"Aller-Retour",null,null,null,null,null,null,null,null,null,null,null,null,null,null,null,null,null,null,null,null,null,null,null,null,null,null,null,null,null,null,null,null,null,null,null,null,null,null,null,null,null,null,null,null,null,null,null,null,null,null,null,null,null,null,null,null,null,null,null,null,null,null,null,null,null,null,null,null,null,null,null,null,null,null,{"$f":"SUM(D59:BY59)","v":0},"Km  renseignés",{"$f":"SUM(BZ59+BZ60)","v":0},null,null,826,null,null,null,null,null,null,null,null,null,null,null,null,null,null,{"$f":"SUM(CC59:CS59)","v":826},"Km  renseignés",{"$f":"SUM(CT59+CT60)","v":1156},"Km  renseignés",{"$f":"SUM(CB59+CV59)","v":1156},null,null,null,{"$f":"SUM(DB58/DD58)","v":0.54414175810316556},{"$f":"SUM(DC58/DD58)","v":0.42041871610543574}]
[null,null,"Ronde",null,null,null,null,null,null,null,null,null,null,null,null,null,null,null,null,null,null,null,null,null,null,null,null,null,null,null,null,null,null,null,null,null,null,null,null,null,null,null,null,null,null,null,null,null,null,null,null,null,null,null,null,null,null,null,null,null,null,null,null,null,null,null,null,null,null,null,null,null,null,null,null,null,null,{"$f":"SUM(D60:BY60)","v":0},"Km confirmés",{"$f":"SUM(D62:BY62)","v":0},null,null,330,null,null,null,null,null,null,null,null,null,null,null,null,null,null,{"$f":"SUM(CC60:CS60)","v":330},"Km confirmés",{"$f":"SUM(CC62:CS62)","v":1156},"Km confirmés",{"$f":"SUM(CV60+CB60)","v":1156},null,null,null,"FMB","Hors FMB"]
[null,null,null,0,0,0,0,0,0,0,0,0,0,0,0,0,0,0,0,0,0,0,0,0,0,0,0,0,0,0,0,0,0,0,0,0,0,0,0,0,0,0,0,0,0,0,0,0,0,0,0,0,0,0,0,0,0,0,0,0,0,0,0,0,0,0,0,0,0,0,0,0,0,0,0,0,0,null,"Rondes confirmées",{"$f":"SUM(C61:BY61)","v":0},0,0,1,0,0,0,0,0,0,0,0,0,0,0,0,0,0,null,"Rondes confirmées",{"$f":"SUM(CC61:CT61)","v":1},"Rondes confirmées",{"$f":"SUM(CV61+CB61)","v":1}]
[null,null,null,{"$f":"SUM((D59+D60)*D61)","v":0},0,0,0,0,0,0,0,0,0,0,0,0,0,0,0,0,0,0,0,0,0,0,0,0,0,0,0,0,0,0,0,0,0,0,0,0,0,0,0,0,0,0,0,0,0,0,0,0,0,0,0,0,0,0,0,0,0,0,0,0,0,{"$f":"SUM((BN59+BN60)*BN61)","v":0},0,0,0,0,0,0,0,{"$f":"SUM((BV59+BV60)*BV61)","v":0},0,0,0,null,"Rondes effectuées",{"$f":"COUNTIF(D59:BY59,\">0\")","v":0},{"$f":"SUM((CC59+CC60)*CC61)","v":0},0,1156,0,0,0,0,0,0,0,0,0,0,0,0,0,0,null,"Rondes Effectuées",{"$f":"COUNTIF(CC59:CS59,\">0\")","v":1},"Rondes effectuées",{"$f":"SUM(CV62+CB62)","v":1}]
[15,{"$f":"VLOOKUP(A63,'Numéro licences'!$H$4:$I$47,2)","v":"LAMBOTTE Didier"},"Aller-Retour",null,null,null,null,null,null,null,null,null,null,null,null,null,null,null,null,null,null,null,null,null,null,null,null,null,null,null,null,null,null,null,null,null,null,null,null,null,null,null,null,null,null,null,null,null,null,null,null,null,null,null,null,null,null,null,null,null,null,null,null,null,null,null,null,null,null,null,null,null,null,null,null,null,null,{"$f":"SUM(D63:BY63)","v":0},"Km  renseignés",{"$f":"SUM(BZ63+BZ64)","v":0},null,null,null,null,null,null,null,null,null,null,null,null,null,null,null,null,null,{"$f":"SUM(CC63:CS63)","v":0},"Km  renseignés",{"$f":"SUM(CT63+CT64)","v":0},"Km  renseignés",{"$f":"SUM(CB63+CV63)","v":0}]
[null,null,"Ronde",null,null,null,null,null,null,null,null,null,null,null,null,null,null,null,null,null,null,null,null,null,null,null,null,null,null,null,null,null,null,null,null,null,null,null,null,null,null,null,null,null,null,null,null,null,null,null,null,null,null,null,null,null,null,null,null,null,null,null,null,null,null,null,null,null,null,null,null,null,null,null,null,null,null,{"$f":"SUM(D64:BY64)","v":0},"Km confirmés",{"$f":"SUM(D66:BY66)","v":0},null,null,null,null,null,null,null,null,null,null,null,null,null,null,null,null,null,{"$f":"SUM(CC64:CS64)","v":0},"Km confirmés",{"$f":"SUM(CC66:CS66)","v":0},"Km confirmés",{"$f":"SUM(CV64+CB64)","v":0}]
[null,null,null,0,0,0,0,0,0,0,0,0,0,0,0,0,0,0,0,0,0,0,0,0,0,0,0,0,0,0,0,0,0,0,0,0,0,0,0,0,0,0,0,0,0,0,0,0,0,0,0,0,0,0,0,0,0,0,0,0,0,0,0,0,0,0,0,0,0,0,0,0,0,0,0,0,0,null,"Rondes confirmées",{"$f":"SUM(C65:BY65)","v":0},0,0,0,0,0,0,0,0,0,0,0,0,0,0,0,0,0,null,"Rondes confirmées",{"$f":"SUM(CC65:CT65)","v":0},"Rondes confirmées",{"$f":"SUM(CV65+CB65)","v":0}]
[null,null,null,{"$f":"SUM((D63+D64)*D65)","v":0},0,0,0,0,0,0,0,0,0,0,0,0,0,0,0,0,0,0,0,0,0,0,0,0,0,0,0,0,0,0,0,0,0,0,0,0,0,0,0,0,0,0,0,0,0,0,0,0,0,0,0,0,0,0,0,0,0,0,0,0,0,{"$f":"SUM((BN63+BN64)*BN65)","v":0},0,0,0,0,0,0,0,{"$f":"SUM((BV63+BV64)*BV65)","v":0},0,0,0,null,"Rondes effectuées",{"$f":"COUNTIF(D63:BY63,\">0\")","v":0},{"$f":"SUM((CC63+CC64)*CC65)","v":0},0,0,0,0,0,0,0,0,0,0,0,0,0,0,0,0,null,"Rondes Effectuées",{"$f":"COUNTIF(CC63:CS63,\">0\")","v":0},"Rondes effectuées",{"$f":"SUM(CV66+CB66)","v":0}]
[16,{"$f":"VLOOKUP(A67,'Numéro licences'!$H$4:$I$47,2)","v":"LESCAL Thierry"},"Aller-Retour",null,null,null,null,null,null,null,null,null,null,null,null,null,null,null,null,null,null,null,null,null,null,null,null,null,null,null,null,null,null,null,null,null,null,null,null,null,null,null,null,null,null,null,null,null,null,null,null,null,null,null,null,null,null,null,null,null,null,null,null,null,null,null,null,null,null,null,null,null,null,null,null,null,null,{"$f":"SUM(D67:BY67)","v":0},"Km  renseignés",{"$f":"SUM(BZ67+BZ68)","v":0},null,null,null,null,null,null,null,null,null,null,null,null,null,null,null,null,null,{"$f":"SUM(CC67:CS67)","v":0},"Km  renseignés",{"$f":"SUM(CT67+CT68)","v":0},"Km  renseignés",{"$f":"SUM(CB67+CV67)","v":0}]
[null,null,"Ronde",null,null,null,null,null,null,null,null,null,null,null,null,null,null,null,null,null,null,null,null,null,null,null,null,null,null,null,null,null,null,null,null,null,null,null,null,null,null,null,null,null,null,null,null,null,null,null,null,null,null,null,null,null,null,null,null,null,null,null,null,null,null,null,null,null,null,null,null,null,null,null,null,null,null,{"$f":"SUM(D68:BY68)","v":0},"Km confirmés",{"$f":"SUM(D70:BY70)","v":0},null,null,null,null,null,null,null,null,null,null,null,null,null,null,null,null,null,{"$f":"SUM(CC68:CS68)","v":0},"Km confirmés",{"$f":"SUM(CC70:CS70)","v":0},"Km confirmés",{"$f":"SUM(CV68+CB68)","v":0}]
[null,null,null,0,0,0,0,0,0,0,0,0,0,0,0,0,0,0,0,0,0,0,0,0,0,0,0,0,0,0,0,0,0,0,0,0,0,0,0,0,0,0,0,0,0,0,0,0,0,0,0,0,0,0,0,0,0,0,0,0,0,0,0,0,0,0,0,0,0,0,0,0,0,0,0,0,0,null,"Rondes confirmées",{"$f":"SUM(C69:BY69)","v":0},0,0,0,0,0,0,0,0,0,0,0,0,0,0,0,0,0,null,"Rondes confirmées",{"$f":"SUM(CC69:CT69)","v":0},"Rondes confirmées",{"$f":"SUM(CV69+CB69)","v":0}]
[null,null,null,{"$f":"SUM((D67+D68)*D69)","v":0},0,0,0,0,0,0,0,0,0,0,0,0,0,0,0,0,0,0,0,0,0,0,0,0,0,0,0,0,0,0,0,0,0,0,0,0,0,0,0,0,0,0,0,0,0,0,0,0,0,0,0,0,0,0,0,0,0,0,0,0,0,{"$f":"SUM((BN67+BN68)*BN69)","v":0},0,0,0,0,0,0,0,{"$f":"SUM((BV67+BV68)*BV69)","v":0},0,0,0,null,"Rondes effectuées",{"$f":"COUNTIF(D67:BY67,\">0\")","v":0},{"$f":"SUM((CC67+CC68)*CC69)","v":0},0,0,0,0,0,0,0,0,0,0,0,0,0,0,0,0,null,"Rondes Effectuées",{"$f":"COUNTIF(CC67:CS67,\">0\")","v":0},"Rondes effectuées",{"$f":"SUM(CV70+CB70)","v":0}]
[17,{"$f":"VLOOKUP(A71,'Numéro licences'!$H$4:$I$47,2)","v":"MALLIEN Philippe"},"Aller-Retour",null,null,null,null,null,null,null,null,null,null,null,null,null,null,null,null,null,null,null,null,null,null,null,null,null,null,null,null,null,null,null,null,null,null,null,null,null,null,null,null,null,null,null,null,null,null,null,null,null,null,null,null,null,null,null,null,null,null,null,null,null,null,null,null,null,null,null,null,null,null,null,null,null,null,{"$f":"SUM(D71:BY71)","v":0},"Km  renseignés",{"$f":"SUM(BZ71+BZ72)","v":0},null,null,null,null,null,null,null,null,null,null,null,null,null,null,null,null,null,{"$f":"SUM(CC71:CS71)","v":0},"Km  renseignés",{"$f":"SUM(CT71+CT72)","v":0},"Km  renseignés",{"$f":"SUM(CB71+CV71)","v":0}]
[null,null,"Ronde",null,null,null,null,null,null,null,null,null,null,null,null,null,null,null,null,null,null,null,null,null,null,null,null,null,null,null,null,null,null,null,null,null,null,null,null,null,null,null,null,null,null,null,null,null,null,null,null,null,null,null,null,null,null,null,null,null,null,null,null,null,null,null,null,null,null,null,null,null,null,null,null,null,null,{"$f":"SUM(D72:BY72)","v":0},"Km confirmés",{"$f":"SUM(D74:BY74)","v":0},null,null,null,null,null,null,null,null,null,null,null,null,null,null,null,null,null,{"$f":"SUM(CC72:CS72)","v":0},"Km confirmés",{"$f":"SUM(CC74:CS74)","v":0},"Km confirmés",{"$f":"SUM(CV72+CB72)","v":0}]
[null,null,null,0,0,0,0,0,0,0,0,0,0,0,0,0,0,0,0,0,0,0,0,0,0,0,0,0,0,0,0,0,0,0,0,0,0,0,0,0,0,0,0,0,0,0,0,0,0,0,0,0,0,0,0,0,0,0,0,0,0,0,0,0,0,0,0,0,0,0,0,0,0,0,0,0,0,null,"Rondes confirmées",{"$f":"SUM(C73:BY73)","v":0},0,0,0,0,0,0,0,0,0,0,0,0,0,0,0,0,0,null,"Rondes confirmées",{"$f":"SUM(CC73:CT73)","v":0},"Rondes confirmées",{"$f":"SUM(CV73+CB73)","v":0}]
[null,null,null,{"$f":"SUM((D71+D72)*D73)","v":0},0,0,0,0,0,0,0,0,0,0,0,0,0,0,0,0,0,0,0,0,0,0,0,0,0,0,0,0,0,0,0,0,0,0,0,0,0,0,0,0,0,0,0,0,0,0,0,0,0,0,0,0,0,0,0,0,0,0,0,0,0,{"$f":"SUM((BN71+BN72)*BN73)","v":0},0,0,0,0,0,0,0,{"$f":"SUM((BV71+BV72)*BV73)","v":0},0,0,0,null,"Rondes effectuées",{"$f":"COUNTIF(D71:BY71,\">0\")","v":0},{"$f":"SUM((CC71+CC72)*CC73)","v":0},{"$f":"SUM((CD71+CD72)*CD73)","v":0},0,0,0,0,0,0,0,0,0,0,0,0,0,0,0,null,"Rondes Effectuées",{"$f":"COUNTIF(CC71:CS71,\">0\")","v":0},"Rondes effectuées",{"$f":"SUM(CV74+CB74)","v":0}]
[18,{"$f":"VLOOKUP(A75,'Numéro licences'!$H$4:$I$47,2)","v":"MANZANO Pascal"},"Aller-Retour",null,null,null,null,null,null,null,null,null,null,990,null,null,null,null,null,null,null,1573,null,null,null,null,null,null,null,null,null,null,null,null,null,null,2760,null,null,null,null,null,null,null,2234,null,null,1386,null,null,null,null,null,null,null,null,null,null,null,null,null,null,null,null,null,1351,null,null,549,null,null,null,null,null,null,null,null,{"$f":"SUM(D75:BY75)","v":10843},"Km  renseignés",{"$f":"SUM(BZ75+BZ76)","v":11055},null,null,918,null,null,null,null,null,null,null,null,null,null,null,null,null,null,{"$f":"SUM(CC75:CS75)","v":918},"Km  renseignés",{"$f":"SUM(CT75+CT76)","v":1248},"Km  renseignés",{"$f":"SUM(CB75+CV75)","v":12303}]
[null,null,"Ronde",null,null,null,null,null,null,null,null,null,null,0,null,null,null,null,null,null,null,212,null,null,null,null,null,null,null,null,null,null,null,null,null,null,0,null,null,null,null,null,null,null,0,null,null,0,null,null,null,null,null,null,null,null,null,null,null,null,null,null,null,null,null,0,null,null,0,null,null,null,null,null,null,null,null,{"$f":"SUM(D76:BY76)","v":212},"Km confirmés",{"$f":"SUM(D78:BY78)","v":11055},null,null,330,null,null,null,null,null,null,null,null,null,null,null,null,null,null,{"$f":"SUM(CC76:CS76)","v":330},"Km confirmés",{"$f":"SUM(CC78:CS78)","v":1248},"Km confirmés",{"$f":"SUM(CV76+CB76)","v":12303}]
[null,null,null,0,0,0,0,0,0,0,0,0,0,1,0,0,0,0,0,0,0,1,0,0,0,0,0,0,0,0,0,0,0,0,0,0,1,0,0,0,0,0,0,0,1,0,0,1,0,0,0,0,0,0,0,0,0,0,0,0,0,0,0,0,0,1,0,0,1,0,0,0,0,0,0,0,0,null,"Rondes confirmées",{"$f":"SUM(C77:BY77)","v":7},0,0,1,0,0,0,0,0,0,0,0,0,0,0,0,0,0,null,"Rondes confirmées",{"$f":"SUM(CC77:CT77)","v":1},"Rondes confirmées",{"$f":"SUM(CV77+CB77)","v":8}]
[null,null,null,{"$f":"SUM((D75+D76)*D77)","v":0},0,0,0,0,0,0,0,0,0,990,0,0,0,0,0,0,0,1785,0,0,0,0,0,0,0,0,0,0,0,0,0,0,2760,0,0,0,0,0,0,0,2234,0,0,1386,0,0,0,0,0,0,0,0,0,0,0,0,0,0,0,0,0,{"$f":"SUM((BN75+BN76)*BN77)","v":1351},0,0,549,0,0,0,0,{"$f":"SUM((BV75+BV76)*BV77)","v":0},0,0,0,null,"Rondes effectuées",{"$f":"COUNTIF(D75:BY75,\">0\")","v":7},{"$f":"SUM((CC75+CC76)*CC77)","v":0},{"$f":"SUM((CD75+CD76)*CD77)","v":0},1248,0,0,0,0,0,0,0,0,0,0,0,0,0,0,null,"Rondes Effectuées",{"$f":"COUNTIF(CC75:CS75,\">0\")","v":1},"Rondes effectuées",{"$f":"SUM(CV78+CB78)","v":8}]
[19,{"$f":"VLOOKUP(A79,'Numéro licences'!$H$4:$I$47,2)","v":"MARIEL Didier"},"Aller-Retour",null,null,null,null,null,null,null,null,null,null,null,null,null,null,null,null,null,null,null,null,null,null,null,null,null,null,null,null,null,null,null,null,null,null,null,null,null,null,null,null,null,null,null,null,null,null,null,null,null,null,null,null,null,null,null,null,null,null,null,null,null,null,null,null,null,null,null,null,null,null,null,null,null,null,{"$f":"SUM(D79:BY79)","v":0},"Km  renseignés",{"$f":"SUM(BZ79+BZ80)","v":0},null,null,null,null,null,null,null,null,null,null,null,null,null,null,null,null,null,{"$f":"SUM(CC79:CS79)","v":0},"Km  renseignés",{"$f":"SUM(CT79+CT80)","v":0},"Km  renseignés",{"$f":"SUM(CB79+CV79)","v":0}]
[null,null,"Ronde",null,null,null,null,null,null,null,null,null,null,null,null,null,null,null,null,null,null,null,null,null,null,null,null,null,null,null,null,null,null,null,null,null,null,null,null,null,null,null,null,null,null,null,null,null,null,null,null,null,null,null,null,null,null,null,null,null,null,null,null,null,null,null,null,null,null,null,null,null,null,null,null,null,null,{"$f":"SUM(D80:BY80)","v":0},"Km confirmés",{"$f":"SUM(D82:BY82)","v":0},null,null,null,null,null,null,null,null,null,null,null,null,null,null,null,null,null,{"$f":"SUM(CC80:CS80)","v":0},"Km confirmés",{"$f":"SUM(CC82:CS82)","v":0},"Km confirmés",{"$f":"SUM(CV80+CB80)","v":0}]
[null,null,null,0,0,0,0,0,0,0,0,0,0,0,0,0,0,0,0,0,0,0,0,0,0,0,0,0,0,0,0,0,0,0,0,0,0,0,0,0,0,0,0,0,0,0,0,0,0,0,0,0,0,0,0,0,0,0,0,0,0,0,0,0,0,0,0,0,0,0,0,0,0,0,0,0,0,null,"Rondes confirmées",{"$f":"SUM(C81:BY81)","v":0},0,0,0,0,0,0,0,0,0,0,0,0,0,0,0,0,0,null,"Rondes confirmées",{"$f":"SUM(CC81:CT81)","v":0},"Rondes confirmées",{"$f":"SUM(CV81+CB81)","v":0}]
[null,null,null,{"$f":"SUM((D79+D80)*D81)","v":0},0,0,0,0,0,0,0,0,0,0,0,0,0,0,0,0,0,0,0,0,0,0,0,0,0,0,0,0,0,0,0,0,0,0,0,0,0,0,0,0,0,0,0,0,0,0,0,0,0,0,0,0,0,0,0,0,0,0,0,0,0,{"$f":"SUM((BN79+BN80)*BN81)","v":0},0,0,0,0,0,0,0,{"$f":"SUM((BV79+BV80)*BV81)","v":0},0,0,0,null,"Rondes effectuées",{"$f":"COUNTIF(D79:BY79,\">0\")","v":0},{"$f":"SUM((CC79+CC80)*CC81)","v":0},{"$f":"SUM((CD79+CD80)*CD81)","v":0},0,0,0,0,0,0,0,0,0,0,0,0,0,0,0,null,"Rondes Effectuées",{"$f":"COUNTIF(CC79:CS79,\">0\")","v":0},"Rondes effectuées",{"$f":"SUM(CV82+CB82)","v":0}]
[20,{"$f":"VLOOKUP(A83,'Numéro licences'!$H$4:$I$47,2)","v":"MILET Benoit"},"Aller-Retour",null,null,null,null,null,null,null,null,null,null,null,null,null,null,null,null,null,null,null,null,null,null,null,null,null,null,null,null,null,null,null,null,null,null,null,null,null,null,null,null,null,null,null,null,null,null,null,null,null,null,null,null,null,null,null,null,null,null,null,null,null,null,null,null,null,null,null,null,null,null,null,null,null,null,{"$f":"SUM(D83:BY83)","v":0},"Km  renseignés",{"$f":"SUM(BZ83+BZ84)","v":0},null,null,726,null,null,null,null,null,null,null,null,null,null,null,null,null,null,{"$f":"SUM(CC83:CS83)","v":726},"Km  renseignés",{"$f":"SUM(CT83+CT84)","v":1056},"Km  renseignés",{"$f":"SUM(CB83+CV83)","v":1056}]
[null,null,"Ronde",null,null,null,null,null,null,null,null,null,null,null,null,null,null,null,null,null,null,null,null,null,null,null,null,null,null,null,null,null,null,null,null,null,null,null,null,null,null,null,null,null,null,null,null,null,null,null,null,null,null,null,null,null,null,null,null,null,null,null,null,null,null,null,null,null,null,null,null,null,null,null,null,null,null,{"$f":"SUM(D84:BY84)","v":0},"Km confirmés",{"$f":"SUM(D86:BY86)","v":0},null,null,330,null,null,null,null,null,null,null,null,null,null,null,null,null,null,{"$f":"SUM(CC84:CS84)","v":330},"Km confirmés",{"$f":"SUM(CC86:CS86)","v":1056},"Km confirmés",{"$f":"SUM(CV84+CB84)","v":1056}]
[null,null,null,0,0,0,0,0,0,0,0,0,0,0,0,0,0,0,0,0,0,0,0,0,0,0,0,0,0,0,0,0,0,0,0,0,0,0,0,0,0,0,0,0,0,0,0,0,0,0,0,0,0,0,0,0,0,0,0,0,0,0,0,0,0,0,0,0,0,0,0,0,0,0,0,0,0,null,"Rondes confirmées",{"$f":"SUM(C85:BY85)","v":0},0,0,1,0,0,0,0,0,0,0,0,0,0,0,0,0,0,null,"Rondes confirmées",{"$f":"SUM(CC85:CT85)","v":1},"Rondes confirmées",{"$f":"SUM(CV85+CB85)","v":1}]
[null,null,null,{"$f":"SUM((D83+D84)*D85)","v":0},0,0,0,0,0,0,0,0,0,0,0,0,0,0,0,0,0,0,0,0,0,0,0,0,0,0,0,0,0,0,0,0,0,0,0,0,0,0,0,0,0,0,0,0,0,0,0,0,0,0,0,0,0,0,0,0,0,0,0,0,0,{"$f":"SUM((BN83+BN84)*BN85)","v":0},0,0,0,0,0,0,0,{"$f":"SUM((BV83+BV84)*BV85)","v":0},0,0,0,null,"Rondes effectuées",{"$f":"COUNTIF(D83:BY83,\">0\")","v":0},{"$f":"SUM((CC83+CC84)*CC85)","v":0},{"$f":"SUM((CD83+CD84)*CD85)","v":0},1056,0,0,0,0,0,0,0,0,0,0,0,0,0,0,null,"Rondes Effectuées",{"$f":"COUNTIF(CC83:CS83,\">0\")","v":1},"Rondes effectuées",{"$f":"SUM(CV86+CB86)","v":1}]
[21,{"$f":"VLOOKUP(A87,'Numéro licences'!$H$4:$I$47,2)","v":"NIHOUL Dany"},"Aller-Retour",null,null,null,null,null,null,null,null,null,null,null,null,null,null,null,null,null,null,null,null,null,null,null,null,null,null,null,null,null,null,null,null,null,null,null,null,null,null,null,null,null,null,null,null,null,null,null,null,null,null,null,null,null,null,null,null,null,null,null,null,null,null,null,null,null,null,null,null,null,null,null,null,null,null,{"$f":"SUM(D87:BY87)","v":0},"Km  renseignés",{"$f":"SUM(BZ87+BZ88)","v":0},null,null,null,null,null,null,null,null,null,null,null,null,null,null,null,null,null,{"$f":"SUM(CC87:CS87)","v":0},"Km  renseignés",{"$f":"SUM(CT87+CT88)","v":0},"Km  renseignés",{"$f":"SUM(CB87+CV87)","v":0}]
[null,null,"Ronde",null,null,null,null,null,null,null,null,null,null,null,null,null,null,null,null,null,null,null,null,null,null,null,null,null,null,null,null,null,null,null,null,null,null,null,null,null,null,null,null,null,null,null,null,null,null,null,null,null,null,null,null,null,null,null,null,null,null,null,null,null,null,null,null,null,null,null,null,null,null,null,null,null,null,{"$f":"SUM(D88:BY88)","v":0},"Km confirmés",{"$f":"SUM(D90:BY90)","v":0},null,null,null,null,null,null,null,null,null,null,null,null,null,null,null,null,null,{"$f":"SUM(CC88:CS88)","v":0},"Km confirmés",{"$f":"SUM(CC90:CS90)","v":0},"Km confirmés",{"$f":"SUM(CV88+CB88)","v":0}]
[null,null,null,0,0,0,0,0,0,0,0,0,0,0,0,0,0,0,0,0,0,0,0,0,0,0,0,0,0,0,0,0,0,0,0,0,0,0,0,0,0,0,0,0,0,0,0,0,0,0,0,0,0,0,0,0,0,0,0,0,0,0,0,0,0,0,0,0,0,0,0,0,0,0,0,0,0,null,"Rondes confirmées",{"$f":"SUM(C89:BY89)","v":0},0,0,0,0,0,0,0,0,0,0,0,0,0,0,0,0,0,null,"Rondes confirmées",{"$f":"SUM(CC89:CT89)","v":0},"Rondes confirmées",{"$f":"SUM(CV89+CB89)","v":0}]
[null,null,null,{"$f":"SUM((D87+D88)*D89)","v":0},0,0,0,0,0,0,0,0,0,0,0,0,0,0,0,0,0,0,0,0,0,0,0,0,0,0,0,0,0,0,0,0,0,0,0,0,0,0,0,0,0,0,0,0,0,0,0,0,0,0,0,0,0,0,0,0,0,0,0,0,0,{"$f":"SUM((BN87+BN88)*BN89)","v":0},0,0,0,0,0,0,0,{"$f":"SUM((BV87+BV88)*BV89)","v":0},0,0,0,null,"Rondes effectuées",{"$f":"COUNTIF(D87:BY87,\">0\")","v":0},{"$f":"SUM((CC87+CC88)*CC89)","v":0},{"$f":"SUM((CD87+CD88)*CD89)","v":0},0,0,0,0,0,0,0,0,0,0,0,0,0,0,0,null,"Rondes Effectuées",{"$f":"COUNTIF(CC87:CS87,\">0\")","v":0},"Rondes effectuées",{"$f":"SUM(CV90+CB90)","v":0}]
[22,{"$f":"VLOOKUP(A91,'Numéro licences'!$H$4:$I$47,2)","v":"PARMENTIER Dominique"},"Aller-Retour",null,null,null,null,null,null,null,null,null,null,null,null,null,null,null,null,null,null,null,null,null,null,null,null,null,null,null,null,null,null,null,null,null,null,null,null,null,null,null,null,null,null,null,null,null,null,null,null,null,null,null,null,null,null,null,null,null,null,null,null,null,null,null,null,null,null,null,null,null,null,null,null,null,null,{"$f":"SUM(D91:BY91)","v":0},"Km  renseignés",{"$f":"SUM(BZ91+BZ92)","v":0},null,null,null,null,null,null,null,null,null,null,null,null,null,null,null,null,null,{"$f":"SUM(CC91:CS91)","v":0},"Km  renseignés",{"$f":"SUM(CT91+CT92)","v":0},"Km  renseignés",{"$f":"SUM(CB91+CV91)","v":0}]
[null,null,"Ronde",null,null,null,null,null,null,null,null,null,null,null,null,null,null,null,null,null,null,null,null,null,null,null,null,null,null,null,null,null,null,null,null,null,null,null,null,null,null,null,null,null,null,null,null,null,null,null,null,null,null,null,null,null,null,null,null,null,null,null,null,null,null,null,null,null,null,null,null,null,null,null,null,null,null,{"$f":"SUM(D92:BY92)","v":0},"Km confirmés",{"$f":"SUM(D94:BY94)","v":0},null,null,null,null,null,null,null,null,null,null,null,null,null,null,null,null,null,{"$f":"SUM(CC92:CS92)","v":0},"Km confirmés",{"$f":"SUM(CC94:CS94)","v":0},"Km confirmés",{"$f":"SUM(CV92+CB92)","v":0}]
[null,null,null,0,0,0,0,0,0,0,0,0,0,0,0,0,0,0,0,0,0,0,0,0,0,0,0,0,0,0,0,0,0,0,0,0,0,0,0,0,0,0,0,0,0,0,0,0,0,0,0,0,0,0,0,0,0,0,0,0,0,0,0,0,0,0,0,0,0,0,0,0,0,0,0,0,0,null,"Rondes confirmées",{"$f":"SUM(C93:BY93)","v":0},0,0,0,0,0,0,0,0,0,0,0,0,0,0,0,0,0,null,"Rondes confirmées",{"$f":"SUM(CC93:CT93)","v":0},"Rondes confirmées",{"$f":"SUM(CV93+CB93)","v":0}]
[null,null,null,{"$f":"SUM((D91+D92)*D93)","v":0},0,0,0,0,0,0,0,0,0,0,0,0,0,0,0,0,0,0,0,0,0,0,0,0,0,0,0,0,0,0,0,0,0,0,0,0,0,0,0,0,0,0,0,0,0,0,0,0,0,0,0,0,0,0,0,0,0,0,0,0,0,{"$f":"SUM((BN91+BN92)*BN93)","v":0},0,0,0,0,0,0,0,{"$f":"SUM((BV91+BV92)*BV93)","v":0},0,0,0,null,"Rondes effectuées",{"$f":"COUNTIF(D91:BY91,\">0\")","v":0},{"$f":"SUM((CC91+CC92)*CC93)","v":0},{"$f":"SUM((CD91+CD92)*CD93)","v":0},0,0,0,0,0,0,0,0,0,0,0,0,0,0,0,null,"Rondes Effectuées",{"$f":"COUNTIF(CC91:CS91,\">0\")","v":0},"Rondes effectuées",{"$f":"SUM(CV94+CB94)","v":0}]
[23,{"$f":"VLOOKUP(A95,'Numéro licences'!$H$4:$I$47,2)","v":"RAMEAU Didier"},"Aller-Retour",null,null,null,null,null,null,null,null,null,null,null,null,null,null,null,null,null,null,null,null,null,null,null,null,null,null,null,null,null,null,null,null,null,null,null,null,null,null,null,null,null,null,null,null,null,null,null,null,null,null,null,null,null,null,null,null,null,null,null,null,null,null,null,null,null,null,null,null,null,null,null,null,null,null,{"$f":"SUM(D95:BY95)","v":0},"Km  renseignés",{"$f":"SUM(BZ95+BZ96)","v":0},null,null,null,null,null,null,null,null,null,null,null,null,null,null,null,null,null,{"$f":"SUM(CC95:CS95)","v":0},"Km  renseignés",{"$f":"SUM(CT95+CT96)","v":0},"Km  renseignés",{"$f":"SUM(CB95+CV95)","v":0}]
[null,null,"Ronde",null,null,null,null,null,null,null,null,null,null,null,null,null,null,null,null,null,null,null,null,null,null,null,null,null,null,null,null,null,null,null,null,null,null,null,null,null,null,null,null,null,null,null,null,null,null,null,null,null,null,null,null,null,null,null,null,null,null,null,null,null,null,null,null,null,null,null,null,null,null,null,null,null,null,{"$f":"SUM(D96:BY96)","v":0},"Km confirmés",{"$f":"SUM(D98:BY98)","v":0},null,null,null,null,null,null,null,null,null,null,null,null,null,null,null,null,null,{"$f":"SUM(CC96:CS96)","v":0},"Km confirmés",{"$f":"SUM(CC98:CS98)","v":0},"Km confirmés",{"$f":"SUM(CV96+CB96)","v":0}]
[null,null,null,0,0,0,0,0,0,0,0,0,0,0,0,0,0,0,0,0,0,0,0,0,0,0,0,0,0,0,0,0,0,0,0,0,0,0,0,0,0,0,0,0,0,0,0,0,0,0,0,0,0,0,0,0,0,0,0,0,0,0,0,0,0,0,0,0,0,0,0,0,0,0,0,0,0,null,"Rondes confirmées",{"$f":"SUM(C97:BY97)","v":0},0,0,0,0,0,0,0,0,0,0,0,0,0,0,0,0,0,null,"Rondes confirmées",{"$f":"SUM(CC97:CT97)","v":0},"Rondes confirmées",{"$f":"SUM(CV97+CB97)","v":0}]
[null,null,null,{"$f":"SUM((D95+D96)*D97)","v":0},0,0,0,0,0,0,0,0,0,0,0,0,0,0,0,0,0,0,0,0,0,0,0,0,0,0,0,0,0,0,0,0,0,0,0,0,0,0,0,0,0,0,0,0,0,0,0,0,0,0,0,0,0,0,0,0,0,0,0,0,0,{"$f":"SUM((BN95+BN96)*BN97)","v":0},0,0,0,0,0,0,0,{"$f":"SUM((BV95+BV96)*BV97)","v":0},0,0,0,null,"Rondes effectuées",{"$f":"COUNTIF(D95:BY95,\">0\")","v":0},{"$f":"SUM((CC95+CC96)*CC97)","v":0},{"$f":"SUM((CD95+CD96)*CD97)","v":0},0,0,0,0,0,0,0,0,0,0,0,0,0,0,0,null,"Rondes Effectuées",{"$f":"COUNTIF(CC95:CS95,\">0\")","v":0},"Rondes effectuées",{"$f":"SUM(CV98+CB98)","v":0}]
[24,{"$f":"VLOOKUP(A99,'Numéro licences'!$H$4:$I$47,2)","v":"SMEETS Carine"},"Aller-Retour",null,null,null,null,null,null,null,null,null,null,null,null,null,null,null,null,null,null,null,null,null,null,null,null,null,null,null,null,null,null,null,null,null,null,null,null,null,null,null,null,null,null,null,null,null,null,null,null,null,null,null,null,null,null,null,null,null,null,null,null,null,null,null,null,null,null,null,null,null,null,null,null,null,null,{"$f":"SUM(D99:BY99)","v":0},"Km  renseignés",{"$f":"SUM(BZ99+BZ100)","v":0},null,null,null,null,null,null,null,null,null,null,null,null,null,null,null,null,null,{"$f":"SUM(CC99:CS99)","v":0},"Km  renseignés",{"$f":"SUM(CT99+CT100)","v":0},"Km  renseignés",{"$f":"SUM(CB99+CV99)","v":0}]
[null,null,"Ronde",null,null,null,null,null,null,null,null,null,null,null,null,null,null,null,null,null,null,null,null,null,null,null,null,null,null,null,null,null,null,null,null,null,null,null,null,null,null,null,null,null,null,null,null,null,null,null,null,null,null,null,null,null,null,null,null,null,null,null,null,null,null,null,null,null,null,null,null,null,null,null,null,null,null,{"$f":"SUM(D100:BY100)","v":0},"Km confirmés",{"$f":"SUM(D102:BY102)","v":0},null,null,null,null,null,null,null,null,null,null,null,null,null,null,null,null,null,{"$f":"SUM(CC100:CS100)","v":0},"Km confirmés",{"$f":"SUM(CC102:CS102)","v":0},"Km confirmés",{"$f":"SUM(CV100+CB100)","v":0}]
[null,null,null,0,0,0,0,0,0,0,0,0,0,0,0,0,0,0,0,0,0,0,0,0,0,0,0,0,0,0,0,0,0,0,0,0,0,0,0,0,0,0,0,0,0,0,0,0,0,0,0,0,0,0,0,0,0,0,0,0,0,0,0,0,0,0,0,0,0,0,0,0,0,0,0,0,0,null,"Rondes confirmées",{"$f":"SUM(C101:BY101)","v":0},0,0,0,0,0,0,0,0,0,0,0,0,0,0,0,0,0,null,"Rondes confirmées",{"$f":"SUM(CC101:CT101)","v":0},"Rondes confirmées",{"$f":"SUM(CV101+CB101)","v":0}]
[null,null,null,{"$f":"SUM((D99+D100)*D101)","v":0},0,0,0,0,0,0,0,0,0,0,0,0,0,0,0,0,0,0,0,0,0,0,0,0,0,0,0,0,0,0,0,0,0,0,0,0,0,0,0,0,0,0,0,0,0,0,0,0,0,0,0,0,0,0,0,0,0,0,0,0,0,{"$f":"SUM((BN99+BN100)*BN101)","v":0},0,0,0,0,0,0,0,{"$f":"SUM((BV99+BV100)*BV101)","v":0},0,0,0,null,"Rondes effectuées",{"$f":"COUNTIF(D99:BY99,\">0\")","v":0},{"$f":"SUM((CC99+CC100)*CC101)","v":0},{"$f":"SUM((CD99+CD100)*CD101)","v":0},0,0,0,0,0,0,0,0,0,0,0,0,0,0,0,null,"Rondes Effectuées",{"$f":"COUNTIF(CC99:CS99,\">0\")","v":0},"Rondes effectuées",{"$f":"SUM(CV102+CB102)","v":0}]
[25,{"$f":"VLOOKUP(A103,'Numéro licences'!$H$4:$I$47,2)","v":"STRYPSTEIN Nicolas"},"Aller-Retour",null,null,null,null,null,null,null,null,null,null,null,null,null,null,null,null,null,null,null,null,null,null,null,null,null,null,null,null,null,null,null,null,null,null,null,null,null,null,null,null,null,null,null,null,null,null,null,null,null,null,null,null,null,null,null,null,null,null,null,null,null,null,null,null,null,null,null,null,null,null,null,null,null,null,{"$f":"SUM(D103:BY103)","v":0},"Km  renseignés",{"$f":"SUM(BZ103+BZ104)","v":0},null,null,2240,null,null,null,null,null,null,null,null,null,null,null,null,null,null,{"$f":"SUM(CC103:CS103)","v":2240},"Km  renseignés",{"$f":"SUM(CT103+CT104)","v":2570},"Km  renseignés",{"$f":"SUM(CB103+CV103)","v":2570}]
[null,null,"Ronde",null,null,null,null,null,null,null,null,null,null,null,null,null,null,null,null,null,null,null,null,null,null,null,null,null,null,null,null,null,null,null,null,null,null,null,null,null,null,null,null,null,null,null,null,null,null,null,null,null,null,null,null,null,null,null,null,null,null,null,null,null,null,null,null,null,null,null,null,null,null,null,null,null,null,{"$f":"SUM(D104:BY104)","v":0},"Km confirmés",{"$f":"SUM(D106:BY106)","v":0},null,null,330,null,null,null,null,null,null,null,null,null,null,null,null,null,null,{"$f":"SUM(CC104:CS104)","v":330},"Km confirmés",{"$f":"SUM(CC106:CS106)","v":2570},"Km confirmés",{"$f":"SUM(CV104+CB104)","v":2570}]
[null,null,null,0,0,0,0,0,0,0,0,0,0,0,0,0,0,0,0,0,0,0,0,0,0,0,0,0,0,0,0,0,0,0,0,0,0,0,0,0,0,0,0,0,0,0,0,0,0,0,0,0,0,0,0,0,0,0,0,0,0,0,0,0,0,0,0,0,0,0,0,0,0,0,0,0,0,null,"Rondes confirmées",{"$f":"SUM(C105:BY105)","v":0},0,0,1,0,0,0,0,0,0,0,0,0,0,0,0,0,0,null,"Rondes confirmées",{"$f":"SUM(CC105:CT105)","v":1},"Rondes confirmées",{"$f":"SUM(CV105+CB105)","v":1}]
[null,null,null,{"$f":"SUM((D103+D104)*D105)","v":0},0,0,0,0,0,0,0,0,0,0,0,0,0,0,0,0,0,0,0,0,0,0,0,0,0,0,0,0,0,0,0,0,0,0,0,0,0,0,0,0,0,0,0,0,0,0,0,0,0,0,0,0,0,0,0,0,0,0,0,0,0,{"$f":"SUM((BN103+BN104)*BN105)","v":0},0,0,0,0,0,0,0,{"$f":"SUM((BV103+BV104)*BV105)","v":0},0,0,0,null,"Rondes effectuées",{"$f":"COUNTIF(D103:BY103,\">0\")","v":0},{"$f":"SUM((CC103+CC104)*CC105)","v":0},{"$f":"SUM((CD103+CD104)*CD105)","v":0},2570,0,0,0,0,0,0,0,0,0,0,0,0,0,0,null,"Rondes Effectuées",{"$f":"COUNTIF(CC103:CS103,\">0\")","v":1},"Rondes effectuées",{"$f":"SUM(CV106+CB106)","v":1}]
[26,{"$f":"VLOOKUP(A107,'Numéro licences'!$H$4:$I$47,2)","v":"URBAIN Philippe"},"Aller-Retour",null,null,null,null,null,null,null,null,null,null,null,null,null,null,null,null,null,null,null,null,null,null,null,null,null,null,null,null,null,null,null,null,null,null,null,null,null,null,null,null,null,null,null,null,null,null,null,null,null,null,null,null,null,null,null,null,null,null,null,null,null,null,null,null,null,null,null,null,null,null,null,null,null,null,{"$f":"SUM(D107:BY107)","v":0},"Km  renseignés",{"$f":"SUM(BZ107+BZ108)","v":0},null,null,864,null,null,null,null,null,null,null,null,null,null,null,null,null,null,{"$f":"SUM(CC107:CS107)","v":864},"Km  renseignés",{"$f":"SUM(CT107+CT108)","v":1194},"Km  renseignés",{"$f":"SUM(CB107+CV107)","v":1194}]
[null,null,"Ronde",null,null,null,null,null,null,null,null,null,null,null,null,null,null,null,null,null,null,null,null,null,null,null,null,null,null,null,null,null,null,null,null,null,null,null,null,null,null,null,null,null,null,null,null,null,null,null,null,null,null,null,null,null,null,null,null,null,null,null,null,null,null,null,null,null,null,null,null,null,null,null,null,null,null,{"$f":"SUM(D108:BY108)","v":0},"Km confirmés",{"$f":"SUM(D110:BY110)","v":0},null,null,330,null,null,null,null,null,null,null,null,null,null,null,null,null,null,{"$f":"SUM(CC108:CS108)","v":330},"Km confirmés",{"$f":"SUM(CC110:CS110)","v":1194},"Km confirmés",{"$f":"SUM(CV108+CB108)","v":1194}]
[null,null,null,0,0,0,0,0,0,0,0,0,0,0,0,0,0,0,0,0,0,0,0,0,0,0,0,0,0,0,0,0,0,0,0,0,0,0,0,0,0,0,0,0,0,0,0,0,0,0,0,0,0,0,0,0,0,0,0,0,0,0,0,0,0,0,0,0,0,0,0,0,0,0,0,0,0,null,"Rondes confirmées",{"$f":"SUM(C109:BY109)","v":0},0,0,1,0,0,0,0,0,0,0,0,0,0,0,0,0,0,null,"Rondes confirmées",{"$f":"SUM(CC109:CT109)","v":1},"Rondes confirmées",{"$f":"SUM(CV109+CB109)","v":1}]
[null,null,null,{"$f":"SUM((D107+D108)*D109)","v":0},0,0,0,0,0,0,0,0,0,0,0,0,0,0,0,0,0,0,0,0,0,0,0,0,0,0,0,0,0,0,0,0,0,0,0,0,0,0,0,0,0,0,0,0,0,0,0,0,0,0,0,0,0,0,0,0,0,0,0,0,0,{"$f":"SUM((BN107+BN108)*BN109)","v":0},0,0,0,0,0,0,0,{"$f":"SUM((BV107+BV108)*BV109)","v":0},0,0,0,null,"Rondes effectuées",{"$f":"COUNTIF(D107:BY107,\">0\")","v":0},{"$f":"SUM((CC107+CC108)*CC109)","v":0},{"$f":"SUM((CD107+CD108)*CD109)","v":0},1194,0,0,0,0,0,0,0,0,0,0,0,0,0,0,null,"Rondes Effectuées",{"$f":"COUNTIF(CC107:CS107,\">0\")","v":1},"Rondes effectuées",{"$f":"SUM(CV110+CB110)","v":1}]
[27,{"$f":"VLOOKUP(A111,'Numéro licences'!$H$4:$I$47,2)","v":"VANBELLINGEN Jean-Claude"},"Aller-Retour",null,null,null,null,null,null,null,null,null,null,null,null,null,null,null,null,null,null,null,null,null,null,null,null,null,null,null,null,null,null,null,null,null,null,null,null,null,null,null,null,null,2203,null,null,null,null,null,null,null,null,null,null,null,null,null,null,null,null,null,null,null,null,null,null,null,null,null,null,null,null,null,null,null,null,{"$f":"SUM(D111:BY111)","v":2203},"Km  renseignés",{"$f":"SUM(BZ111+BZ112)","v":2203},null,null,null,null,null,null,null,null,null,null,null,null,null,null,null,null,null,{"$f":"SUM(CC111:CS111)","v":0},"Km  renseignés",{"$f":"SUM(CT111+CT112)","v":0},"Km  renseignés",{"$f":"SUM(CB111+CV111)","v":2203}]
[null,null,"Ronde",null,null,null,null,null,null,null,null,null,null,null,null,null,null,null,null,null,null,null,null,null,null,null,null,null,null,null,null,null,null,null,null,null,null,null,null,null,null,null,null,null,0,null,null,null,null,null,null,null,null,null,null,null,null,null,null,null,null,null,null,null,null,null,null,null,null,null,null,null,null,null,null,null,null,{"$f":"SUM(D112:BY112)","v":0},"Km confirmés",{"$f":"SUM(D114:BY114)","v":2203},null,null,null,null,null,null,null,null,null,null,null,null,null,null,null,null,null,{"$f":"SUM(CC112:CS112)","v":0},"Km confirmés",{"$f":"SUM(CC114:CS114)","v":0},"Km confirmés",{"$f":"SUM(CV112+CB112)","v":2203}]
[null,null,null,0,0,0,0,0,0,0,0,0,0,0,0,0,0,0,0,0,0,0,0,0,0,0,0,0,0,0,0,0,0,0,0,0,0,0,0,0,0,0,0,0,1,0,0,0,0,0,0,0,0,0,0,0,0,0,0,0,0,0,0,0,0,0,0,0,0,0,0,0,0,0,0,0,0,null,"Rondes confirmées",{"$f":"SUM(C113:BY113)","v":1},0,0,0,0,0,0,0,0,0,0,0,0,0,0,0,0,0,null,"Rondes confirmées",{"$f":"SUM(CC113:CT113)","v":0},"Rondes confirmées",{"$f":"SUM(CV113+CB113)","v":1}]
[null,null,null,{"$f":"SUM((D111+D112)*D113)","v":0},0,0,0,0,0,0,0,0,0,0,0,0,0,0,0,0,0,0,0,0,0,0,0,0,0,0,0,0,0,0,0,0,0,0,0,0,0,0,0,0,2203,0,0,0,0,0,0,0,0,0,0,0,0,0,0,0,0,0,0,0,0,{"$f":"SUM((BN111+BN112)*BN113)","v":0},0,0,0,0,0,0,0,0,0,0,0,null,"Rondes effectuées",{"$f":"COUNTIF(D111:BY111,\">0\")","v":1},{"$f":"SUM((CC111+CC112)*CC113)","v":0},{"$f":"SUM((CD111+CD112)*CD113)","v":0},0,0,0,0,0,0,0,0,0,0,0,0,0,0,0,null,"Rondes Effectuées",{"$f":"COUNTIF(CC111:CS111,\">0\")","v":0},"Rondes effectuées",{"$f":"SUM(CV114+CB114)","v":1}]
[28,{"$f":"VLOOKUP(A115,'Numéro licences'!$H$4:$I$47,2)","v":"VAN DER BEETEN Pascal"},"Aller-Retour",null,null,null,null,null,null,null,null,null,null,null,null,null,null,null,null,null,null,null,null,null,null,null,null,null,null,null,null,null,null,null,null,null,null,null,null,null,null,null,null,null,null,null,null,null,null,null,null,null,null,null,null,null,null,null,null,null,null,null,null,null,null,null,null,null,null,null,null,null,null,null,null,null,null,{"$f":"SUM(D115:BY115)","v":0},"Km  renseignés",{"$f":"SUM(BZ115+BZ116)","v":0},null,null,null,null,null,null,null,null,null,null,null,null,null,null,null,null,null,{"$f":"SUM(CC115:CS115)","v":0},"Km  renseignés",{"$f":"SUM(CT115+CT116)","v":0},"Km  renseignés",{"$f":"SUM(CB115+CV115)","v":0}]
[null,null,"Ronde",null,null,null,null,null,null,null,null,null,null,null,null,null,null,null,null,null,null,null,null,null,null,null,null,null,null,null,null,null,null,null,null,null,null,null,null,null,null,null,null,null,null,null,null,null,null,null,null,null,null,null,null,null,null,null,null,null,null,null,null,null,null,null,null,null,null,null,null,null,null,null,null,null,null,{"$f":"SUM(D116:BY116)","v":0},"Km confirmés",{"$f":"SUM(D118:BY118)","v":0},null,null,null,null,null,null,null,null,null,null,null,null,null,null,null,null,null,{"$f":"SUM(CC116:CS116)","v":0},"Km confirmés",{"$f":"SUM(CC118:CS118)","v":0},"Km confirmés",{"$f":"SUM(CV116+CB116)","v":0}]
[null,null,null,0,0,0,0,0,0,0,0,0,0,0,0,0,0,0,0,0,0,0,0,0,0,0,0,0,0,0,0,0,0,0,0,0,0,0,0,0,0,0,0,0,0,0,0,0,0,0,0,0,0,0,0,0,0,0,0,0,0,0,0,0,0,0,0,0,0,0,0,0,0,0,0,0,0,null,"Rondes confirmées",{"$f":"SUM(C117:BY117)","v":0},0,0,0,0,0,0,0,0,0,0,0,0,0,0,0,0,0,null,"Rondes confirmées",{"$f":"SUM(CC117:CT117)","v":0},"Rondes confirmées",{"$f":"SUM(CV117+CB117)","v":0}]
[null,null,null,{"$f":"SUM((D115+D116)*D117)","v":0},0,0,0,0,0,0,0,0,0,0,0,0,0,0,0,0,0,0,0,0,0,0,0,0,0,0,0,0,0,0,0,0,0,0,0,0,0,0,0,0,0,0,0,0,0,0,0,0,0,0,0,0,0,0,0,0,0,0,0,0,0,{"$f":"SUM((BN115+BN116)*BN117)","v":0},0,0,0,0,0,0,0,{"$f":"SUM((BV115+BV116)*BV117)","v":0},0,0,0,null,"Rondes effectuées",{"$f":"COUNTIF(D115:BY115,\">0\")","v":0},{"$f":"SUM((CC115+CC116)*CC117)","v":0},{"$f":"SUM((CD115+CD116)*CD117)","v":0},0,0,0,0,0,0,0,0,0,0,0,0,0,0,0,null,"Rondes Effectuées",{"$f":"COUNTIF(CC115:CS115,\">0\")","v":0},"Rondes effectuées",{"$f":"SUM(CV118+CB118)","v":0}]
[29,{"$f":"VLOOKUP(A119,'Numéro licences'!$H$4:$I$47,2)","v":"VANSTEYVOORT André"},"Aller-Retour",null,null,null,null,null,null,null,null,null,null,null,null,null,null,null,null,null,null,1564,null,null,null,null,null,null,null,null,null,null,null,null,null,null,null,null,null,null,null,null,null,null,2224,null,null,null,null,null,null,null,null,null,null,null,null,null,null,null,null,null,null,null,null,null,null,null,null,null,null,null,null,null,null,null,null,{"$f":"SUM(D119:BY119)","v":3788},"Km  renseignés",{"$f":"SUM(BZ119+BZ120)","v":4000},null,null,null,null,null,null,null,null,null,null,null,null,null,null,null,null,null,{"$f":"SUM(CC119:CS119)","v":0},"Km  renseignés",{"$f":"SUM(CT119+CT120)","v":0},"Km  renseignés",{"$f":"SUM(CB119+CV119)","v":4000}]
[null,null,"Ronde",null,null,null,null,null,null,null,null,null,null,null,null,null,null,null,null,null,null,212,null,null,null,null,null,null,null,null,null,null,null,null,null,null,null,null,null,null,null,null,null,null,0,null,null,null,null,null,null,null,null,null,null,null,null,null,null,null,null,null,null,null,null,null,null,null,null,null,null,null,null,null,null,null,null,{"$f":"SUM(D120:BY120)","v":212},"Km confirmés",{"$f":"SUM(D122:BY122)","v":0},null,null,null,null,null,null,null,null,null,null,null,null,null,null,null,null,null,{"$f":"SUM(CC120:CS120)","v":0},"Km confirmés",{"$f":"SUM(CC122:CS122)","v":0},"Km confirmés",{"$f":"SUM(CV120+CB120)","v":0}]
[null,null,null,0,0,0,0,0,0,0,0,0,0,0,0,0,0,0,0,0,0,0,0,0,0,0,0,0,0,0,0,0,0,0,0,0,0,0,0,0,0,0,0,0,0,0,0,0,0,0,0,0,0,0,0,0,0,0,0,0,0,0,0,0,0,0,0,0,0,0,0,0,0,0,0,0,0,null,"Rondes confirmées",{"$f":"SUM(C121:BY121)","v":0},0,0,0,0,0,0,0,0,0,0,0,0,0,0,0,0,0,null,"Rondes confirmées",{"$f":"SUM(CC121:CT121)","v":0},"Rondes confirmées",{"$f":"SUM(CV121+CB121)","v":0}]
[null,null,null,{"$f":"SUM((D119+D120)*D121)","v":0},0,0,0,0,0,0,0,0,0,0,0,0,0,0,0,0,0,0,0,0,0,0,0,0,0,0,0,0,0,0,0,0,0,0,0,0,0,0,0,0,0,0,0,0,0,0,0,0,0,0,0,0,0,0,0,0,0,0,0,0,0,{"$f":"SUM((BN119+BN120)*BN121)","v":0},0,0,0,0,0,0,0,{"$f":"SUM((BV119+BV120)*BV121)","v":0},0,0,0,null,"Rondes effectuées",{"$f":"COUNTIF(D119:BY119,\">0\")","v":2},{"$f":"SUM((CC119+CC120)*CC121)","v":0},{"$f":"SUM((CD119+CD120)*CD121)","v":0},0,0,0,0,0,0,0,0,0,0,0,0,0,0,0,null,"Rondes Effectuées",{"$f":"COUNTIF(CC119:CS119,\">0\")","v":0},"Rondes effectuées",{"$f":"SUM(CV122+CB122)","v":2}]
[30,{"$f":"VLOOKUP(A123,'Numéro licences'!$H$4:$I$47,2)","v":"WOUTERS Olivier"},"Aller-Retour",null,null,null,null,null,null,null,null,null,null,null,null,null,null,null,null,null,null,null,null,null,null,null,null,null,null,null,null,null,null,null,null,null,null,null,null,null,null,null,null,null,null,null,null,null,null,null,null,null,null,null,null,null,null,null,null,null,null,null,null,null,null,null,null,null,null,null,null,null,null,null,null,null,null,{"$f":"SUM(D123:BY123)","v":0},"Km  renseignés",{"$f":"SUM(BZ123+BZ124)","v":0},null,null,null,null,null,null,null,null,null,null,null,null,null,null,null,null,null,{"$f":"SUM(CC123:CS123)","v":0},"Km  renseignés",{"$f":"SUM(CT123+CT124)","v":0},"Km  renseignés",{"$f":"SUM(CB123+CV123)","v":0}]
[null,null,"Ronde",null,null,null,null,null,null,null,null,null,null,null,null,null,null,null,null,null,null,null,null,null,null,null,null,null,null,null,null,null,null,null,null,null,null,null,null,null,null,null,null,null,null,null,null,null,null,null,null,null,null,null,null,null,null,null,null,null,null,null,null,null,null,null,null,null,null,null,null,null,null,null,null,null,null,{"$f":"SUM(D124:BY124)","v":0},"Km confirmés",{"$f":"SUM(D126:BY126)","v":0},null,null,null,null,null,null,null,null,null,null,null,null,null,null,null,null,null,{"$f":"SUM(CC124:CS124)","v":0},"Km confirmés",{"$f":"SUM(CC126:CS126)","v":0},"Km confirmés",{"$f":"SUM(CV124+CB124)","v":0}]
[null,null,null,0,0,0,0,0,0,0,0,0,0,0,0,0,0,0,0,0,0,0,0,0,0,0,0,0,0,0,0,0,0,0,0,0,0,0,0,0,0,0,0,0,0,0,0,0,0,0,0,0,0,0,0,0,0,0,0,0,0,0,0,0,0,0,0,0,0,0,0,0,0,0,0,0,0,null,"Rondes confirmées",{"$f":"SUM(C125:BY125)","v":0},0,0,0,0,0,0,0,0,0,0,0,0,0,0,0,0,0,null,"Rondes confirmées",{"$f":"SUM(CC125:CT125)","v":0},"Rondes confirmées",{"$f":"SUM(CV125+CB125)","v":0}]
[null,null,null,{"$f":"SUM((D123+D124)*D125)","v":0},0,0,0,0,0,0,0,0,0,0,0,0,0,0,0,0,0,0,0,0,0,0,0,0,0,0,0,0,0,0,0,0,0,0,0,0,0,0,0,0,0,0,0,0,0,0,0,0,0,0,0,0,0,0,0,0,0,0,0,0,0,{"$f":"SUM((BN123+BN124)*BN125)","v":0},0,0,0,0,0,0,0,{"$f":"SUM((BV123+BV124)*BV125)","v":0},0,0,0,null,"Rondes effectuées",{"$f":"COUNTIF(D123:BY123,\">0\")","v":0},{"$f":"SUM((CC123+CC124)*CC125)","v":0},{"$f":"SUM((CD123+CD124)*CD125)","v":0},0,0,0,0,0,0,0,0,0,0,0,0,0,0,0,null,"Rondes Effectuées",{"$f":"COUNTIF(CC123:CS123,\">0\")","v":0},"Rondes effectuées",{"$f":"SUM(CV126+CB126)","v":0}]
[31,{"$f":"VLOOKUP(A127,'Numéro licences'!$H$4:$I$47,2)","v":"THIRIFAYS Vincent"},"Aller-Retour",null,null,null,null,null,null,null,null,null,null,null,null,null,null,null,null,null,null,null,null,null,null,null,null,null,null,null,null,null,null,null,null,null,null,null,null,null,null,null,null,null,null,null,null,null,null,null,null,null,null,null,null,null,null,null,null,null,null,null,null,null,null,null,null,null,null,null,null,null,null,null,null,null,null,{"$f":"SUM(D127:BY127)","v":0},"Km  renseignés",{"$f":"SUM(BZ127+BZ128)","v":0},null,null,null,null,null,null,null,null,null,null,null,null,null,null,null,null,null,{"$f":"SUM(CC127:CS127)","v":0},"Km  renseignés",{"$f":"SUM(CT127+CT128)","v":0},"Km  renseignés",{"$f":"SUM(CB127+CV127)","v":0}]
[null,null,"Ronde",null,null,null,null,null,null,null,null,null,null,null,null,null,null,null,null,null,null,null,null,null,null,null,null,null,null,null,null,null,null,null,null,null,null,null,null,null,null,null,null,null,null,null,null,null,null,null,null,null,null,null,null,null,null,null,null,null,null,null,null,null,null,null,null,null,null,null,null,null,null,null,null,null,null,{"$f":"SUM(D128:BY128)","v":0},"Km confirmés",{"$f":"SUM(D130:BY130)","v":0},null,null,null,null,null,null,null,null,null,null,null,null,null,null,null,null,null,{"$f":"SUM(CC128:CS128)","v":0},"Km confirmés",{"$f":"SUM(CC130:CS130)","v":0},"Km confirmés",{"$f":"SUM(CV128+CB128)","v":0}]
[null,null,null,0,0,0,0,0,0,0,0,0,0,0,0,0,0,0,0,0,0,0,0,0,0,0,0,0,0,0,0,0,0,0,0,0,0,0,0,0,0,0,0,0,0,0,0,0,0,0,0,0,0,0,0,0,0,0,0,0,0,0,0,0,0,0,0,0,0,0,0,0,0,0,0,0,0,null,"Rondes confirmées",{"$f":"SUM(C129:BY129)","v":0},0,0,0,0,0,0,0,0,0,0,0,0,0,0,0,0,0,null,"Rondes confirmées",{"$f":"SUM(CC129:CT129)","v":0},"Rondes confirmées",{"$f":"SUM(CV129+CB129)","v":0}]
[null,null,null,{"$f":"SUM((D127+D128)*D129)","v":0},0,0,0,0,0,0,0,0,0,0,0,0,0,0,0,0,0,0,0,0,0,0,0,0,0,0,0,0,0,0,0,0,0,0,0,0,0,0,0,0,0,0,0,0,0,0,0,0,0,0,0,0,0,0,0,0,0,0,0,0,0,{"$f":"SUM((BN127+BN128)*BN129)","v":0},0,0,0,0,0,0,0,{"$f":"SUM((BV127+BV128)*BV129)","v":0},0,0,0,null,"Rondes effectuées",{"$f":"COUNTIF(D127:BY127,\">0\")","v":0},{"$f":"SUM((CC127+CC128)*CC129)","v":0},{"$f":"SUM((CD127+CD128)*CD129)","v":0},0,0,0,0,0,0,0,0,0,0,0,0,0,0,0,null,"Rondes Effectuées",{"$f":"COUNTIF(CC127:CS127,\">0\")","v":0},"Rondes effectuées",{"$f":"SUM(CV130+CB130)","v":0}]
[32,{"$f":"VLOOKUP(A131,'Numéro licences'!$H$4:$I$47,2)","v":"VANDY Rudi"},"Aller-Retour",null,null,null,null,null,null,null,null,null,null,null,null,null,null,null,null,null,null,null,null,null,null,null,null,null,null,null,null,null,null,null,null,null,null,null,null,null,null,null,null,null,null,null,null,null,null,null,null,null,null,null,null,null,null,null,null,null,null,null,null,null,null,null,null,null,null,null,null,null,null,null,null,null,null,{"$f":"SUM(D131:BY131)","v":0},"Km  renseignés",{"$f":"SUM(BZ131+BZ132)","v":0},null,null,null,null,null,null,null,null,null,null,null,null,null,null,null,null,null,{"$f":"SUM(CC131:CS131)","v":0},"Km  renseignés",{"$f":"SUM(CT131+CT132)","v":0},"Km  renseignés",{"$f":"SUM(CB131+CV131)","v":0}]
[null,null,"Ronde",null,null,null,null,null,null,null,null,null,null,null,null,null,null,null,null,null,null,null,null,null,null,null,null,null,null,null,null,null,null,null,null,null,null,null,null,null,null,null,null,null,null,null,null,null,null,null,null,null,null,null,null,null,null,null,null,null,null,null,null,null,null,null,null,null,null,null,null,null,null,null,null,null,null,{"$f":"SUM(D132:BY132)","v":0},"Km confirmés",{"$f":"SUM(D134:BY134)","v":0},null,null,null,null,null,null,null,null,null,null,null,null,null,null,null,null,null,{"$f":"SUM(CC132:CS132)","v":0},"Km confirmés",{"$f":"SUM(CC134:CS134)","v":0},"Km confirmés",{"$f":"SUM(CV132+CB132)","v":0}]
[null,null,null,0,0,0,0,0,0,0,0,0,0,0,0,0,0,0,0,0,0,0,0,0,0,0,0,0,0,0,0,0,0,0,0,0,0,0,0,0,0,0,0,0,0,0,0,0,0,0,0,0,0,0,0,0,0,0,0,0,0,0,0,0,0,0,0,0,0,0,0,0,0,0,0,0,0,null,"Rondes confirmées",{"$f":"SUM(C133:BY133)","v":0},0,0,0,0,0,0,0,0,0,0,0,0,0,0,0,0,0,null,"Rondes confirmées",{"$f":"SUM(CC133:CT133)","v":0},"Rondes confirmées",{"$f":"SUM(CV133+CB133)","v":0}]
[null,null,null,{"$f":"SUM((D131+D132)*D133)","v":0},0,0,0,0,0,0,0,0,0,0,0,0,0,0,0,0,0,0,0,0,0,0,0,0,0,0,0,0,0,0,0,0,0,0,0,0,0,0,0,0,0,0,0,0,0,0,0,0,0,0,0,0,0,0,0,0,0,0,0,0,0,{"$f":"SUM((BN131+BN132)*BN133)","v":0},0,0,0,0,0,0,0,{"$f":"SUM((BV131+BV132)*BV133)","v":0},0,0,0,null,"Rondes effectuées",{"$f":"COUNTIF(D131:BY131,\">0\")","v":0},{"$f":"SUM((CC131+CC132)*CC133)","v":0},{"$f":"SUM((CD131+CD132)*CD133)","v":0},0,0,0,0,0,0,0,0,0,0,0,0,0,0,0,null,"Rondes Effectuées",{"$f":"COUNTIF(CC131:CS131,\">0\")","v":0},"Rondes effectuées",{"$f":"SUM(CV134+CB134)","v":0}]
[33,{"$f":"VLOOKUP(A135,'Numéro licences'!$H$4:$I$47,2)","v":"LEFRANT Sébastien"},"Aller-Retour",null,null,null,null,null,null,null,null,null,null,null,null,null,null,null,null,null,null,null,null,null,null,null,null,null,null,null,null,null,null,null,null,null,null,null,null,null,null,null,null,null,null,null,null,null,null,null,null,null,null,null,null,null,null,null,null,null,null,null,null,null,null,null,null,null,null,null,null,null,null,null,null,null,null,{"$f":"SUM(D135:BY135)","v":0},"Km  renseignés",{"$f":"SUM(BZ135+BZ136)","v":0},null,null,null,null,null,null,null,null,null,null,null,null,null,null,null,null,null,{"$f":"SUM(CC135:CS135)","v":0},"Km  renseignés",{"$f":"SUM(CT135+CT136)","v":0},"Km  renseignés",{"$f":"SUM(CB135+CV135)","v":0}]
[null,null,"Ronde",null,null,null,null,null,null,null,null,null,null,null,null,null,null,null,null,null,null,null,null,null,null,null,null,null,null,null,null,null,null,null,null,null,null,null,null,null,null,null,null,null,null,null,null,null,null,null,null,null,null,null,null,null,null,null,null,null,null,null,null,null,null,null,null,null,null,null,null,null,null,null,null,null,null,{"$f":"SUM(D136:BY136)","v":0},"Km confirmés",{"$f":"SUM(D138:BY138)","v":0},null,null,null,null,null,null,null,null,null,null,null,null,null,null,null,null,null,{"$f":"SUM(CC136:CS136)","v":0},"Km confirmés",{"$f":"SUM(CC138:CS138)","v":0},"Km confirmés",{"$f":"SUM(CV136+CB136)","v":0}]
[null,null,null,0,0,0,0,0,0,0,0,0,0,0,0,0,0,0,0,0,0,0,0,0,0,0,0,0,0,0,0,0,0,0,0,0,0,0,0,0,0,0,0,0,0,0,0,0,0,0,0,0,0,0,0,0,0,0,0,0,0,0,0,0,0,0,0,0,0,0,0,0,0,0,0,0,0,null,"Rondes confirmées",{"$f":"SUM(C137:BY137)","v":0},0,0,0,0,0,0,0,0,0,0,0,0,0,0,0,0,0,null,"Rondes confirmées",{"$f":"SUM(CC137:CT137)","v":0},"Rondes confirmées",{"$f":"SUM(CV137+CB137)","v":0}]
[null,null,null,{"$f":"SUM((D135+D136)*D137)","v":0},0,0,0,0,0,0,0,0,0,0,0,0,0,0,0,0,0,0,0,0,0,0,0,0,0,0,0,0,0,0,0,0,0,0,0,0,0,0,0,0,0,0,0,0,0,0,0,0,0,0,0,0,0,0,0,0,0,0,0,0,0,{"$f":"SUM((BN135+BN136)*BN137)","v":0},0,0,0,0,0,0,0,{"$f":"SUM((BV135+BV136)*BV137)","v":0},0,0,0,null,"Rondes effectuées",{"$f":"COUNTIF(D135:BY135,\">0\")","v":0},{"$f":"SUM((CC135+CC136)*CC137)","v":0},{"$f":"SUM((CD135+CD136)*CD137)","v":0},0,0,0,0,0,0,0,0,0,0,0,0,0,0,0,null,"Rondes Effectuées",{"$f":"COUNTIF(CC135:CS135,\">0\")","v":0},"Rondes effectuées",{"$f":"SUM(CV138+CB138)","v":0}]
[34,{"$f":"VLOOKUP(A139,'Numéro licences'!$H$4:$I$47,2)","v":0},"Aller-Retour",null,null,null,null,null,null,null,null,null,null,null,null,null,null,null,null,null,null,null,null,null,null,null,null,null,null,null,null,null,null,null,null,null,null,null,null,null,null,null,null,null,null,null,null,null,null,null,null,null,null,null,null,null,null,null,null,null,null,null,null,null,null,null,null,null,null,null,null,null,null,null,null,null,null,{"$f":"SUM(D139:BY139)","v":0},"Km  renseignés",{"$f":"SUM(BZ139+BZ140)","v":0},null,null,null,null,null,null,null,null,null,null,null,null,null,null,null,null,null,{"$f":"SUM(CC139:CS139)","v":0},"Km  renseignés",{"$f":"SUM(CT139+CT140)","v":0},"Km  renseignés",{"$f":"SUM(CB139+CV139)","v":0}]
[null,null,"Ronde",null,null,null,null,null,null,null,null,null,null,null,null,null,null,null,null,null,null,null,null,null,null,null,null,null,null,null,null,null,null,null,null,null,null,null,null,null,null,null,null,null,null,null,null,null,null,null,null,null,null,null,null,null,null,null,null,null,null,null,null,null,null,null,null,null,null,null,null,null,null,null,null,null,null,{"$f":"SUM(D140:BY140)","v":0},"Km confirmés",{"$f":"SUM(D142:BY142)","v":0},null,null,null,null,null,null,null,null,null,null,null,null,null,null,null,null,null,{"$f":"SUM(CC140:CS140)","v":0},"Km confirmés",{"$f":"SUM(CC142:CS142)","v":0},"Km confirmés",{"$f":"SUM(CV140+CB140)","v":0}]
[null,null,null,0,0,0,0,0,0,0,0,0,0,0,0,0,0,0,0,0,0,0,0,0,0,0,0,0,0,0,0,0,0,0,0,0,0,0,0,0,0,0,0,0,0,0,0,0,0,0,0,0,0,0,0,0,0,0,0,0,0,0,0,0,0,0,0,0,0,0,0,0,0,0,0,0,0,null,"Rondes confirmées",{"$f":"SUM(C141:BY141)","v":0},0,0,0,0,0,0,0,0,0,0,0,0,0,0,0,0,0,null,"Rondes confirmées",{"$f":"SUM(CC141:CT141)","v":0},"Rondes confirmées",{"$f":"SUM(CV141+CB141)","v":0}]
[null,null,null,{"$f":"SUM((D139+D140)*D141)","v":0},0,0,0,0,0,0,0,0,0,0,0,0,0,0,0,0,0,0,0,0,0,0,0,0,0,0,0,0,0,0,0,0,0,0,0,0,0,0,0,0,0,0,0,0,0,0,0,0,0,0,0,0,0,0,0,0,0,0,0,0,0,{"$f":"SUM((BN139+BN140)*BN141)","v":0},0,0,0,0,0,0,0,{"$f":"SUM((BV139+BV140)*BV141)","v":0},0,0,0,null,"Rondes effectuées",{"$f":"COUNTIF(D139:BY139,\">0\")","v":0},0,{"$f":"SUM((CD139+CD140)*CD141)","v":0},0,0,0,0,0,0,0,0,0,0,0,0,0,0,0,null,"Rondes Effectuées",{"$f":"COUNTIF(CC139:CS139,\">0\")","v":0},"Rondes effectuées",{"$f":"SUM(CV142+CB142)","v":0}]
[35,{"$f":"VLOOKUP(A143,'Numéro licences'!$H$4:$I$47,2)","v":0},"Aller-Retour",null,null,null,null,null,null,null,null,null,null,null,null,null,null,null,null,null,null,null,null,null,null,null,null,null,null,null,null,null,null,null,null,null,null,null,null,null,null,null,null,null,null,null,null,null,null,null,null,null,null,null,null,null,null,null,null,null,null,null,null,null,null,null,null,null,null,null,null,null,null,null,null,null,null,{"$f":"SUM(D143:BY143)","v":0},"Km  renseignés",{"$f":"SUM(BZ143+BZ144)","v":0},null,null,null,null,null,null,null,null,null,null,null,null,null,null,null,null,null,{"$f":"SUM(CC143:CS143)","v":0},"Km  renseignés",{"$f":"SUM(CT143+CT144)","v":0},"Km  renseignés",{"$f":"SUM(CB143+CV143)","v":0}]
[null,null,"Ronde",null,null,null,null,null,null,null,null,null,null,null,null,null,null,null,null,null,null,null,null,null,null,null,null,null,null,null,null,null,null,null,null,null,null,null,null,null,null,null,null,null,null,null,null,null,null,null,null,null,null,null,null,null,null,null,null,null,null,null,null,null,null,null,null,null,null,null,null,null,null,null,null,null,null,{"$f":"SUM(D144:BY144)","v":0},"Km confirmés",{"$f":"SUM(D146:BY146)","v":0},null,null,null,null,null,null,null,null,null,null,null,null,null,null,null,null,null,{"$f":"SUM(CC144:CS144)","v":0},"Km confirmés",{"$f":"SUM(CC146:CS146)","v":0},"Km confirmés",{"$f":"SUM(CV144+CB144)","v":0}]
[null,null,null,0,0,0,0,0,0,0,0,0,0,0,0,0,0,0,0,0,0,0,0,0,0,0,0,0,0,0,0,0,0,0,0,0,0,0,0,0,0,0,0,0,0,0,0,0,0,0,0,0,0,0,0,0,0,0,0,0,0,0,0,0,0,0,0,0,0,0,0,0,0,0,0,0,0,null,"Rondes confirmées",{"$f":"SUM(C145:BY145)","v":0},0,0,0,0,0,0,0,0,0,0,0,0,0,0,0,0,0,null,"Rondes confirmées",{"$f":"SUM(CC145:CT145)","v":0},"Rondes confirmées",{"$f":"SUM(CV145+CB145)","v":0}]
[null,null,null,{"$f":"SUM((D143+D144)*D145)","v":0},0,0,0,0,0,0,0,0,0,0,0,0,0,0,0,0,0,0,0,0,0,0,0,0,0,0,0,0,0,0,0,0,0,0,0,0,0,0,0,0,0,0,0,0,0,0,0,0,0,0,0,0,0,0,0,0,0,0,0,0,0,{"$f":"SUM((BN143+BN144)*BN145)","v":0},0,0,0,0,0,0,0,{"$f":"SUM((BV143+BV144)*BV145)","v":0},0,0,0,null,"Rondes effectuées",{"$f":"COUNTIF(D143:BY143,\">0\")","v":0},0,{"$f":"SUM((CD143+CD144)*CD145)","v":0},0,0,0,0,0,0,0,0,0,0,0,0,0,0,0,null,"Rondes Effectuées",{"$f":"COUNTIF(CC143:CS143,\">0\")","v":0},"Rondes effectuées",{"$f":"SUM(CV146+CB146)","v":0}]
[36,{"$f":"VLOOKUP(A147,'Numéro licences'!$H$4:$I$47,2)","v":0},"Aller-Retour",null,null,null,null,null,null,null,null,null,null,null,null,null,null,null,null,null,null,null,null,null,null,null,null,null,null,null,null,null,null,null,null,null,null,null,null,null,null,null,null,null,null,null,null,null,null,null,null,null,null,null,null,null,null,null,null,null,null,null,null,null,null,null,null,null,null,null,null,null,null,null,null,null,null,{"$f":"SUM(D147:BY147)","v":0},"Km  renseignés",{"$f":"SUM(BZ147+BZ148)","v":0},null,null,null,null,null,null,null,null,null,null,null,null,null,null,null,null,null,{"$f":"SUM(CC147:CS147)","v":0},"Km  renseignés",{"$f":"SUM(CT147+CT148)","v":0},"Km  renseignés",{"$f":"SUM(CB147+CV147)","v":0}]
[null,null,"Ronde",null,null,null,null,null,null,null,null,null,null,null,null,null,null,null,null,null,null,null,null,null,null,null,null,null,null,null,null,null,null,null,null,null,null,null,null,null,null,null,null,null,null,null,null,null,null,null,null,null,null,null,null,null,null,null,null,null,null,null,null,null,null,null,null,null,null,null,null,null,null,null,null,null,null,{"$f":"SUM(D148:BY148)","v":0},"Km confirmés",{"$f":"SUM(D150:BY150)","v":0},null,null,null,null,null,null,null,null,null,null,null,null,null,null,null,null,null,{"$f":"SUM(CC148:CS148)","v":0},"Km confirmés",{"$f":"SUM(CC150:CS150)","v":0},"Km confirmés",{"$f":"SUM(CV148+CB148)","v":0}]
[null,null,null,0,0,0,0,0,0,0,0,0,0,0,0,0,0,0,0,0,0,0,0,0,0,0,0,0,0,0,0,0,0,0,0,0,0,0,0,0,0,0,0,0,0,0,0,0,0,0,0,0,0,0,0,0,0,0,0,0,0,0,0,0,0,0,0,0,0,0,0,0,0,0,0,0,0,null,"Rondes confirmées",{"$f":"SUM(C149:BY149)","v":0},0,0,0,0,0,0,0,0,0,0,0,0,0,0,0,0,0,null,"Rondes confirmées",{"$f":"SUM(CC149:CT149)","v":0},"Rondes confirmées",{"$f":"SUM(CV149+CB149)","v":0}]
[null,null,null,{"$f":"SUM((D147+D148)*D149)","v":0},0,0,0,0,0,0,0,0,0,0,0,0,0,0,0,0,0,0,0,0,0,0,0,0,0,0,0,0,0,0,0,0,0,0,0,0,0,0,0,0,0,0,0,0,0,0,0,0,0,0,0,0,0,0,0,0,0,0,0,0,0,{"$f":"SUM((BN147+BN148)*BN149)","v":0},0,0,0,0,0,0,0,{"$f":"SUM((BV147+BV148)*BV149)","v":0},0,0,0,null,"Rondes effectuées",{"$f":"COUNTIF(D147:BY147,\">0\")","v":0},0,{"$f":"SUM((CD147+CD148)*CD149)","v":0},0,0,0,0,0,0,0,0,0,0,0,0,0,0,0,null,"Rondes Effectuées",{"$f":"COUNTIF(CC147:CS147,\">0\")","v":0},"Rondes effectuées",{"$f":"SUM(CV150+CB150)","v":0}]
[37,{"$f":"VLOOKUP(A151,'Numéro licences'!$H$4:$I$47,2)","v":0},"Aller-Retour",null,null,null,null,null,null,null,null,null,null,null,null,null,null,null,null,null,null,null,null,null,null,null,null,null,null,null,null,null,null,null,null,null,null,null,null,null,null,null,null,null,null,null,null,null,null,null,null,null,null,null,null,null,null,null,null,null,null,null,null,null,null,null,null,null,null,null,null,null,null,null,null,null,null,{"$f":"SUM(D151:BY151)","v":0},"Km  renseignés",{"$f":"SUM(BZ151+BZ152)","v":0},null,null,null,null,null,null,null,null,null,null,null,null,null,null,null,null,null,{"$f":"SUM(CC151:CS151)","v":0},"Km  renseignés",{"$f":"SUM(CT151+CT152)","v":0},"Km  renseignés",{"$f":"SUM(CB151+CV151)","v":0}]
[null,null,"Ronde",null,null,null,null,null,null,null,null,null,null,null,null,null,null,null,null,null,null,null,null,null,null,null,null,null,null,null,null,null,null,null,null,null,null,null,null,null,null,null,null,null,null,null,null,null,null,null,null,null,null,null,null,null,null,null,null,null,null,null,null,null,null,null,null,null,null,null,null,null,null,null,null,null,null,{"$f":"SUM(D152:BY152)","v":0},"Km confirmés",{"$f":"SUM(D154:BY154)","v":0},null,null,null,null,null,null,null,null,null,null,null,null,null,null,null,null,null,{"$f":"SUM(CC152:CS152)","v":0},"Km confirmés",{"$f":"SUM(CC154:CS154)","v":0},"Km confirmés",{"$f":"SUM(CV152+CB152)","v":0}]
[null,null,null,0,0,0,0,0,0,0,0,0,0,0,0,0,0,0,0,0,0,0,0,0,0,0,0,0,0,0,0,0,0,0,0,0,0,0,0,0,0,0,0,0,0,0,0,0,0,0,0,0,0,0,0,0,0,0,0,0,0,0,0,0,0,0,0,0,0,0,0,0,0,0,0,0,0,null,"Rondes confirmées",{"$f":"SUM(C153:BY153)","v":0},0,0,0,0,0,0,0,0,0,0,0,0,0,0,0,0,0,null,"Rondes confirmées",{"$f":"SUM(CC153:CT153)","v":0},"Rondes confirmées",{"$f":"SUM(CV153+CB153)","v":0}]
[null,null,null,{"$f":"SUM((D151+D152)*D153)","v":0},0,0,0,0,0,0,0,0,0,0,0,0,0,0,0,0,0,0,0,0,0,0,0,0,0,0,0,0,0,0,0,0,0,0,0,0,0,0,0,0,0,0,0,0,0,0,0,0,0,0,0,0,0,0,0,0,0,0,0,0,0,{"$f":"SUM((BN151+BN152)*BN153)","v":0},0,0,0,0,0,0,0,{"$f":"SUM((BV151+BV152)*BV153)","v":0},0,0,0,null,"Rondes effectuées",{"$f":"COUNTIF(D151:BY151,\">0\")","v":0},0,{"$f":"SUM((CD151+CD152)*CD153)","v":0},0,0,0,0,0,0,0,0,0,0,0,0,0,0,0,null,"Rondes Effectuées",{"$f":"COUNTIF(CC151:CS151,\">0\")","v":0},"Rondes effectuées",{"$f":"SUM(CV154+CB154)","v":0}]
[38,{"$f":"VLOOKUP(A155,'Numéro licences'!$H$4:$I$47,2)","v":0},"Aller-Retour",null,null,null,null,null,null,null,null,null,null,null,null,null,null,null,null,null,null,null,null,null,null,null,null,null,null,null,null,null,null,null,null,null,null,null,null,null,null,null,null,null,null,null,null,null,null,null,null,null,null,null,null,null,null,null,null,null,null,null,null,null,null,null,null,null,null,null,null,null,null,null,null,null,null,{"$f":"SUM(D155:BY155)","v":0},"Km  renseignés",{"$f":"SUM(BZ155+BZ156)","v":0},null,null,null,null,null,null,null,null,null,null,null,null,null,null,null,null,null,{"$f":"SUM(CC155:CS155)","v":0},"Km  renseignés",{"$f":"SUM(CT155+CT156)","v":0},"Km  renseignés",{"$f":"SUM(CB155+CV155)","v":0}]
[null,null,"Ronde",null,null,null,null,null,null,null,null,null,null,null,null,null,null,null,null,null,null,null,null,null,null,null,null,null,null,null,null,null,null,null,null,null,null,null,null,null,null,null,null,null,null,null,null,null,null,null,null,null,null,null,null,null,null,null,null,null,null,null,null,null,null,null,null,null,null,null,null,null,null,null,null,null,null,{"$f":"SUM(D156:BY156)","v":0},"Km confirmés",{"$f":"SUM(D158:BY158)","v":0},null,null,null,null,null,null,null,null,null,null,null,null,null,null,null,null,null,{"$f":"SUM(CC156:CS156)","v":0},"Km confirmés",{"$f":"SUM(CC158:CS158)","v":0},"Km confirmés",{"$f":"SUM(CV156+CB156)","v":0}]
[null,null,null,0,0,0,0,0,0,0,0,0,0,0,0,0,0,0,0,0,0,0,0,0,0,0,0,0,0,0,0,0,0,0,0,0,0,0,0,0,0,0,0,0,0,0,0,0,0,0,0,0,0,0,0,0,0,0,0,0,0,0,0,0,0,0,0,0,0,0,0,0,0,0,0,0,0,null,"Rondes confirmées",{"$f":"SUM(C157:BY157)","v":0},0,0,0,0,0,0,0,0,0,0,0,0,0,0,0,0,0,null,"Rondes confirmées",{"$f":"SUM(CC157:CT157)","v":0},"Rondes confirmées",{"$f":"SUM(CV157+CB157)","v":0}]
[null,null,null,{"$f":"SUM((D155+D156)*D157)","v":0},0,0,0,0,0,0,0,0,0,0,0,0,0,0,0,0,0,0,0,0,0,0,0,0,0,0,0,0,0,0,0,0,0,0,0,0,0,0,0,0,0,0,0,0,0,0,0,0,0,0,0,0,0,0,0,0,0,0,0,0,0,{"$f":"SUM((BN155+BN156)*BN157)","v":0},0,0,0,0,0,0,0,{"$f":"SUM((BV155+BV156)*BV157)","v":0},0,0,0,null,"Rondes effectuées",{"$f":"COUNTIF(D155:BY155,\">0\")","v":0},0,{"$f":"SUM((CD155+CD156)*CD157)","v":0},0,0,0,0,0,0,0,0,0,0,0,0,0,0,0,null,"Rondes Effectuées",{"$f":"COUNTIF(CC155:CS155,\">0\")","v":0},"Rondes effectuées",{"$f":"SUM(CV158+CB158)","v":0}]
[39,{"$f":"VLOOKUP(A159,'Numéro licences'!$H$4:$I$47,2)","v":0},"Aller-Retour",null,null,null,null,null,null,null,null,null,null,null,null,null,null,null,null,null,null,null,null,null,null,null,null,null,null,null,null,null,null,null,null,null,null,null,null,null,null,null,null,null,null,null,null,null,null,null,null,null,null,null,null,null,null,null,null,null,null,null,null,null,null,null,null,null,null,null,null,null,null,null,null,null,null,{"$f":"SUM(D159:BY159)","v":0},"Km  renseignés",{"$f":"SUM(BZ159+BZ160)","v":0},null,null,null,null,null,null,null,null,null,null,null,null,null,null,null,null,null,{"$f":"SUM(CC159:CS159)","v":0},"Km  renseignés",{"$f":"SUM(CT159+CT160)","v":0},"Km  renseignés",{"$f":"SUM(CB159+CV159)","v":0}]
[null,null,"Ronde",null,null,null,null,null,null,null,null,null,null,null,null,null,null,null,null,null,null,null,null,null,null,null,null,null,null,null,null,null,null,null,null,null,null,null,null,null,null,null,null,null,null,null,null,null,null,null,null,null,null,null,null,null,null,null,null,null,null,null,null,null,null,null,null,null,null,null,null,null,null,null,null,null,null,{"$f":"SUM(D160:BY160)","v":0},"Km confirmés",{"$f":"SUM(D162:BY162)","v":0},null,null,null,null,null,null,null,null,null,null,null,null,null,null,null,null,null,{"$f":"SUM(CC160:CS160)","v":0},"Km confirmés",{"$f":"SUM(CC162:CS162)","v":0},"Km confirmés",{"$f":"SUM(CV160+CB160)","v":0}]
[null,null,null,0,0,0,0,0,0,0,0,0,0,0,0,0,0,0,0,0,0,0,0,0,0,0,0,0,0,0,0,0,0,0,0,0,0,0,0,0,0,0,0,0,0,0,0,0,0,0,0,0,0,0,0,0,0,0,0,0,0,0,0,0,0,0,0,0,0,0,0,0,0,0,0,0,0,null,"Rondes confirmées",{"$f":"SUM(C161:BY161)","v":0},0,0,0,0,0,0,0,0,0,0,0,0,0,0,0,0,0,null,"Rondes confirmées",{"$f":"SUM(CC161:CT161)","v":0},"Rondes confirmées",{"$f":"SUM(CV161+CB161)","v":0}]
[null,null,null,{"$f":"SUM((D159+D160)*D161)","v":0},0,0,0,0,0,0,0,0,0,0,0,0,0,0,0,0,0,0,0,0,0,0,0,0,0,0,0,0,0,0,0,0,0,0,0,0,0,0,0,0,0,0,0,0,0,0,0,0,0,0,0,0,0,0,0,0,0,0,0,0,0,{"$f":"SUM((BN159+BN160)*BN161)","v":0},0,0,0,0,0,0,0,{"$f":"SUM((BV159+BV160)*BV161)","v":0},0,0,0,null,"Rondes effectuées",{"$f":"COUNTIF(D159:BY159,\">0\")","v":0},0,{"$f":"SUM((CD159+CD160)*CD161)","v":0},0,0,0,0,0,0,0,0,0,0,0,0,0,0,0,null,"Rondes Effectuées",{"$f":"COUNTIF(CC159:CS159,\">0\")","v":0},"Rondes effectuées",{"$f":"SUM(CV162+CB162)","v":0}]
[40,{"$f":"VLOOKUP(A163,'Numéro licences'!$H$4:$I$47,2)","v":0},"Aller-Retour",null,null,null,null,null,null,null,null,null,null,null,null,null,null,null,null,null,null,null,null,null,null,null,null,null,null,null,null,null,null,null,null,null,null,null,null,null,null,null,null,null,null,null,null,null,null,null,null,null,null,null,null,null,null,null,null,null,null,null,null,null,null,null,null,null,null,null,null,null,null,null,null,null,null,{"$f":"SUM(D163:BY163)","v":0},"Km  renseignés",{"$f":"SUM(BZ163+BZ164)","v":0},null,null,null,null,null,null,null,null,null,null,null,null,null,null,null,null,null,{"$f":"SUM(CC163:CS163)","v":0},"Km  renseignés",{"$f":"SUM(CT163+CT164)","v":0},"Km  renseignés",{"$f":"SUM(CB163+CV163)","v":0}]
[null,null,"Ronde",null,null,null,null,null,null,null,null,null,null,null,null,null,null,null,null,null,null,null,null,null,null,null,null,null,null,null,null,null,null,null,null,null,null,null,null,null,null,null,null,null,null,null,null,null,null,null,null,null,null,null,null,null,null,null,null,null,null,null,null,null,null,null,null,null,null,null,null,null,null,null,null,null,null,{"$f":"SUM(D164:BY164)","v":0},"Km confirmés",{"$f":"SUM(D166:BY166)","v":0},null,null,null,null,null,null,null,null,null,null,null,null,null,null,null,null,null,{"$f":"SUM(CC164:CS164)","v":0},"Km confirmés",{"$f":"SUM(CC166:CS166)","v":0},"Km confirmés",{"$f":"SUM(CV164+CB164)","v":0}]
[null,null,null,0,0,0,0,0,0,0,0,0,0,0,0,0,0,0,0,0,0,0,0,0,0,0,0,0,0,0,0,0,0,0,0,0,0,0,0,0,0,0,0,0,0,0,0,0,0,0,0,0,0,0,0,0,0,0,0,0,0,0,0,0,0,0,0,0,0,0,0,0,0,0,0,0,0,null,"Rondes confirmées",{"$f":"SUM(C165:BY165)","v":0},0,0,0,0,0,0,0,0,0,0,0,0,0,0,0,0,0,null,"Rondes confirmées",{"$f":"SUM(CC165:CT165)","v":0},"Rondes confirmées",{"$f":"SUM(CV165+CB165)","v":0}]
[null,null,null,{"$f":"SUM((D163+D164)*D165)","v":0},0,0,0,0,0,0,0,0,0,0,0,0,0,0,0,0,0,0,0,0,0,0,0,0,0,0,0,0,0,0,0,0,0,0,0,0,0,0,0,0,0,0,0,0,0,0,0,0,0,0,0,0,0,0,0,0,0,0,0,0,0,{"$f":"SUM((BN163+BN164)*BN165)","v":0},0,0,0,0,0,0,0,{"$f":"SUM((BV163+BV164)*BV165)","v":0},0,0,0,null,"Rondes effectuées",{"$f":"COUNTIF(D163:BY163,\">0\")","v":0},0,{"$f":"SUM((CD163+CD164)*CD165)","v":0},0,0,0,0,0,0,0,0,0,0,0,0,0,0,0,null,"Rondes Effectuées",{"$f":"COUNTIF(CC163:CS163,\">0\")","v":0},"Rondes effectuées",{"$f":"SUM(CV166+CB166)","v":0}]
[41,{"$f":"VLOOKUP(A167,'Numéro licences'!$H$4:$I$47,2)","v":0},"Aller-Retour",null,null,null,null,null,null,null,null,null,null,null,null,null,null,null,null,null,null,null,null,null,null,null,null,null,null,null,null,null,null,null,null,null,null,null,null,null,null,null,null,null,null,null,null,null,null,null,null,null,null,null,null,null,null,null,null,null,null,null,null,null,null,null,null,null,null,null,null,null,null,null,null,null,null,{"$f":"SUM(D167:BY167)","v":0},"Km  renseignés",{"$f":"SUM(BZ167+BZ168)","v":0},null,null,null,null,null,null,null,null,null,null,null,null,null,null,null,null,null,{"$f":"SUM(CC167:CS167)","v":0},"Km  renseignés",{"$f":"SUM(CT167+CT168)","v":0},"Km  renseignés",{"$f":"SUM(CB167+CV167)","v":0}]
[null,null,"Ronde",null,null,null,null,null,null,null,null,null,null,null,null,null,null,null,null,null,null,null,null,null,null,null,null,null,null,null,null,null,null,null,null,null,null,null,null,null,null,null,null,null,null,null,null,null,null,null,null,null,null,null,null,null,null,null,null,null,null,null,null,null,null,null,null,null,null,null,null,null,null,null,null,null,null,{"$f":"SUM(D168:BY168)","v":0},"Km confirmés",{"$f":"SUM(D170:BY170)","v":0},null,null,null,null,null,null,null,null,null,null,null,null,null,null,null,null,null,{"$f":"SUM(CC168:CS168)","v":0},"Km confirmés",{"$f":"SUM(CC170:CS170)","v":0},"Km confirmés",{"$f":"SUM(CV168+CB168)","v":0}]
[null,null,null,0,0,0,0,0,0,0,0,0,0,0,0,0,0,0,0,0,0,0,0,0,0,0,0,0,0,0,0,0,0,0,0,0,0,0,0,0,0,0,0,0,0,0,0,0,0,0,0,0,0,0,0,0,0,0,0,0,0,0,0,0,0,0,0,0,0,0,0,0,0,0,0,0,0,null,"Rondes confirmées",{"$f":"SUM(C169:BY169)","v":0},0,0,0,0,0,0,0,0,0,0,0,0,0,0,0,0,0,null,"Rondes confirmées",{"$f":"SUM(CC169:CT169)","v":0},"Rondes confirmées",{"$f":"SUM(CV169+CB169)","v":0}]
[null,null,null,{"$f":"SUM((D167+D168)*D169)","v":0},0,0,0,0,0,0,0,0,0,0,0,0,0,0,0,0,0,0,0,0,0,0,0,0,0,0,0,0,0,0,0,0,0,0,0,0,0,0,0,0,0,0,0,0,0,0,0,0,0,0,0,0,0,0,0,0,0,0,0,0,0,{"$f":"SUM((BN167+BN168)*BN169)","v":0},0,0,0,0,0,0,0,{"$f":"SUM((BV167+BV168)*BV169)","v":0},0,0,0,null,"Rondes effectuées",{"$f":"COUNTIF(D167:BY167,\">0\")","v":0},0,{"$f":"SUM((CD167+CD168)*CD169)","v":0},0,0,0,0,0,0,0,0,0,0,0,0,0,0,0,null,"Rondes Effectuées",{"$f":"COUNTIF(CC167:CS167,\">0\")","v":0},"Rondes effectuées",{"$f":"SUM(CV170+CB170)","v":0}]
[42,{"$f":"VLOOKUP(A171,'Numéro licences'!$H$4:$I$47,2)","v":0},"Aller-Retour",null,null,null,null,null,null,null,null,null,null,null,null,null,null,null,null,null,null,null,null,null,null,null,null,null,null,null,null,null,null,null,null,null,null,null,null,null,null,null,null,null,null,null,null,null,null,null,null,null,null,null,null,null,null,null,null,null,null,null,null,null,null,null,null,null,null,null,null,null,null,null,null,null,null,{"$f":"SUM(D171:BY171)","v":0},"Km  renseignés",{"$f":"SUM(BZ171+BZ172)","v":0},null,null,null,null,null,null,null,null,null,null,null,null,null,null,null,null,null,{"$f":"SUM(CC171:CS171)","v":0},"Km  renseignés",{"$f":"SUM(CT171+CT172)","v":0},"Km  renseignés",{"$f":"SUM(CB171+CV171)","v":0}]
[null,null,"Ronde",null,null,null,null,null,null,null,null,null,null,null,null,null,null,null,null,null,null,null,null,null,null,null,null,null,null,null,null,null,null,null,null,null,null,null,null,null,null,null,null,null,null,null,null,null,null,null,null,null,null,null,null,null,null,null,null,null,null,null,null,null,null,null,null,null,null,null,null,null,null,null,null,null,null,{"$f":"SUM(D172:BY172)","v":0},"Km confirmés",{"$f":"SUM(D174:BY174)","v":0},null,null,null,null,null,null,null,null,null,null,null,null,null,null,null,null,null,{"$f":"SUM(CC172:CS172)","v":0},"Km confirmés",{"$f":"SUM(CC174:CS174)","v":0},"Km confirmés",{"$f":"SUM(CV172+CB172)","v":0}]
[null,null,null,0,0,0,0,0,0,0,0,0,0,0,0,0,0,0,0,0,0,0,0,0,0,0,0,0,0,0,0,0,0,0,0,0,0,0,0,0,0,0,0,0,0,0,0,0,0,0,0,0,0,0,0,0,0,0,0,0,0,0,0,0,0,0,0,0,0,0,0,0,0,0,0,0,0,null,"Rondes confirmées",{"$f":"SUM(C173:BY173)","v":0},0,0,0,0,0,0,0,0,0,0,0,0,0,0,0,0,0,null,"Rondes confirmées",{"$f":"SUM(CC173:CT173)","v":0},"Rondes confirmées",{"$f":"SUM(CV173+CB173)","v":0}]
[null,null,null,{"$f":"SUM((D171+D172)*D173)","v":0},0,0,0,0,0,0,0,0,0,0,0,0,0,0,0,0,0,0,0,0,0,0,0,0,0,0,0,0,0,0,0,0,0,0,0,0,0,0,0,0,0,0,0,0,0,0,0,0,0,0,0,0,0,0,0,0,0,0,0,0,0,{"$f":"SUM((BN171+BN172)*BN173)","v":0},0,0,0,0,0,0,0,{"$f":"SUM((BV171+BV172)*BV173)","v":0},0,0,0,null,"Rondes effectuées",{"$f":"COUNTIF(D171:BY171,\">0\")","v":0},0,{"$f":"SUM((CD171+CD172)*CD173)","v":0},0,0,0,0,0,0,0,0,0,0,0,0,0,0,0,null,"Rondes Effectuées",{"$f":"COUNTIF(CC171:CS171,\">0\")","v":0},"Rondes effectuées",{"$f":"SUM(CV174+CB174)","v":0}]
[43,{"$f":"VLOOKUP(A175,'Numéro licences'!$H$4:$I$47,2)","v":0},"Aller-Retour",null,null,null,null,null,null,null,null,null,null,null,null,null,null,null,null,null,null,null,null,null,null,null,null,null,null,null,null,null,null,null,null,null,null,null,null,null,null,null,null,null,null,null,null,null,null,null,null,null,null,null,null,null,null,null,null,null,null,null,null,null,null,null,null,null,null,null,null,null,null,null,null,null,null,{"$f":"SUM(D175:BY175)","v":0},"Km  renseignés",{"$f":"SUM(BZ175+BZ176)","v":0},null,null,null,null,null,null,null,null,null,null,null,null,null,null,null,null,null,{"$f":"SUM(CC175:CS175)","v":0},"Km  renseignés",{"$f":"SUM(CT175+CT176)","v":0},"Km  renseignés",{"$f":"SUM(CB175+CV175)","v":0}]
[null,null,"Ronde",null,null,null,null,null,null,null,null,null,null,null,null,null,null,null,null,null,null,null,null,null,null,null,null,null,null,null,null,null,null,null,null,null,null,null,null,null,null,null,null,null,null,null,null,null,null,null,null,null,null,null,null,null,null,null,null,null,null,null,null,null,null,null,null,null,null,null,null,null,null,null,null,null,null,{"$f":"SUM(D176:BY176)","v":0},"Km confirmés",{"$f":"SUM(D178:BY178)","v":0},null,null,null,null,null,null,null,null,null,null,null,null,null,null,null,null,null,{"$f":"SUM(CC176:CS176)","v":0},"Km confirmés",{"$f":"SUM(CC178:CS178)","v":0},"Km confirmés",{"$f":"SUM(CV176+CB176)","v":0}]
[null,null,null,0,0,0,0,0,0,0,0,0,0,0,0,0,0,0,0,0,0,0,0,0,0,0,0,0,0,0,0,0,0,0,0,0,0,0,0,0,0,0,0,0,0,0,0,0,0,0,0,0,0,0,0,0,0,0,0,0,0,0,0,0,0,0,0,0,0,0,0,0,0,0,0,0,0,null,"Rondes confirmées",{"$f":"SUM(C177:BY177)","v":0},0,0,0,0,0,0,0,0,0,0,0,0,0,0,0,0,0,null,"Rondes confirmées",{"$f":"SUM(CC177:CT177)","v":0},"Rondes confirmées",{"$f":"SUM(CV177+CB177)","v":0}]
[null,null,null,{"$f":"SUM((D175+D176)*D177)","v":0},0,0,0,0,0,0,0,0,0,0,0,0,0,0,0,0,0,0,0,0,0,0,0,0,0,0,0,0,0,0,0,0,0,0,0,0,0,0,0,0,0,0,0,0,0,0,0,0,0,0,0,0,0,0,0,0,0,0,0,0,0,{"$f":"SUM((BN175+BN176)*BN177)","v":0},0,0,0,0,0,0,0,{"$f":"SUM((BV175+BV176)*BV177)","v":0},0,0,0,null,"Rondes effectuées",{"$f":"COUNTIF(D175:BY175,\">0\")","v":0},0,{"$f":"SUM((CD175+CD176)*CD177)","v":0},0,0,0,0,0,0,0,0,0,0,0,0,0,0,0,null,"Rondes Effectuées",{"$f":"COUNTIF(CC175:CS175,\">0\")","v":0},"Rondes effectuées",{"$f":"SUM(CV178+CB178)","v":0}]
[44,{"$f":"VLOOKUP(A179,'Numéro licences'!$H$4:$I$47,2)","v":0},"Aller-Retour",null,null,null,null,null,null,null,null,null,null,null,null,null,null,null,null,null,null,null,null,null,null,null,null,null,null,null,null,null,null,null,null,null,null,null,null,null,null,null,null,null,null,null,null,null,null,null,null,null,null,null,null,null,null,null,null,null,null,null,null,null,null,null,null,null,null,null,null,null,null,null,null,null,null,{"$f":"SUM(D179:BY179)","v":0},"Km  renseignés",{"$f":"SUM(BZ179+BZ180)","v":0},null,null,null,null,null,null,null,null,null,null,null,null,null,null,null,null,null,{"$f":"SUM(CC179:CS179)","v":0},"Km  renseignés",{"$f":"SUM(CT179+CT180)","v":0},"Km  renseignés",{"$f":"SUM(CB179+CV179)","v":0}]
[null,null,"Ronde",null,null,null,null,null,null,null,null,null,null,null,null,null,null,null,null,null,null,null,null,null,null,null,null,null,null,null,null,null,null,null,null,null,null,null,null,null,null,null,null,null,null,null,null,null,null,null,null,null,null,null,null,null,null,null,null,null,null,null,null,null,null,null,null,null,null,null,null,null,null,null,null,null,null,{"$f":"SUM(D180:BY180)","v":0},"Km confirmés",{"$f":"SUM(D182:BY182)","v":0},null,null,null,null,null,null,null,null,null,null,null,null,null,null,null,null,null,{"$f":"SUM(CC180:CS180)","v":0},"Km confirmés",{"$f":"SUM(CC182:CS182)","v":0},"Km confirmés",{"$f":"SUM(CV180+CB180)","v":0}]
[null,null,null,0,0,0,0,0,0,0,0,0,0,0,0,0,0,0,0,0,0,0,0,0,0,0,0,0,0,0,0,0,0,0,0,0,0,0,0,0,0,0,0,0,0,0,0,0,0,0,0,0,0,0,0,0,0,0,0,0,0,0,0,0,0,0,0,0,0,0,0,0,0,0,0,0,0,null,"Rondes confirmées",{"$f":"SUM(C181:BY181)","v":0},0,0,0,0,0,0,0,0,0,0,0,0,0,0,0,0,0,null,"Rondes confirmées",{"$f":"SUM(CC181:CT181)","v":0},"Rondes confirmées",{"$f":"SUM(CV181+CB181)","v":0}]
[null,null,null,{"$f":"SUM((D179+D180)*D181)","v":0},0,0,0,0,0,0,0,0,0,0,0,0,0,0,0,0,0,0,0,0,0,0,0,0,0,0,0,0,0,0,0,0,0,0,0,0,0,0,0,0,0,0,0,0,0,0,0,0,0,0,0,0,0,0,0,0,0,0,0,0,0,{"$f":"SUM((BN179+BN180)*BN181)","v":0},0,0,0,0,0,0,0,{"$f":"SUM((BV179+BV180)*BV181)","v":0},0,0,0,null,"Rondes effectuées",{"$f":"COUNTIF(D179:BY179,\">0\")","v":0},0,{"$f":"SUM((CD179+CD180)*CD181)","v":0},0,0,0,0,0,0,0,0,0,0,0,0,0,0,0,null,"Rondes Effectuées",{"$f":"COUNTIF(CC179:CS179,\">0\")","v":0},"Rondes effectuées",{"$f":"SUM(CV182+CB182)","v":0}]
[45,{"$f":"VLOOKUP(A183,'Numéro licences'!$H$4:$I$47,2)","v":0},"Aller-Retour",null,null,null,null,null,null,null,null,null,null,null,null,null,null,null,null,null,null,null,null,null,null,null,null,null,null,null,null,null,null,null,null,null,null,null,null,null,null,null,null,null,null,null,null,null,null,null,null,null,null,null,null,null,null,null,null,null,null,null,null,null,null,null,null,null,null,null,null,null,null,null,null,null,null,{"$f":"SUM(D183:BY183)","v":0},"Km  renseignés",{"$f":"SUM(BZ183+BZ184)","v":0},null,null,null,null,null,null,null,null,null,null,null,null,null,null,null,null,null,{"$f":"SUM(CC183:CS183)","v":0},"Km  renseignés",{"$f":"SUM(CT183+CT184)","v":0},"Km  renseignés",{"$f":"SUM(CB183+CV183)","v":0}]
[null,null,"Ronde",null,null,null,null,null,null,null,null,null,null,null,null,null,null,null,null,null,null,null,null,null,null,null,null,null,null,null,null,null,null,null,null,null,null,null,null,null,null,null,null,null,null,null,null,null,null,null,null,null,null,null,null,null,null,null,null,null,null,null,null,null,null,null,null,null,null,null,null,null,null,null,null,null,null,{"$f":"SUM(D184:BY184)","v":0},"Km confirmés",{"$f":"SUM(D186:BY186)","v":0},null,null,null,null,null,null,null,null,null,null,null,null,null,null,null,null,null,{"$f":"SUM(CC184:CS184)","v":0},"Km confirmés",{"$f":"SUM(CC186:CS186)","v":0},"Km confirmés",{"$f":"SUM(CV184+CB184)","v":0}]
[null,null,null,0,0,0,0,0,0,0,0,0,0,0,0,0,0,0,0,0,0,0,0,0,0,0,0,0,0,0,0,0,0,0,0,0,0,0,0,0,0,0,0,0,0,0,0,0,0,0,0,0,0,0,0,0,0,0,0,0,0,0,0,0,0,0,0,0,0,0,0,0,0,0,0,0,0,null,"Rondes confirmées",{"$f":"SUM(C185:BY185)","v":0},0,0,0,0,0,0,0,0,0,0,0,0,0,0,0,0,0,null,"Rondes confirmées",{"$f":"SUM(CC185:CT185)","v":0},"Rondes confirmées",{"$f":"SUM(CV185+CB185)","v":0}]
[null,null,null,{"$f":"SUM((D183+D184)*D185)","v":0},0,0,0,0,0,0,0,0,0,0,0,0,0,0,0,0,0,0,0,0,0,0,0,0,0,0,0,0,0,0,0,0,0,0,0,0,0,0,0,0,0,0,0,0,0,0,0,0,0,0,0,0,0,0,0,0,0,0,0,0,0,{"$f":"SUM((BN183+BN184)*BN185)","v":0},0,0,0,0,0,0,0,{"$f":"SUM((BV183+BV184)*BV185)","v":0},0,0,0,null,"Rondes effectuées",{"$f":"COUNTIF(D183:BY183,\">0\")","v":0},0,{"$f":"SUM((CD183+CD184)*CD185)","v":0},0,0,0,0,0,0,0,0,0,0,0,0,0,0,0,null,"Rondes Effectuées",{"$f":"COUNTIF(CC183:CS183,\">0\")","v":0},"Rondes effectuées",{"$f":"SUM(CV186+CB186)","v":0}]
[46,{"$f":"VLOOKUP(A187,'Numéro licences'!$H$4:$I$47,2)","v":0},"Aller-Retour",null,null,null,null,null,null,null,null,null,null,null,null,null,null,null,null,null,null,null,null,null,null,null,null,null,null,null,null,null,null,null,null,null,null,null,null,null,null,null,null,null,null,null,null,null,null,null,null,null,null,null,null,null,null,null,null,null,null,null,null,null,null,null,null,null,null,null,null,null,null,null,null,null,null,{"$f":"SUM(D187:BY187)","v":0},"Km  renseignés",{"$f":"SUM(BZ187+BZ188)","v":0},null,null,null,null,null,null,null,null,null,null,null,null,null,null,null,null,null,{"$f":"SUM(CC187:CS187)","v":0},"Km  renseignés",{"$f":"SUM(CT187+CT188)","v":0},"Km  renseignés",{"$f":"SUM(CB187+CV187)","v":0}]
[null,null,"Ronde",null,null,null,null,null,null,null,null,null,null,null,null,null,null,null,null,null,null,null,null,null,null,null,null,null,null,null,null,null,null,null,null,null,null,null,null,null,null,null,null,null,null,null,null,null,null,null,null,null,null,null,null,null,null,null,null,null,null,null,null,null,null,null,null,null,null,null,null,null,null,null,null,null,null,{"$f":"SUM(D188:BY188)","v":0},"Km confirmés",{"$f":"SUM(D190:BY190)","v":0},null,null,null,null,null,null,null,null,null,null,null,null,null,null,null,null,null,{"$f":"SUM(CC188:CS188)","v":0},"Km confirmés",{"$f":"SUM(CC190:CS190)","v":0},"Km confirmés",{"$f":"SUM(CV188+CB188)","v":0}]
[null,null,null,0,0,0,0,0,0,0,0,0,0,0,0,0,0,0,0,0,0,0,0,0,0,0,0,0,0,0,0,0,0,0,0,0,0,0,0,0,0,0,0,0,0,0,0,0,0,0,0,0,0,0,0,0,0,0,0,0,0,0,0,0,0,0,0,0,0,0,0,0,0,0,0,0,0,null,"Rondes confirmées",{"$f":"SUM(C189:BY189)","v":0},0,0,0,0,0,0,0,0,0,0,0,0,0,0,0,0,0,null,"Rondes confirmées",{"$f":"SUM(CC189:CT189)","v":0},"Rondes confirmées",{"$f":"SUM(CV189+CB189)","v":0}]
[null,null,null,{"$f":"SUM((D187+D188)*D189)","v":0},0,0,0,0,0,0,0,0,0,0,0,0,0,0,0,0,0,0,0,0,0,0,0,0,0,0,0,0,0,0,0,0,0,0,0,0,0,0,0,0,0,0,0,0,0,0,0,0,0,0,0,0,0,0,0,0,0,0,0,0,0,{"$f":"SUM((BN187+BN188)*BN189)","v":0},0,0,0,0,0,0,0,{"$f":"SUM((BV187+BV188)*BV189)","v":0},0,0,0,null,"Rondes effectuées",{"$f":"COUNTIF(D187:BY187,\">0\")","v":0},0,{"$f":"SUM((CD187+CD188)*CD189)","v":0},0,0,0,0,0,0,0,0,0,0,0,0,0,0,0,null,"Rondes Effectuées",{"$f":"COUNTIF(CC187:CS187,\">0\")","v":0},"Rondes effectuées",{"$f":"SUM(CV190+CB190)","v":0}]
[null,null,"Nat.Pirates-Hors/FMB"]
[null,null,"Inconnu ou non-confirmé"]
[]
[null,null,"Concentres",{"$f":"COUNTIF(D7:D190,D4)","v":0},{"$f":"COUNTIF(E7:E190,E4)","v":0},0,0,0,0,0,92,0,92,0,92,0,0,0,92,0,92,0,0,92,0,0,92,0,92,92,92,92,92,92,0,0,2,92,92,0,92,0,0,92,0,92,92,2,92,92,92,0,0,0,92,92,92,92,null,null,null,null,0,0,0,{"$f":"COUNTIF(BN7:BN190,BN4)","v":2},92,92,2,null,null,null,null,{"$f":"COUNTIF(BV7:BV190,BV4)","v":0},0,0,92,{"$f":"SUM(D194:BY194)","v":2676},"Concentres",null,90,92,0,{"$f":"COUNTIF(CF7:CF190,CF4)","v":92},92,92,92,92,92,92,92,92,92,92,92,92,92,{"$f":"SUM(CC194:CS194)","v":1470},"Concentres",null,"Concentres",{"$f":"SUM(CT194+BZ194)","v":4146}]
[null,null,"Rondes",{"$f":"COUNTIF(D8:D191,D5)","v":0},{"$f":"COUNTIF(E8:E191,E5)","v":0},0,0,0,0,0,92,0,0,0,92,0,0,0,92,0,92,2,0,92,0,0,0,0,92,92,92,92,92,92,0,0,91,92,92,0,0,0,0,92,91,92,92,91,92,92,92,0,0,0,92,92,92,92,null,null,null,null,0,0,0,{"$f":"COUNTIF(BN8:BN191,BN5)","v":91},92,92,91,null,null,null,null,{"$f":"COUNTIF(BV8:BV191,BV5)","v":0},0,0,92,{"$f":"SUM(D195:BY195)","v":2849},"Rondes",null,1,92,10,{"$f":"COUNTIF(CF8:CF191,CF5)","v":92},92,92,92,92,92,92,92,92,92,92,92,92,92,{"$f":"SUM(CC195:CS195)","v":1391},"Rondes",null,"Rondes",{"$f":"SUM(CT195+BZ195)","v":4240}]
[]
[]
[]
[]
[null,"Colonne1"]
[1,"BALLION Pierre"]
[{"$f":"SUM(A201+1)","v":2},"BERDOYES Yannick"]
[{"$f":"SUM(A202+1)","v":3},"CLAISSE Jean-Luc"]
[4,"DAVIN Philippe"]
[5,"DE BONDT Philippe"]
[6,"DE SCHEPPERS Jean-Claude"]
[7,"DECELLE Hubert"]
[8,"DONY Marc"]
[9,"FAVRESSSE René"]
[10,"FONTAINE Guy"]
[11,"GADEYNE Claude"]
[12,"GOOSSENS Joël"]
[13,"LAMBOTTE Didier"]
[14,"LEFEVRE Didier"]
[15,"LEROY Michel"]
[16,"LONDOT Philippe"]
[17,"MALLIEN Philippe"]
[18,"MILET Benoit"]
[19,"NIHOUL Dany"]
[20,"PARMENTIER Dominique"]
[21,"POMPIER Philippe"]
[22,"RICHARD Didier"]
[23,"ROUSSEAU Eric"]
[24,"SERGI Gérard"]
[25,"SMETS Rudy"]
[26,"STRYPSTEIN Nicolas"]
[27,"VANBELLINGEN Jean-Claude"]
[28,"VANDERVELDEN Robert"]
[29]
[30]
[31]
[32]
[33]
[34]
[35]
[36]
[37]
[38]
[39]
[40]
[41]
[42]
[43]
[{"$f":"SUM(A243+1)","v":44}]
[45]
[46]

{"sheet":"Passagers Inter","index":7,"n_rows":178,"n_cols":108,"rows_kept":178,"cut":false,"hidden":false,"merged":[[102,1,105,1],[106,1,109,1],[110,1,113,1],[114,1,117,1],[118,1,121,1],[82,1,85,1],[86,1,89,1],[90,1,93,1],[94,1,97,1],[98,1,101,1],[62,1,65,1],[66,1,69,1],[70,1,73,1],[74,1,77,1],[78,1,81,1],[0,81,0,99],[81,105,81,107],[6,1,9,1],[10,1,13,1],[14,1,17,1],[18,1,21,1],[22,1,25,1],[26,1,29,1],[30,1,33,1],[34,1,37,1],[38,1,41,1],[42,1,45,1],[46,1,49,1],[50,1,53,1],[54,1,57,1],[58,1,61,1]]}
[null,null,null,1,{"$f":"SUM(D1+1)","v":2},{"$f":"SUM(E1+1)","v":3},4,5,6,7,8,9,10,11,12,13,14,15,16,17,18,19,20,21,22,23,24,25,26,27,28,29,30,31,32,33,34,35,36,37,38,39,40,41,42,43,44,45,46,47,48,49,50,51,52,53,54,55,{"$f":"SUM(BF1+1)","v":56},57,58,59,60,61,62,{"$f":"SUM(BM1+1)","v":63},{"$f":"SUM(BN1+1)","v":64},{"$f":"SUM(BO1+1)","v":65},{"$f":"SUM(BP1+1)","v":66},{"$f":"SUM(BQ1+1)","v":67},{"$f":"SUM(BR1+1)","v":68},{"$f":"SUM(BS1+1)","v":69},{"$f":"SUM(BT1+1)","v":70},{"$f":"SUM(BU1+1)","v":71},{"$f":"SUM(BV1+1)","v":72},{"$f":"SUM(BW1+1)","v":73},74,null,null,null,null,"Hors FMB"]
[null,null,null,null,null,null,null,null,null,null,null,null,null,"2023-04-29",null,null,null,null,null,null,null,"2023-05-17",null,null,null,null,null,null,null,null,null,null,null,null,null,null,"2023-05-21",null,null,null,null,null,null,null,"2023-07-29",null,null,"2023-08-04",null,null,null,null,null,null,null,null,null,null,null,null,null,null,null,null,null,"2023-09-22",null,null,"2023-09-30",null,null,null,null,null,null,null,null,null,null,null,"2023-09-07"]
[null,null,null,null,null,null,null,null,null,null,null,null,null,"CFT Quincey",null,null,null,null,null,null,null,"MC LOTUS",null,null,null,null,null,null,null,null,null,null,null,null,null,null,"Zaragosa",null,null,null,null,null,null,null,"Del Laghi delle Garfagnana / Gramollazo / IT",null,null,"Beo Bikers / Thun /CH",null,null,null,null,null,null,null,null,null,null,null,null,null,null,null,null,null,"Les Epesses (85)",null,null,"Eu-Mers-Tréport (76)",null,null,null,null,null,null,null,null,null,null,null,"Sorite Club Orbey"]
[null,"Aller-Retour",null,null,null,null,null,null,null,null,null,null,null,null,null,null,null,null,null,null,null,1462,null,null,null,null,null,null,null,null,null,null,null,null,null,null,2760,null,null,null,null,null,null,null,2119,null,null,1386,null,null,null,null,null,null,null,null,null,null,null,null,null,null,null,null,null,1351,null,null,549,null,null,null,null,null,null,null,null,null,null,null,802,null,null,null,null,null,-1,-1,-1,-1,-1,-1,-1,-1,-1,-1,-1]
[null,"Ronde",null,null,null,null,null,null,null,null,null,null,null,null,null,null,null,null,null,null,null,212,null,null,null,null,-1,null,null,-1,null,null,null,null,null,null,0,null,null,null,null,null,null,null,0,null,null,0,null,null,null,null,null,null,null,null,null,null,null,null,null,null,null,null,null,0,null,null,0,null,null,null,null,null,null,null,null,null,null,null,330,null,null,null,null,null,-1,-1,-1,-1,-1,-1,-1,-1,-1,-1,-1]
[null,null,null,null,null,null,null,null,null,null,null,null,null,null,null,null,null,null,null,null,null,"Randonnée de l'amitié\nHolzgau / AU",null,null,null,null,null,null,null,null,null,null,null,null,null,null,null,null,null,null,null,null,null,null,null,null,null,null,null,null,null,null,null,null,null,null,null,null,null,null,null,null,null,null,null,null,null,null,null,null,null,null,null,null,null,null,null,"Sous-Total\nFMB",null,"Total FMB",null,null,null,null,null,null,null,null,null,null,null,null,null,null,null,null,null,"Sous-Totaux\nPirates",null,"Total Pirates",null,"TOTAL",null,null,null,"FMB","Hors FMB","Total"]
[1,{"$f":"VLOOKUP(A7,'Numéro licences'!$A$4:$B$32,2)","v":"BRIATTE Joëlle"},"Aller-Retour",null,null,null,null,null,null,null,null,null,null,null,null,null,null,null,null,null,null,null,null,null,null,null,null,null,null,null,null,null,null,null,null,null,null,null,null,null,null,null,null,null,null,null,null,null,null,null,null,null,null,null,null,null,null,null,null,null,null,null,null,null,null,null,null,null,null,null,null,null,null,null,null,null,null,{"$f":"SUM(D7:BY7)","v":0},"Km  renseignés",{"$f":"SUM(BZ7+BZ8)","v":0},null,null,null,null,null,null,null,null,null,null,null,null,null,null,null,null,null,{"$f":"SUM(CC7:CS7)","v":0},"Km  renseignés",{"$f":"SUM(CT7+CT8)","v":0},"Km  renseignés",{"$f":"SUM(CB7+CV7)","v":0},null,1,{"$f":"VLOOKUP(CZ7,A7:B187,2)","v":"BRIATTE Joëlle"},{"$f":"SUM(CB7)","v":0},{"$f":"SUM(CV7)","v":0},{"$f":"SUM(DB7+DC7)","v":0}]
[null,null,"Ronde",null,null,null,null,null,null,null,null,null,null,null,null,null,null,null,null,null,null,null,null,null,null,null,null,null,null,null,null,null,null,null,null,null,null,null,null,null,null,null,null,null,null,null,null,null,null,null,null,null,null,null,null,null,null,null,null,null,null,null,null,null,null,null,null,null,null,null,null,null,null,null,null,null,null,{"$f":"SUM(D8:BY8)","v":0},"Km confirmés",{"$f":"SUM(D10:BY10)","v":0},null,null,null,null,null,null,null,null,null,null,null,null,null,null,null,null,null,{"$f":"SUM(CC8:CS8)","v":0},"Km confirmés",{"$f":"SUM(CC10:CS10)","v":0},"Km confirmés",{"$f":"SUM(CV8+CB8)","v":0},null,2,{"$f":"VLOOKUP(CZ8,A7:B187,2)","v":"DEFAUX Michèle"},{"$f":"SUM(CB11)","v":0},{"$f":"SUM(CV11)","v":0},{"$f":"SUM(DB8+DC8)","v":0}]
[null,null,null,0,0,0,0,0,0,0,0,0,0,0,0,0,0,0,0,0,0,0,0,0,0,0,0,0,0,0,0,0,0,0,0,0,0,0,0,0,0,0,0,0,0,0,0,0,0,0,0,0,0,0,0,0,0,0,0,0,0,0,0,0,0,0,0,0,0,0,0,0,0,0,0,0,0,null,"Rondes confirmées",{"$f":"SUM(C9:BY9)","v":0},0,0,0,0,0,0,0,0,0,0,0,0,0,0,0,0,0,null,"Rondes confirmées",{"$f":"SUM(CC9:CT9)","v":0},"Rondes confirmées",{"$f":"SUM(CV9+CB9)","v":0},null,3,{"$f":"VLOOKUP(CZ9,A7:B187,2)","v":"DEL FABBRO Laurence"},{"$f":"SUM(CB15)","v":0},{"$f":"SUM(CV15)","v":1342},{"$f":"SUM(DB9+DC9)","v":1342}]
[null,null,null,{"$f":"SUM((D7+D8)*D9)","v":0},{"$f":"SUM((E7+E8)*E9)","v":0},0,0,0,0,0,0,0,0,0,0,0,0,0,0,0,0,0,0,0,0,0,0,0,0,0,0,0,0,0,0,0,0,0,0,0,0,0,0,0,0,0,0,0,0,0,0,0,0,0,0,0,0,0,0,0,{"$f":"SUM((BI7+BI8)*BI9)","v":0},{"$f":"SUM((BJ7+BJ8)*BJ9)","v":0},0,0,0,{"$f":"SUM((BN7+BN8)*BN9)","v":0},0,0,0,0,0,{"$f":"SUM((BT7+BT8)*BT9)","v":0},{"$f":"SUM((BU7+BU8)*BU9)","v":0},{"$f":"SUM((BV7+BV8)*BV9)","v":0},0,0,0,null,"Rondes effectuées",{"$f":"COUNTIF(D7:BY7,\">0\")","v":0},{"$f":"SUM((CC7+CC8)*CC9)","v":0},0,0,0,0,0,0,0,0,0,0,0,0,0,0,0,0,null,"Rondes Effectuées",{"$f":"COUNTIF(CC7:CS7,\">0\")","v":0},"Rondes effectuées",{"$f":"SUM(CV10+CB10)","v":0},null,4,{"$f":"VLOOKUP(CZ10,A7:B187,2)","v":"FIEVET Nathalie"},{"$f":"SUM(CB19)","v":0},{"$f":"SUM(CV19)","v":0},0]
[2,{"$f":"VLOOKUP(A11,'Numéro licences'!$A$4:$B$32,2)","v":"DEFAUX Michèle"},"Aller-Retour",null,null,null,null,null,null,null,null,null,null,null,null,null,null,null,null,null,null,null,null,null,null,null,null,null,null,null,null,null,null,null,null,null,null,null,null,null,null,null,null,null,null,null,null,null,null,null,null,null,null,null,null,null,null,null,null,null,null,null,null,null,null,null,null,null,null,null,null,null,null,null,null,null,null,{"$f":"SUM(D11:BY11)","v":0},"Km  renseignés",{"$f":"SUM(BZ11+BZ12)","v":0},null,null,null,null,null,null,null,null,null,null,null,null,null,null,null,null,null,{"$f":"SUM(CC11:CS11)","v":0},"Km  renseignés",{"$f":"SUM(CT11+CT12)","v":0},"Km  renseignés",{"$f":"SUM(CB11+CV11)","v":0},null,5,{"$f":"VLOOKUP(CZ11,A7:B187,2)","v":"GOFFIN Guillaume"},{"$f":"SUM(CB23)","v":0},{"$f":"SUM(CV23)","v":0},0]
[null,null,"Ronde",null,null,null,null,null,null,null,null,null,null,null,null,null,null,null,null,null,null,null,null,null,null,null,null,null,null,null,null,null,null,null,null,null,null,null,null,null,null,null,null,null,null,null,null,null,null,null,null,null,null,null,null,null,null,null,null,null,null,null,null,null,null,null,null,null,null,null,null,null,null,null,null,null,null,{"$f":"SUM(D12:BY12)","v":0},"Km confirmés",{"$f":"SUM(D14:BY14)","v":0},null,null,null,null,null,null,null,null,null,null,null,null,null,null,null,null,null,{"$f":"SUM(CC12:CS12)","v":0},"Km confirmés",{"$f":"SUM(CC14:CS14)","v":0},"Km confirmés",{"$f":"SUM(CV12+CB12)","v":0},null,6,{"$f":"VLOOKUP(CZ12,A7:B187,2)","v":"GOUGEUL Sophie"},{"$f":"SUM(CB27)","v":11055},{"$f":"SUM(CV27)","v":1248},12303]
[null,null,null,0,0,0,0,0,0,0,0,0,0,0,0,0,0,0,0,0,0,0,0,0,0,0,0,0,0,0,0,0,0,0,0,0,0,0,0,0,0,0,0,0,0,0,0,0,0,0,0,0,0,0,0,0,0,0,0,0,0,0,0,0,0,0,0,0,0,0,0,0,0,0,0,0,0,null,"Rondes confirmées",{"$f":"SUM(C13:BY13)","v":0},0,0,0,0,0,0,0,0,0,0,0,0,0,0,0,0,0,null,"Rondes confirmées",{"$f":"SUM(CC13:CT13)","v":0},"Rondes confirmées",{"$f":"SUM(CV13+CB13)","v":0},null,7,{"$f":"VLOOKUP(CZ13,A7:B187,2)","v":"GREGORICS Kathy"},{"$f":"SUM(CB31)","v":0},{"$f":"SUM(CV31)","v":0},0]
[null,null,null,{"$f":"SUM((D11+D12)*D13)","v":0},0,0,0,0,0,0,0,0,0,0,0,0,0,0,0,0,0,0,0,0,0,0,0,0,0,0,0,0,0,0,0,0,0,0,0,0,0,0,0,0,0,0,0,0,0,0,0,0,0,0,0,0,0,0,0,0,{"$f":"SUM((BI11+BI12)*BI13)","v":0},{"$f":"SUM((BJ11+BJ12)*BJ13)","v":0},0,0,0,{"$f":"SUM((BN11+BN12)*BN13)","v":0},0,0,0,0,0,{"$f":"SUM((BT11+BT12)*BT13)","v":0},{"$f":"SUM((BU11+BU12)*BU13)","v":0},{"$f":"SUM((BV11+BV12)*BV13)","v":0},0,0,0,null,"Rondes effectuées",{"$f":"COUNTIF(D11:BY11,\">0\")","v":0},{"$f":"SUM((CC11+CC12)*CC13)","v":0},0,0,0,0,0,0,0,0,0,0,0,0,0,0,0,0,null,"Rondes Effectuées",{"$f":"COUNTIF(CC11:CS11,\">0\")","v":0},"Rondes effectuées",{"$f":"SUM(CV14+CB14)","v":0},null,8,{"$f":"VLOOKUP(CZ14,A7:B187,2)","v":"LAMBILLON Anne"},{"$f":"SUM(CB35)","v":0},{"$f":"SUM(CV35)","v":0},0]
[3,{"$f":"VLOOKUP(A15,'Numéro licences'!$A$4:$B$32,2)","v":"DEL FABBRO Laurence"},"Aller-Retour",null,null,null,null,null,null,null,null,null,null,null,null,null,null,null,null,null,null,null,null,null,null,null,null,null,null,null,null,null,null,null,null,null,null,null,null,null,null,null,null,null,null,null,null,null,null,null,null,null,null,null,null,null,null,null,null,null,null,null,null,null,null,null,null,null,null,null,null,null,null,null,null,null,null,{"$f":"SUM(D15:BY15)","v":0},"Km  renseignés",{"$f":"SUM(BZ15+BZ16)","v":0},1012,null,null,null,null,null,null,null,null,null,null,null,null,null,null,null,null,{"$f":"SUM(CC15:CS15)","v":1012},"Km  renseignés",{"$f":"SUM(CT15+CT16)","v":1342},"Km  renseignés",{"$f":"SUM(CB15+CV15)","v":1342},null,9,{"$f":"VLOOKUP(CZ15,A7:B187,2)","v":"LAMIROY Anne"},{"$f":"SUM(CB39)","v":0},{"$f":"SUM(CV39)","v":1056},1056]
[null,null,"Ronde",null,null,null,null,null,null,null,null,null,null,null,null,null,null,null,null,null,null,null,null,null,null,null,null,null,null,null,null,null,null,null,null,null,null,null,null,null,null,null,null,null,null,null,null,null,null,null,null,null,null,null,null,null,null,null,null,null,null,null,null,null,null,null,null,null,null,null,null,null,null,null,null,null,null,{"$f":"SUM(D16:BY16)","v":0},"Km confirmés",{"$f":"SUM(D18:BY18)","v":0},330,null,null,null,null,null,null,null,null,null,null,null,null,null,null,null,null,{"$f":"SUM(CC16:CS16)","v":330},"Km confirmés",{"$f":"SUM(CC18:CS18)","v":1342},"Km confirmés",{"$f":"SUM(CV16+CB16)","v":1342},null,10,{"$f":"VLOOKUP(CZ16,A7:B187,2)","v":"LEROY Laure"},{"$f":"SUM(CB43)","v":2203},{"$f":"SUM(CV43)","v":0},2203]
[null,null,null,0,0,0,0,0,0,0,0,0,0,0,0,0,0,0,0,0,0,0,0,0,0,0,0,0,0,0,0,0,0,0,0,0,0,0,0,0,0,0,0,0,0,0,0,0,0,0,0,0,0,0,0,0,0,0,0,0,0,0,0,0,0,0,0,0,0,0,0,0,0,0,0,0,0,null,"Rondes confirmées",{"$f":"SUM(C17:BY17)","v":0},1,0,0,0,0,0,0,0,0,0,0,0,0,0,0,0,0,null,"Rondes confirmées",{"$f":"SUM(CC17:CT17)","v":1},"Rondes confirmées",{"$f":"SUM(CV17+CB17)","v":1},null,11,{"$f":"VLOOKUP(CZ17,A7:B187,2)","v":"MALLIEN Emelyne"},{"$f":"SUM(CB47)","v":0},{"$f":"SUM(CV47)","v":0},0]
[null,null,null,{"$f":"SUM((D15+D16)*D17)","v":0},0,0,0,0,0,0,0,0,0,0,0,0,0,0,0,0,0,0,0,0,0,0,0,0,0,0,0,0,0,0,0,0,0,0,0,0,0,0,0,0,0,0,0,0,0,0,0,0,0,0,0,0,0,0,0,0,{"$f":"SUM((BI15+BI16)*BI17)","v":0},{"$f":"SUM((BJ15+BJ16)*BJ17)","v":0},0,0,0,{"$f":"SUM((BN15+BN16)*BN17)","v":0},0,0,0,0,0,{"$f":"SUM((BT15+BT16)*BT17)","v":0},{"$f":"SUM((BU15+BU16)*BU17)","v":0},{"$f":"SUM((BV15+BV16)*BV17)","v":0},0,0,0,null,"Rondes effectuées",{"$f":"COUNTIF(D15:BY15,\">0\")","v":0},{"$f":"SUM((CC15+CC16)*CC17)","v":1342},0,0,0,0,0,0,0,0,0,0,0,0,0,0,0,0,null,"Rondes Effectuées",{"$f":"COUNTIF(CC15:CS15,\">0\")","v":1},"Rondes effectuées",{"$f":"SUM(CV18+CB18)","v":1},null,12,{"$f":"VLOOKUP(CZ18,A7:B187,2)","v":"PIERARD Anne-Sophie"},{"$f":"SUM(CB51)","v":0},{"$f":"SUM(CV51)","v":0},0]
[4,{"$f":"VLOOKUP(A19,'Numéro licences'!$A$4:$B$32,2)","v":"FIEVET Nathalie"},"Aller-Retour",null,null,null,null,null,null,null,null,null,null,null,null,null,null,null,null,null,null,null,null,null,null,null,null,null,null,null,null,null,null,null,null,null,null,null,null,null,null,null,null,null,null,null,null,null,null,null,null,null,null,null,null,null,null,null,null,null,null,null,null,null,null,null,null,null,null,null,null,null,null,null,null,null,null,{"$f":"SUM(D19:BY19)","v":0},"Km  renseignés",{"$f":"SUM(BZ19+BZ20)","v":0},null,null,null,null,null,null,null,null,null,null,null,null,null,null,null,null,null,{"$f":"SUM(CC19:CS19)","v":0},"Km  renseignés",{"$f":"SUM(CT19+CT20)","v":0},"Km  renseignés",{"$f":"SUM(CB19+CV19)","v":0},null,13,{"$f":"VLOOKUP(CZ19,A7:B187,2)","v":"PONT Patricia"},{"$f":"SUM(CB55)","v":0},{"$f":"SUM(CV55)","v":0},0]
[null,null,"Ronde",null,null,null,null,null,null,null,null,null,null,null,null,null,null,null,null,null,null,null,null,null,null,null,null,null,null,null,null,null,null,null,null,null,null,null,null,null,null,null,null,null,null,null,null,null,null,null,null,null,null,null,null,null,null,null,null,null,null,null,null,null,null,null,null,null,null,null,null,null,null,null,null,null,null,{"$f":"SUM(D20:BY20)","v":0},"Km confirmés",{"$f":"SUM(D22:BY22)","v":0},null,null,null,null,null,null,null,null,null,null,null,null,null,null,null,null,null,{"$f":"SUM(CC20:CS20)","v":0},"Km confirmés",{"$f":"SUM(CC22:CS22)","v":0},"Km confirmés",{"$f":"SUM(CV20+CB20)","v":0},null,14,{"$f":"VLOOKUP(CZ20,A7:B187,2)","v":"MISEUR Carine"},{"$f":"SUM(CB59)","v":0},{"$f":"SUM(CV59)","v":0},0]
[null,null,null,0,0,0,0,0,0,0,0,0,0,0,0,0,0,0,0,0,0,0,0,0,0,0,0,0,0,0,0,0,0,0,0,0,0,0,0,0,0,0,0,0,0,0,0,0,0,0,0,0,0,0,0,0,0,0,0,0,0,0,0,0,0,0,0,0,0,0,0,0,0,0,0,0,0,null,"Rondes confirmées",{"$f":"SUM(C21:BY21)","v":0},0,0,0,0,0,0,0,0,0,0,0,0,0,0,0,0,0,null,"Rondes confirmées",{"$f":"SUM(CC21:CT21)","v":0},"Rondes confirmées",{"$f":"SUM(CV21+CB21)","v":0},null,15,{"$f":"VLOOKUP(CZ21,A7:B187,2)","v":"ARENZANA Jennifer"},{"$f":"SUM(CB63)","v":0},{"$f":"SUM(CV63)","v":0},0]
[null,null,null,{"$f":"SUM((D19+D20)*D21)","v":0},0,0,0,0,0,0,0,0,0,0,0,0,0,0,0,0,0,0,0,0,0,0,0,0,0,0,0,0,0,0,0,0,0,0,0,0,0,0,0,0,0,0,0,0,0,0,0,0,0,0,0,0,0,0,0,0,{"$f":"SUM((BI19+BI20)*BI21)","v":0},{"$f":"SUM((BJ19+BJ20)*BJ21)","v":0},0,0,0,{"$f":"SUM((BN19+BN20)*BN21)","v":0},0,0,0,0,0,{"$f":"SUM((BT19+BT20)*BT21)","v":0},{"$f":"SUM((BU19+BU20)*BU21)","v":0},{"$f":"SUM((BV19+BV20)*BV21)","v":0},0,0,0,null,"Rondes effectuées",{"$f":"COUNTIF(D19:BY19,\">0\")","v":0},{"$f":"SUM((CC19+CC20)*CC21)","v":0},0,0,0,0,0,0,0,0,0,0,0,0,0,0,0,0,null,"Rondes Effectuées",{"$f":"COUNTIF(CC19:CS19,\">0\")","v":0},"Rondes effectuées",{"$f":"SUM(CV22+CB22)","v":0},null,16,{"$f":"VLOOKUP(CZ22,A7:B187,2)","v":0},{"$f":"SUM(CB67)","v":0},{"$f":"SUM(CV67)","v":0},0]
[5,{"$f":"VLOOKUP(A23,'Numéro licences'!$A$4:$B$32,2)","v":"GOFFIN Guillaume"},"Aller-Retour",null,null,null,null,null,null,null,null,null,null,null,null,null,null,null,null,null,null,null,null,null,null,null,null,null,null,null,null,null,null,null,null,null,null,null,null,null,null,null,null,null,null,null,null,null,null,null,null,null,null,null,null,null,null,null,null,null,null,null,null,null,null,null,null,null,null,null,null,null,null,null,null,null,null,{"$f":"SUM(D23:BY23)","v":0},"Km  renseignés",{"$f":"SUM(BZ23+BZ24)","v":0},null,null,null,null,null,null,null,null,null,null,null,null,null,null,null,null,null,{"$f":"SUM(CC23:CS23)","v":0},"Km  renseignés",{"$f":"SUM(CT23+CT24)","v":0},"Km  renseignés",{"$f":"SUM(CB23+CV23)","v":0},null,17,{"$f":"VLOOKUP(CZ23,A7:B187,2)","v":0},{"$f":"SUM(CB71)","v":0},{"$f":"SUM(CV71)","v":0},0]
[null,null,"Ronde",null,null,null,null,null,null,null,null,null,null,null,null,null,null,null,null,null,null,null,null,null,null,null,null,null,null,null,null,null,null,null,null,null,null,null,null,null,null,null,null,null,null,null,null,null,null,null,null,null,null,null,null,null,null,null,null,null,null,null,null,null,null,null,null,null,null,null,null,null,null,null,null,null,null,{"$f":"SUM(D24:BY24)","v":0},"Km confirmés",{"$f":"SUM(D26:BY26)","v":0},null,null,null,null,null,null,null,null,null,null,null,null,null,null,null,null,null,{"$f":"SUM(CC24:CS24)","v":0},"Km confirmés",{"$f":"SUM(CC26:CS26)","v":0},"Km confirmés",{"$f":"SUM(CV24+CB24)","v":0},null,18,{"$f":"VLOOKUP(CZ24,A7:B187,2)","v":0},{"$f":"SUM(CB75)","v":0},{"$f":"SUM(CV75)","v":0},0]
[null,null,null,0,0,0,0,0,0,0,0,0,0,0,0,0,0,0,0,0,0,0,0,0,0,0,0,0,0,0,0,0,0,0,0,0,0,0,0,0,0,0,0,0,0,0,0,0,0,0,0,0,0,0,0,0,0,0,0,0,0,0,0,0,0,0,0,0,0,0,0,0,0,0,0,0,0,null,"Rondes confirmées",{"$f":"SUM(C25:BY25)","v":0},0,0,0,0,0,0,0,0,0,0,0,0,0,0,0,0,0,null,"Rondes confirmées",{"$f":"SUM(CC25:CT25)","v":0},"Rondes confirmées",{"$f":"SUM(CV25+CB25)","v":0},null,19,{"$f":"VLOOKUP(CZ25,A7:B187,2)","v":0},{"$f":"SUM(CB79)","v":0},{"$f":"SUM(CV79)","v":0},0]
[null,null,null,{"$f":"SUM((D23+D24)*D25)","v":0},0,0,0,0,0,0,0,0,0,0,0,0,0,0,0,0,0,0,0,0,0,0,0,0,0,0,0,0,0,0,0,0,0,0,0,0,0,0,0,0,0,0,0,0,0,0,0,0,0,0,0,0,0,0,0,0,{"$f":"SUM((BI23+BI24)*BI25)","v":0},{"$f":"SUM((BJ23+BJ24)*BJ25)","v":0},0,0,0,{"$f":"SUM((BN23+BN24)*BN25)","v":0},0,0,0,0,0,{"$f":"SUM((BT23+BT24)*BT25)","v":0},{"$f":"SUM((BU23+BU24)*BU25)","v":0},{"$f":"SUM((BV23+BV24)*BV25)","v":0},0,0,0,null,"Rondes effectuées",{"$f":"COUNTIF(D23:BY23,\">0\")","v":0},{"$f":"SUM((CC23+CC24)*CC25)","v":0},0,0,0,0,0,0,0,0,0,0,0,0,0,0,0,0,null,"Rondes Effectuées",{"$f":"COUNTIF(CC23:CS23,\">0\")","v":0},"Rondes effectuées",{"$f":"SUM(CV26+CB26)","v":0},null,20,{"$f":"VLOOKUP(CZ26,A7:B187,2)","v":0},{"$f":"SUM(CB83)","v":0},{"$f":"SUM(CV83)","v":0},0]
[6,{"$f":"VLOOKUP(A27,'Numéro licences'!$A$4:$B$32,2)","v":"GOUGEUL Sophie"},"Aller-Retour",null,null,null,null,null,null,null,null,null,null,990,null,null,null,null,null,null,null,1573,null,null,null,null,null,null,null,null,null,null,null,null,null,null,2760,null,null,null,null,null,null,null,2234,null,null,1386,null,null,null,null,null,null,null,null,null,null,null,null,null,null,null,null,null,1351,null,null,549,null,null,null,null,null,null,null,null,{"$f":"SUM(D27:BY27)","v":10843},"Km  renseignés",{"$f":"SUM(BZ27+BZ28)","v":11055},918,null,null,null,null,null,null,null,null,null,null,null,null,null,null,null,null,{"$f":"SUM(CC27:CS27)","v":918},"Km  renseignés",{"$f":"SUM(CT27+CT28)","v":1248},"Km  renseignés",{"$f":"SUM(CB27+CV27)","v":12303},null,21,{"$f":"VLOOKUP(CZ27,A7:B187,2)","v":0},{"$f":"SUM(CB87)","v":0},{"$f":"SUM(CV87)","v":0},0]
[null,null,"Ronde",null,null,null,null,null,null,null,null,null,null,0,null,null,null,null,null,null,null,212,null,null,null,null,null,null,null,null,null,null,null,null,null,null,0,null,null,null,null,null,null,null,0,null,null,0,null,null,null,null,null,null,null,null,null,null,null,null,null,null,null,null,null,0,null,null,0,null,null,null,null,null,null,null,null,{"$f":"SUM(D28:BY28)","v":212},"Km confirmés",{"$f":"SUM(D30:BY30)","v":11055},330,null,null,null,null,null,null,null,null,null,null,null,null,null,null,null,null,{"$f":"SUM(CC28:CS28)","v":330},"Km confirmés",{"$f":"SUM(CC30:CS30)","v":1248},"Km confirmés",{"$f":"SUM(CV28+CB28)","v":12303},null,22,{"$f":"VLOOKUP(CZ28,A7:B187,2)","v":0},{"$f":"SUM(CB91)","v":0},{"$f":"SUM(CV91)","v":0},0]
[null,null,null,0,0,0,0,0,0,0,0,0,0,1,0,0,0,0,0,0,0,1,0,0,0,0,0,0,0,0,0,0,0,0,0,0,1,0,0,0,0,0,0,0,1,0,0,1,0,0,0,0,0,0,0,0,0,0,0,0,0,0,0,0,0,1,0,0,1,0,0,0,0,0,0,0,0,null,"Rondes confirmées",{"$f":"SUM(C29:BY29)","v":7},1,0,0,0,0,0,0,0,0,0,0,0,0,0,0,0,0,null,"Rondes confirmées",{"$f":"SUM(CC29:CT29)","v":1},"Rondes confirmées",{"$f":"SUM(CV29+CB29)","v":8},null,23,{"$f":"VLOOKUP(CZ29,A7:B187,2)","v":0},{"$f":"SUM(CB95)","v":0},{"$f":"SUM(CV95)","v":0},0]
[null,null,null,{"$f":"SUM((D27+D28)*D29)","v":0},0,0,0,0,0,0,0,0,0,990,0,0,0,0,0,0,0,1785,0,0,0,0,0,0,0,0,0,0,0,0,0,0,2760,0,0,0,0,0,0,0,2234,0,0,1386,0,0,0,0,0,0,0,0,0,0,0,0,{"$f":"SUM((BI27+BI28)*BI29)","v":0},{"$f":"SUM((BJ27+BJ28)*BJ29)","v":0},0,0,0,{"$f":"SUM((BN27+BN28)*BN29)","v":1351},0,0,549,0,0,{"$f":"SUM((BT27+BT28)*BT29)","v":0},{"$f":"SUM((BU27+BU28)*BU29)","v":0},{"$f":"SUM((BV27+BV28)*BV29)","v":0},0,0,0,null,"Rondes effectuées",{"$f":"COUNTIF(D27:BY27,\">0\")","v":7},{"$f":"SUM((CC27+CC28)*CC29)","v":1248},0,0,0,0,0,0,0,0,0,0,0,0,0,0,0,0,null,"Rondes Effectuées",{"$f":"COUNTIF(CC27:CS27,\">0\")","v":1},"Rondes effectuées",{"$f":"SUM(CV30+CB30)","v":8},null,24,{"$f":"VLOOKUP(CZ30,A7:B187,2)","v":0},{"$f":"SUM(CB99)","v":0},{"$f":"SUM(CV99)","v":0},0]
[7,{"$f":"VLOOKUP(A31,'Numéro licences'!$A$4:$B$32,2)","v":"GREGORICS Kathy"},"Aller-Retour",null,null,null,null,null,null,null,null,null,null,null,null,null,null,null,null,null,null,null,null,null,null,null,null,null,null,null,null,null,null,null,null,null,null,null,null,null,null,null,null,null,null,null,null,null,null,null,null,null,null,null,null,null,null,null,null,null,null,null,null,null,null,null,null,null,null,null,null,null,null,null,null,null,null,{"$f":"SUM(D31:BY31)","v":0},"Km  renseignés",{"$f":"SUM(BZ31+BZ32)","v":0},null,null,null,null,null,null,null,null,null,null,null,null,null,null,null,null,null,{"$f":"SUM(CC31:CS31)","v":0},"Km  renseignés",{"$f":"SUM(CT31+CT32)","v":0},"Km  renseignés",{"$f":"SUM(CB31+CV31)","v":0},null,25,{"$f":"VLOOKUP(CZ31,A7:B187,2)","v":0},{"$f":"SUM(CB103)","v":0},{"$f":"SUM(CV103)","v":0},0]
[null,null,"Ronde",null,null,null,null,null,null,null,null,null,null,null,null,null,null,null,null,null,null,null,null,null,null,null,null,null,null,null,null,null,null,null,null,null,null,null,null,null,null,null,null,null,null,null,null,null,null,null,null,null,null,null,null,null,null,null,null,null,null,null,null,null,null,null,null,null,null,null,null,null,null,null,null,null,null,{"$f":"SUM(D32:BY32)","v":0},"Km confirmés",{"$f":"SUM(D34:BY34)","v":0},null,null,null,null,null,null,null,null,null,null,null,null,null,null,null,null,null,{"$f":"SUM(CC32:CS32)","v":0},"Km confirmés",{"$f":"SUM(CC34:CS34)","v":0},"Km confirmés",{"$f":"SUM(CV32+CB32)","v":0},null,26,{"$f":"VLOOKUP(CZ32,A7:B187,2)","v":0},{"$f":"SUM(CB107)","v":0},{"$f":"SUM(CV107)","v":0},0]
[null,null,null,0,0,0,0,0,0,0,0,0,0,0,0,0,0,0,0,0,0,0,0,0,0,0,0,0,0,0,0,0,0,0,0,0,0,0,0,0,0,0,0,0,0,0,0,0,0,0,0,0,0,0,0,0,0,0,0,0,0,0,0,0,0,0,0,0,0,0,0,0,0,0,0,0,0,null,"Rondes confirmées",{"$f":"SUM(C33:BY33)","v":0},0,0,0,0,0,0,0,0,0,0,0,0,0,0,0,0,0,null,"Rondes confirmées",{"$f":"SUM(CC33:CT33)","v":0},"Rondes confirmées",{"$f":"SUM(CV33+CB33)","v":0},null,27,{"$f":"VLOOKUP(CZ33,A7:B187,2)","v":0},{"$f":"SUM(CB111)","v":0},{"$f":"SUM(CV111)","v":0},0]
[null,null,null,{"$f":"SUM((D31+D32)*D33)","v":0},0,0,0,0,0,0,0,0,0,0,0,0,0,0,0,0,0,0,0,0,0,0,0,0,0,0,0,0,0,0,0,0,0,0,0,0,0,0,0,0,0,0,0,0,0,0,0,0,0,0,0,0,0,0,0,0,{"$f":"SUM((BI31+BI32)*BI33)","v":0},{"$f":"SUM((BJ31+BJ32)*BJ33)","v":0},0,0,0,{"$f":"SUM((BN31+BN32)*BN33)","v":0},0,0,0,0,0,{"$f":"SUM((BT31+BT32)*BT33)","v":0},{"$f":"SUM((BU31+BU32)*BU33)","v":0},{"$f":"SUM((BV31+BV32)*BV33)","v":0},0,0,0,null,"Rondes effectuées",{"$f":"COUNTIF(D31:BY31,\">0\")","v":0},{"$f":"SUM((CC31+CC32)*CC33)","v":0},0,0,0,0,0,0,0,0,0,0,0,0,0,0,0,0,null,"Rondes Effectuées",{"$f":"COUNTIF(CC31:CS31,\">0\")","v":0},"Rondes effectuées",{"$f":"SUM(CV34+CB34)","v":0},null,28,{"$f":"VLOOKUP(CZ34,A7:B187,2)","v":0},{"$f":"SUM(CB115)","v":0},{"$f":"SUM(CV115)","v":0},0]
[8,{"$f":"VLOOKUP(A35,'Numéro licences'!$A$4:$B$32,2)","v":"LAMBILLON Anne"},"Aller-Retour",null,null,null,null,null,null,null,null,null,null,null,null,null,null,null,null,null,null,null,null,null,null,null,null,null,null,null,null,null,null,null,null,null,null,null,null,null,null,null,null,null,null,null,null,null,null,null,null,null,null,null,null,null,null,null,null,null,null,null,null,null,null,null,null,null,null,null,null,null,null,null,null,null,null,{"$f":"SUM(D35:BY35)","v":0},"Km  renseignés",{"$f":"SUM(BZ35+BZ36)","v":0},null,null,null,null,null,null,null,null,null,null,null,null,null,null,null,null,null,{"$f":"SUM(CC35:CS35)","v":0},"Km  renseignés",{"$f":"SUM(CT35+CT36)","v":0},"Km  renseignés",{"$f":"SUM(CB35+CV35)","v":0},null,29,{"$f":"VLOOKUP(CZ35,A7:B187,2)","v":0},{"$f":"SUM(CB119)","v":0},{"$f":"SUM(CV119)","v":0},0]
[null,null,"Ronde",null,null,null,null,null,null,null,null,null,null,null,null,null,null,null,null,null,null,null,null,null,null,null,null,null,null,null,null,null,null,null,null,null,null,null,null,null,null,null,null,null,null,null,null,null,null,null,null,null,null,null,null,null,null,null,null,null,null,null,null,null,null,null,null,null,null,null,null,null,null,null,null,null,null,{"$f":"SUM(D36:BY36)","v":0},"Km confirmés",{"$f":"SUM(D38:BY38)","v":0},null,null,null,null,null,null,null,null,null,null,null,null,null,null,null,null,null,{"$f":"SUM(CC36:CS36)","v":0},"Km confirmés",{"$f":"SUM(CC38:CS38)","v":0},"Km confirmés",{"$f":"SUM(CV36+CB36)","v":0}]
[null,null,null,0,0,0,0,0,0,0,0,0,0,0,0,0,0,0,0,0,0,0,0,0,0,0,0,0,0,0,0,0,0,0,0,0,0,0,0,0,0,0,0,0,0,0,0,0,0,0,0,0,0,0,0,0,0,0,0,0,0,0,0,0,0,0,0,0,0,0,0,0,0,0,0,0,0,null,"Rondes confirmées",{"$f":"SUM(C37:BY37)","v":0},0,0,0,0,0,0,0,0,0,0,0,0,0,0,0,0,0,null,"Rondes confirmées",{"$f":"SUM(CC37:CT37)","v":0},"Rondes confirmées",{"$f":"SUM(CV37+CB37)","v":0}]
[null,null,null,{"$f":"SUM((D35+D36)*D37)","v":0},0,0,0,0,0,0,0,0,0,0,0,0,0,0,0,0,0,0,0,0,0,0,0,0,0,0,0,0,0,0,0,0,0,0,0,0,0,0,0,0,0,0,0,0,0,0,0,0,0,0,0,0,0,0,0,0,{"$f":"SUM((BI35+BI36)*BI37)","v":0},{"$f":"SUM((BJ35+BJ36)*BJ37)","v":0},0,0,0,{"$f":"SUM((BN35+BN36)*BN37)","v":0},0,0,0,0,0,{"$f":"SUM((BT35+BT36)*BT37)","v":0},{"$f":"SUM((BU35+BU36)*BU37)","v":0},{"$f":"SUM((BV35+BV36)*BV37)","v":0},0,0,0,null,"Rondes effectuées",{"$f":"COUNTIF(D35:BY35,\">0\")","v":0},{"$f":"SUM((CC35+CC36)*CC37)","v":0},0,0,0,0,0,0,0,0,0,0,0,0,0,0,0,0,null,"Rondes Effectuées",{"$f":"COUNTIF(CC35:CS35,\">0\")","v":0},"Rondes effectuées",{"$f":"SUM(CV38+CB38)","v":0}]
[9,{"$f":"VLOOKUP(A39,'Numéro licences'!$A$4:$B$32,2)","v":"LAMIROY Anne"},"Aller-Retour",null,null,null,null,null,null,null,null,null,null,null,null,null,null,null,null,null,null,null,null,null,null,null,null,null,null,null,null,null,null,null,null,null,null,null,null,null,null,null,null,null,null,null,null,null,null,null,null,null,null,null,null,null,null,null,null,null,null,null,null,null,null,null,null,null,null,null,null,null,null,null,null,null,null,{"$f":"SUM(D39:BY39)","v":0},"Km  renseignés",{"$f":"SUM(BZ39+BZ40)","v":0},726,null,null,null,null,null,null,null,null,null,null,null,null,null,null,null,null,{"$f":"SUM(CC39:CS39)","v":726},"Km  renseignés",{"$f":"SUM(CT39+CT40)","v":1056},"Km  renseignés",{"$f":"SUM(CB39+CV39)","v":1056}]
[null,null,"Ronde",null,null,null,null,null,null,null,null,null,null,null,null,null,null,null,null,null,null,null,null,null,null,null,null,null,null,null,null,null,null,null,null,null,null,null,null,null,null,null,null,null,null,null,null,null,null,null,null,null,null,null,null,null,null,null,null,null,null,null,null,null,null,null,null,null,null,null,null,null,null,null,null,null,null,{"$f":"SUM(D40:BY40)","v":0},"Km confirmés",{"$f":"SUM(D42:BY42)","v":0},330,null,null,null,null,null,null,null,null,null,null,null,null,null,null,null,null,{"$f":"SUM(CC40:CS40)","v":330},"Km confirmés",{"$f":"SUM(CC42:CS42)","v":1056},"Km confirmés",{"$f":"SUM(CV40+CB40)","v":1056}]
[null,null,null,0,0,0,0,0,0,0,0,0,0,0,0,0,0,0,0,0,0,0,0,0,0,0,0,0,0,0,0,0,0,0,0,0,0,0,0,0,0,0,0,0,0,0,0,0,0,0,0,0,0,0,0,0,0,0,0,0,0,0,0,0,0,0,0,0,0,0,0,0,0,0,0,0,0,null,"Rondes confirmées",{"$f":"SUM(C41:BY41)","v":0},1,0,0,0,0,0,0,0,0,0,0,0,0,0,0,0,0,null,"Rondes confirmées",{"$f":"SUM(CC41:CT41)","v":1},"Rondes confirmées",{"$f":"SUM(CV41+CB41)","v":1},null,null,null,{"$f":"SUM(DB8:DB35)","v":13258},{"$f":"SUM(DC8:DC35)","v":3646},{"$f":"SUM(DD7:DD35)","v":16904}]
[null,null,null,{"$f":"SUM((D39+D40)*D41)","v":0},0,0,0,0,0,0,0,0,0,0,0,0,0,0,0,0,0,0,0,0,0,0,0,0,0,0,0,0,0,0,0,0,0,0,0,0,0,0,0,0,0,0,0,0,0,0,0,0,0,0,0,0,0,0,0,0,{"$f":"SUM((BI39+BI40)*BI41)","v":0},{"$f":"SUM((BJ39+BJ40)*BJ41)","v":0},0,0,0,{"$f":"SUM((BN39+BN40)*BN41)","v":0},0,0,0,0,0,{"$f":"SUM((BT39+BT40)*BT41)","v":0},{"$f":"SUM((BU39+BU40)*BU41)","v":0},{"$f":"SUM((BV39+BV40)*BV41)","v":0},0,0,0,null,"Rondes effectuées",{"$f":"COUNTIF(D39:BY39,\">0\")","v":0},{"$f":"SUM((CC39+CC40)*CC41)","v":1056},0,0,0,0,0,0,0,0,0,0,0,0,0,0,0,0,null,"Rondes Effectuées",{"$f":"COUNTIF(CC39:CS39,\">0\")","v":1},"Rondes effectuées",{"$f":"SUM(CV42+CB42)","v":1},null,null,null,{"$f":"SUM(DB41/DD41)","v":0.78431140558447709},{"$f":"SUM(DC41/DD41)","v":0.21568859441552296}]
[10,{"$f":"VLOOKUP(A43,'Numéro licences'!$A$4:$B$32,2)","v":"LEROY Laure"},"Aller-Retour",null,null,null,null,null,null,null,null,null,null,null,null,null,null,null,null,null,null,null,null,null,null,null,null,null,null,null,null,null,null,null,null,null,null,null,null,null,null,null,null,null,2203,null,null,null,null,null,null,null,null,null,null,null,null,null,null,null,null,null,null,null,null,null,null,null,null,null,null,null,null,null,null,null,null,{"$f":"SUM(D43:BY43)","v":2203},"Km  renseignés",{"$f":"SUM(BZ43+BZ44)","v":2203},null,null,null,null,null,null,null,null,null,null,null,null,null,null,null,null,null,{"$f":"SUM(CC43:CS43)","v":0},"Km  renseignés",{"$f":"SUM(CT43+CT44)","v":0},"Km  renseignés",{"$f":"SUM(CB43+CV43)","v":2203},null,null,null,"FMB","Hors FMB"]
[null,null,"Ronde",null,null,null,null,null,null,null,null,null,null,null,null,null,null,null,null,null,null,null,null,null,null,null,null,null,null,null,null,null,null,null,null,null,null,null,null,null,null,null,null,null,0,null,null,null,null,null,null,null,null,null,null,null,null,null,null,null,null,null,null,null,null,null,null,null,null,null,null,null,null,null,null,null,null,{"$f":"SUM(D44:BY44)","v":0},"Km confirmés",{"$f":"SUM(D46:BY46)","v":2203},null,null,null,null,null,null,null,null,null,null,null,null,null,null,null,null,null,{"$f":"SUM(CC44:CS44)","v":0},"Km confirmés",{"$f":"SUM(CC46:CS46)","v":0},"Km confirmés",{"$f":"SUM(CV44+CB44)","v":2203}]
[null,null,null,0,0,0,0,0,0,0,0,0,0,0,0,0,0,0,0,0,0,0,0,0,0,0,0,0,0,0,0,0,0,0,0,0,0,0,0,0,0,0,0,0,1,0,0,0,0,0,0,0,0,0,0,0,0,0,0,0,0,0,0,0,0,0,0,0,0,0,0,0,0,0,0,0,0,null,"Rondes confirmées",{"$f":"SUM(C45:BY45)","v":1},0,0,0,0,0,0,0,0,0,0,0,0,0,0,0,0,0,null,"Rondes confirmées",{"$f":"SUM(CC45:CT45)","v":0},"Rondes confirmées",{"$f":"SUM(CV45+CB45)","v":1}]
[null,null,null,{"$f":"SUM((D43+D44)*D45)","v":0},0,0,0,0,0,0,0,0,0,0,0,0,0,0,0,0,0,0,0,0,0,0,0,0,0,0,0,0,0,0,0,0,0,0,0,0,0,0,0,0,2203,0,0,0,0,0,0,0,0,0,0,0,0,0,0,0,{"$f":"SUM((BI43+BI44)*BI45)","v":0},{"$f":"SUM((BJ43+BJ44)*BJ45)","v":0},0,0,0,{"$f":"SUM((BN43+BN44)*BN45)","v":0},0,0,0,0,0,{"$f":"SUM((BT43+BT44)*BT45)","v":0},{"$f":"SUM((BU43+BU44)*BU45)","v":0},{"$f":"SUM((BV43+BV44)*BV45)","v":0},0,0,0,null,"Rondes effectuées",{"$f":"COUNTIF(D43:BY43,\">0\")","v":1},{"$f":"SUM((CC43+CC44)*CC45)","v":0},0,0,0,0,0,0,0,0,0,0,0,0,0,0,0,0,null,"Rondes Effectuées",{"$f":"COUNTIF(CC43:CS43,\">0\")","v":0},"Rondes effectuées",{"$f":"SUM(CV46+CB46)","v":1}]
[11,{"$f":"VLOOKUP(A47,'Numéro licences'!$A$4:$B$32,2)","v":"MALLIEN Emelyne"},"Aller-Retour",null,null,null,null,null,null,null,null,null,null,null,null,null,null,null,null,null,null,null,null,null,null,null,null,null,null,null,null,null,null,null,null,null,null,null,null,null,null,null,null,null,null,null,null,null,null,null,null,null,null,null,null,null,null,null,null,null,null,null,null,null,null,null,null,null,null,null,null,null,null,null,null,null,null,{"$f":"SUM(D47:BY47)","v":0},"Km  renseignés",{"$f":"SUM(BZ47+BZ48)","v":0},null,null,null,null,null,null,null,null,null,null,null,null,null,null,null,null,null,{"$f":"SUM(CC47:CS47)","v":0},"Km  renseignés",{"$f":"SUM(CT47+CT48)","v":0},"Km  renseignés",{"$f":"SUM(CB47+CV47)","v":0}]
[null,null,"Ronde",null,null,null,null,null,null,null,null,null,null,null,null,null,null,null,null,null,null,null,null,null,null,null,null,null,null,null,null,null,null,null,null,null,null,null,null,null,null,null,null,null,null,null,null,null,null,null,null,null,null,null,null,null,null,null,null,null,null,null,null,null,null,null,null,null,null,null,null,null,null,null,null,null,null,{"$f":"SUM(D48:BY48)","v":0},"Km confirmés",{"$f":"SUM(D50:BY50)","v":0},null,null,null,null,null,null,null,null,null,null,null,null,null,null,null,null,null,{"$f":"SUM(CC48:CS48)","v":0},"Km confirmés",{"$f":"SUM(CC50:CS50)","v":0},"Km confirmés",{"$f":"SUM(CV48+CB48)","v":0}]
[null,null,null,0,0,0,0,0,0,0,0,0,0,0,0,0,0,0,0,0,0,0,0,0,0,0,0,0,0,0,0,0,0,0,0,0,0,0,0,0,0,0,0,0,0,0,0,0,0,0,0,0,0,0,0,0,0,0,0,0,0,0,0,0,0,0,0,0,0,0,0,0,0,0,0,0,0,null,"Rondes confirmées",{"$f":"SUM(C49:BY49)","v":0},0,0,0,0,0,0,0,0,0,0,0,0,0,0,0,0,0,null,"Rondes confirmées",{"$f":"SUM(CC49:CT49)","v":0},"Rondes confirmées",{"$f":"SUM(CV49+CB49)","v":0}]
[null,null,null,{"$f":"SUM((D47+D48)*D49)","v":0},0,0,0,0,0,0,0,0,0,0,0,0,0,0,0,0,0,0,0,0,0,0,0,0,0,0,0,0,0,0,0,0,0,0,0,0,0,0,0,0,0,0,0,0,0,0,0,0,0,0,0,0,0,0,0,0,{"$f":"SUM((BI47+BI48)*BI49)","v":0},{"$f":"SUM((BJ47+BJ48)*BJ49)","v":0},0,0,0,{"$f":"SUM((BN47+BN48)*BN49)","v":0},0,0,0,0,0,{"$f":"SUM((BT47+BT48)*BT49)","v":0},{"$f":"SUM((BU47+BU48)*BU49)","v":0},{"$f":"SUM((BV47+BV48)*BV49)","v":0},0,0,0,null,"Rondes effectuées",{"$f":"COUNTIF(D47:BY47,\">0\")","v":0},{"$f":"SUM((CC47+CC48)*CC49)","v":0},0,0,0,0,0,0,0,0,0,0,0,0,0,0,0,0,null,"Rondes Effectuées",{"$f":"COUNTIF(CC47:CS47,\">0\")","v":0},"Rondes effectuées",{"$f":"SUM(CV50+CB50)","v":0}]
[12,{"$f":"VLOOKUP(A51,'Numéro licences'!$A$4:$B$32,2)","v":"PIERARD Anne-Sophie"},"Aller-Retour",null,null,null,null,null,null,null,null,null,null,null,null,null,null,null,null,null,null,null,null,null,null,null,null,null,null,null,null,null,null,null,null,null,null,null,null,null,null,null,null,null,null,null,null,null,null,null,null,null,null,null,null,null,null,null,null,null,null,null,null,null,null,null,null,null,null,null,null,null,null,null,null,null,null,{"$f":"SUM(D51:BY51)","v":0},"Km  renseignés",{"$f":"SUM(BZ51+BZ52)","v":0},null,null,null,null,null,null,null,null,null,null,null,null,null,null,null,null,null,{"$f":"SUM(CC51:CS51)","v":0},"Km  renseignés",{"$f":"SUM(CT51+CT52)","v":0},"Km  renseignés",{"$f":"SUM(CB51+CV51)","v":0}]
[null,null,"Ronde",null,null,null,null,null,null,null,null,null,null,null,null,null,null,null,null,null,null,null,null,null,null,null,null,null,null,null,null,null,null,null,null,null,null,null,null,null,null,null,null,null,null,null,null,null,null,null,null,null,null,null,null,null,null,null,null,null,null,null,null,null,null,null,null,null,null,null,null,null,null,null,null,null,null,{"$f":"SUM(D52:BY52)","v":0},"Km confirmés",{"$f":"SUM(D54:BY54)","v":0},null,null,null,null,null,null,null,null,null,null,null,null,null,null,null,null,null,{"$f":"SUM(CC52:CS52)","v":0},"Km confirmés",{"$f":"SUM(CC54:CS54)","v":0},"Km confirmés",{"$f":"SUM(CV52+CB52)","v":0}]
[null,null,null,0,0,0,0,0,0,0,0,0,0,0,0,0,0,0,0,0,0,0,0,0,0,0,0,0,0,0,0,0,0,0,0,0,0,0,0,0,0,0,0,0,0,0,0,0,0,0,0,0,0,0,0,0,0,0,0,0,0,0,0,0,0,0,0,0,0,0,0,0,0,0,0,0,0,null,"Rondes confirmées",{"$f":"SUM(C53:BY53)","v":0},0,0,0,0,0,0,0,0,0,0,0,0,0,0,0,0,0,null,"Rondes confirmées",{"$f":"SUM(CC53:CT53)","v":0},"Rondes confirmées",{"$f":"SUM(CV53+CB53)","v":0}]
[null,null,null,{"$f":"SUM((D51+D52)*D53)","v":0},0,0,0,0,0,0,0,0,0,0,0,0,0,0,0,0,0,0,0,0,0,0,0,0,0,0,0,0,0,0,0,0,0,0,0,0,0,0,0,0,0,0,0,0,0,0,0,0,0,0,0,0,0,0,0,0,{"$f":"SUM((BI51+BI52)*BI53)","v":0},{"$f":"SUM((BJ51+BJ52)*BJ53)","v":0},0,0,0,{"$f":"SUM((BN51+BN52)*BN53)","v":0},0,0,0,0,0,{"$f":"SUM((BT51+BT52)*BT53)","v":0},{"$f":"SUM((BU51+BU52)*BU53)","v":0},{"$f":"SUM((BV51+BV52)*BV53)","v":0},0,0,0,null,"Rondes effectuées",{"$f":"COUNTIF(D51:BY51,\">0\")","v":0},{"$f":"SUM((CC51+CC52)*CC53)","v":0},0,0,0,0,0,0,0,0,0,0,0,0,0,0,0,0,null,"Rondes Effectuées",{"$f":"COUNTIF(CC51:CS51,\">0\")","v":0},"Rondes effectuées",{"$f":"SUM(CV54+CB54)","v":0}]
[13,{"$f":"VLOOKUP(A55,'Numéro licences'!$A$4:$B$32,2)","v":"PONT Patricia"},"Aller-Retour",null,null,null,null,null,null,null,null,null,null,null,null,null,null,null,null,null,null,null,null,null,null,null,null,null,null,null,null,null,null,null,null,null,null,null,null,null,null,null,null,null,null,null,null,null,null,null,null,null,null,null,null,null,null,null,null,null,null,null,null,null,null,null,null,null,null,null,null,null,null,null,null,null,null,{"$f":"SUM(D55:BY55)","v":0},"Km  renseignés",{"$f":"SUM(BZ55+BZ56)","v":0},null,null,null,null,null,null,null,null,null,null,null,null,null,null,null,null,null,{"$f":"SUM(CC55:CS55)","v":0},"Km  renseignés",{"$f":"SUM(CT55+CT56)","v":0},"Km  renseignés",{"$f":"SUM(CB55+CV55)","v":0}]
[null,null,"Ronde",null,null,null,null,null,null,null,null,null,null,null,null,null,null,null,null,null,null,null,null,null,null,null,null,null,null,null,null,null,null,null,null,null,null,null,null,null,null,null,null,null,null,null,null,null,null,null,null,null,null,null,null,null,null,null,null,null,null,null,null,null,null,null,null,null,null,null,null,null,null,null,null,null,null,{"$f":"SUM(D56:BY56)","v":0},"Km confirmés",{"$f":"SUM(D58:BY58)","v":0},null,null,null,null,null,null,null,null,null,null,null,null,null,null,null,null,null,{"$f":"SUM(CC56:CS56)","v":0},"Km confirmés",{"$f":"SUM(CC58:CS58)","v":0},"Km confirmés",{"$f":"SUM(CV56+CB56)","v":0}]
[null,null,null,0,0,0,0,0,0,0,0,0,0,0,0,0,0,0,0,0,0,0,0,0,0,0,0,0,0,0,0,0,0,0,0,0,0,0,0,0,0,0,0,0,0,0,0,0,0,0,0,0,0,0,0,0,0,0,0,0,0,0,0,0,0,0,0,0,0,0,0,0,0,0,0,0,0,null,"Rondes confirmées",{"$f":"SUM(C57:BY57)","v":0},0,0,0,0,0,0,0,0,0,0,0,0,0,0,0,0,0,null,"Rondes confirmées",{"$f":"SUM(CC57:CT57)","v":0},"Rondes confirmées",{"$f":"SUM(CV57+CB57)","v":0}]
[null,null,null,{"$f":"SUM((D55+D56)*D57)","v":0},0,0,0,0,0,0,0,0,0,0,0,0,0,0,0,0,0,0,0,0,0,0,0,0,0,0,0,0,0,0,0,0,0,0,0,0,0,0,0,0,0,0,0,0,0,0,0,0,0,0,0,0,0,0,0,0,{"$f":"SUM((BI55+BI56)*BI57)","v":0},{"$f":"SUM((BJ55+BJ56)*BJ57)","v":0},0,0,0,{"$f":"SUM((BN55+BN56)*BN57)","v":0},0,0,0,0,0,{"$f":"SUM((BT55+BT56)*BT57)","v":0},{"$f":"SUM((BU55+BU56)*BU57)","v":0},{"$f":"SUM((BV55+BV56)*BV57)","v":0},0,0,0,null,"Rondes effectuées",{"$f":"COUNTIF(D55:BY55,\">0\")","v":0},{"$f":"SUM((CC55+CC56)*CC57)","v":0},0,0,0,0,0,0,0,0,0,0,0,0,0,0,0,0,null,"Rondes Effectuées",{"$f":"COUNTIF(CC55:CS55,\">0\")","v":0},"Rondes effectuées",{"$f":"SUM(CV58+CB58)","v":0}]
[14,{"$f":"VLOOKUP(A59,'Numéro licences'!$A$4:$B$32,2)","v":"MISEUR Carine"},"Aller-Retour",null,null,null,null,null,null,null,null,null,null,null,null,null,null,null,null,null,null,null,null,null,null,null,null,null,null,null,null,null,null,null,null,null,null,null,null,null,null,null,null,null,null,null,null,null,null,null,null,null,null,null,null,null,null,null,null,null,null,null,null,null,null,null,null,null,null,null,null,null,null,null,null,null,null,{"$f":"SUM(D59:BY59)","v":0},"Km  renseignés",{"$f":"SUM(BZ59+BZ60)","v":0},null,null,null,null,null,null,null,null,null,null,null,null,null,null,null,null,null,{"$f":"SUM(CC59:CS59)","v":0},"Km  renseignés",{"$f":"SUM(CT59+CT60)","v":0},"Km  renseignés",{"$f":"SUM(CB59+CV59)","v":0}]
[null,null,"Ronde",null,null,null,null,null,null,null,null,null,null,null,null,null,null,null,null,null,null,null,null,null,null,null,null,null,null,null,null,null,null,null,null,null,null,null,null,null,null,null,null,null,null,null,null,null,null,null,null,null,null,null,null,null,null,null,null,null,null,null,null,null,null,null,null,null,null,null,null,null,null,null,null,null,null,{"$f":"SUM(D60:BY60)","v":0},"Km confirmés",{"$f":"SUM(D62:BY62)","v":0},null,null,null,null,null,null,null,null,null,null,null,null,null,null,null,null,null,{"$f":"SUM(CC60:CS60)","v":0},"Km confirmés",{"$f":"SUM(CC62:CS62)","v":0},"Km confirmés",{"$f":"SUM(CV60+CB60)","v":0}]
[null,null,null,0,0,0,0,0,0,0,0,0,0,0,0,0,0,0,0,0,0,0,0,0,0,0,0,0,0,0,0,0,0,0,0,0,0,0,0,0,0,0,0,0,0,0,0,0,0,0,0,0,0,0,0,0,0,0,0,0,0,0,0,0,0,0,0,0,0,0,0,0,0,0,0,0,0,null,"Rondes confirmées",{"$f":"SUM(C61:BY61)","v":0},0,0,0,0,0,0,0,0,0,0,0,0,0,0,0,0,0,null,"Rondes confirmées",{"$f":"SUM(CC61:CT61)","v":0},"Rondes confirmées",{"$f":"SUM(CV61+CB61)","v":0}]
[null,null,null,{"$f":"SUM((D59+D60)*D61)","v":0},0,0,0,0,0,0,0,0,0,0,0,0,0,0,0,0,0,0,0,0,0,0,0,0,0,0,0,0,0,0,0,0,0,0,0,0,0,0,0,0,0,0,0,0,0,0,0,0,0,0,0,0,0,0,0,0,{"$f":"SUM((BI59+BI60)*BI61)","v":0},{"$f":"SUM((BJ59+BJ60)*BJ61)","v":0},0,0,0,{"$f":"SUM((BN59+BN60)*BN61)","v":0},0,0,0,0,0,{"$f":"SUM((BT59+BT60)*BT61)","v":0},{"$f":"SUM((BU59+BU60)*BU61)","v":0},{"$f":"SUM((BV59+BV60)*BV61)","v":0},0,0,0,null,"Rondes effectuées",{"$f":"COUNTIF(D59:BY59,\">0\")","v":0},{"$f":"SUM((CC59+CC60)*CC61)","v":0},0,0,0,0,0,0,0,0,0,0,0,0,0,0,0,0,null,"Rondes Effectuées",{"$f":"COUNTIF(CC59:CS59,\">0\")","v":0},"Rondes effectuées",{"$f":"SUM(CV62+CB62)","v":0}]
[15,{"$f":"VLOOKUP(A63,'Numéro licences'!$A$4:$B$32,2)","v":"ARENZANA Jennifer"},"Aller-Retour",null,null,null,null,null,null,null,null,null,null,null,null,null,null,null,null,null,null,null,null,null,null,null,null,null,null,null,null,null,null,null,null,null,null,null,null,null,null,null,null,null,null,null,null,null,null,null,null,null,null,null,null,null,null,null,null,null,null,null,null,null,null,null,null,null,null,null,null,null,null,null,null,null,null,{"$f":"SUM(D63:BY63)","v":0},"Km  renseignés",{"$f":"SUM(BZ63+BZ64)","v":0},null,null,null,null,null,null,null,null,null,null,null,null,null,null,null,null,null,{"$f":"SUM(CC63:CS63)","v":0},"Km  renseignés",{"$f":"SUM(CT63+CT64)","v":0},"Km  renseignés",{"$f":"SUM(CB63+CV63)","v":0}]
[null,null,"Ronde",null,null,null,null,null,null,null,null,null,null,null,null,null,null,null,null,null,null,null,null,null,null,null,null,null,null,null,null,null,null,null,null,null,null,null,null,null,null,null,null,null,null,null,null,null,null,null,null,null,null,null,null,null,null,null,null,null,null,null,null,null,null,null,null,null,null,null,null,null,null,null,null,null,null,{"$f":"SUM(D64:BY64)","v":0},"Km confirmés",{"$f":"SUM(D66:BY66)","v":0},null,null,null,null,null,null,null,null,null,null,null,null,null,null,null,null,null,{"$f":"SUM(CC64:CS64)","v":0},"Km confirmés",{"$f":"SUM(CC66:CS66)","v":0},"Km confirmés",{"$f":"SUM(CV64+CB64)","v":0}]
[null,null,null,0,0,0,0,0,0,0,0,0,0,0,0,0,0,0,0,0,0,0,0,0,0,0,0,0,0,0,0,0,0,0,0,0,0,0,0,0,0,0,0,0,0,0,0,0,0,0,0,0,0,0,0,0,0,0,0,0,0,0,0,0,0,0,0,0,0,0,0,0,0,0,0,0,0,null,"Rondes confirmées",{"$f":"SUM(C65:BY65)","v":0},0,0,0,0,0,0,0,0,0,0,0,0,0,0,0,0,0,null,"Rondes confirmées",{"$f":"SUM(CC65:CT65)","v":0},"Rondes confirmées",{"$f":"SUM(CV65+CB65)","v":0}]
[null,null,null,{"$f":"SUM((D63+D64)*D65)","v":0},0,0,0,0,0,0,0,0,0,0,0,0,0,0,0,0,0,0,0,0,0,0,0,0,0,0,0,0,0,0,0,0,0,0,0,0,0,0,0,0,0,0,0,0,0,0,0,0,0,0,0,0,0,0,0,0,{"$f":"SUM((BI63+BI64)*BI65)","v":0},{"$f":"SUM((BJ63+BJ64)*BJ65)","v":0},0,0,0,{"$f":"SUM((BN63+BN64)*BN65)","v":0},0,0,0,0,0,{"$f":"SUM((BT63+BT64)*BT65)","v":0},{"$f":"SUM((BU63+BU64)*BU65)","v":0},{"$f":"SUM((BV63+BV64)*BV65)","v":0},0,0,0,null,"Rondes effectuées",{"$f":"COUNTIF(D63:BY63,\">0\")","v":0},{"$f":"SUM((CC63+CC64)*CC65)","v":0},0,0,0,0,0,0,0,0,0,0,0,0,0,0,0,0,null,"Rondes Effectuées",{"$f":"COUNTIF(CC63:CS63,\">0\")","v":0},"Rondes effectuées",{"$f":"SUM(CV66+CB66)","v":0}]
[16,{"$f":"VLOOKUP(A67,'Numéro licences'!$A$4:$B$32,2)","v":0},"Aller-Retour",null,null,null,null,null,null,null,null,null,null,null,null,null,null,null,null,null,null,null,null,null,null,null,null,null,null,null,null,null,null,null,null,null,null,null,null,null,null,null,null,null,null,null,null,null,null,null,null,null,null,null,null,null,null,null,null,null,null,null,null,null,null,null,null,null,null,null,null,null,null,null,null,null,null,{"$f":"SUM(D67:BY67)","v":0},"Km  renseignés",{"$f":"SUM(BZ67+BZ68)","v":0},null,null,null,null,null,null,null,null,null,null,null,null,null,null,null,null,null,{"$f":"SUM(CC67:CS67)","v":0},"Km  renseignés",{"$f":"SUM(CT67+CT68)","v":0},"Km  renseignés",{"$f":"SUM(CB67+CV67)","v":0}]
[null,null,"Ronde",null,null,null,null,null,null,null,null,null,null,null,null,null,null,null,null,null,null,null,null,null,null,null,null,null,null,null,null,null,null,null,null,null,null,null,null,null,null,null,null,null,null,null,null,null,null,null,null,null,null,null,null,null,null,null,null,null,null,null,null,null,null,null,null,null,null,null,null,null,null,null,null,null,null,{"$f":"SUM(D68:BY68)","v":0},"Km confirmés",{"$f":"SUM(D70:BY70)","v":0},null,null,null,null,null,null,null,null,null,null,null,null,null,null,null,null,null,{"$f":"SUM(CC68:CS68)","v":0},"Km confirmés",{"$f":"SUM(CC70:CS70)","v":0},"Km confirmés",{"$f":"SUM(CV68+CB68)","v":0}]
[null,null,null,0,0,0,0,0,0,0,0,0,0,0,0,0,0,0,0,0,0,0,0,0,0,0,0,0,0,0,0,0,0,0,0,0,0,0,0,0,0,0,0,0,0,0,0,0,0,0,0,0,0,0,0,0,0,0,0,0,0,0,0,0,0,0,0,0,0,0,0,0,0,0,0,0,0,null,"Rondes confirmées",{"$f":"SUM(C69:BY69)","v":0},0,0,0,0,0,0,0,0,0,0,0,0,0,0,0,0,0,null,"Rondes confirmées",{"$f":"SUM(CC69:CT69)","v":0},"Rondes confirmées",{"$f":"SUM(CV69+CB69)","v":0}]
[null,null,null,{"$f":"SUM((D67+D68)*D69)","v":0},0,0,0,0,0,0,0,0,0,0,0,0,0,0,0,0,0,0,0,0,0,0,0,0,0,0,0,0,0,0,0,0,0,0,0,0,0,0,0,0,0,0,0,0,0,0,0,0,0,0,0,0,0,0,0,0,{"$f":"SUM((BI67+BI68)*BI69)","v":0},{"$f":"SUM((BJ67+BJ68)*BJ69)","v":0},0,0,0,{"$f":"SUM((BN67+BN68)*BN69)","v":0},0,0,0,0,0,{"$f":"SUM((BT67+BT68)*BT69)","v":0},{"$f":"SUM((BU67+BU68)*BU69)","v":0},{"$f":"SUM((BV67+BV68)*BV69)","v":0},0,0,0,null,"Rondes effectuées",{"$f":"COUNTIF(D67:BY67,\">0\")","v":0},{"$f":"SUM((CC67+CC68)*CC69)","v":0},0,0,0,0,0,0,0,0,0,0,0,0,0,0,0,0,null,"Rondes Effectuées",{"$f":"COUNTIF(CC67:CS67,\">0\")","v":0},"Rondes effectuées",{"$f":"SUM(CV70+CB70)","v":0}]
[17,{"$f":"VLOOKUP(A71,'Numéro licences'!$A$4:$B$32,2)","v":0},"Aller-Retour",null,null,null,null,null,null,null,null,null,null,null,null,null,null,null,null,null,null,null,null,null,null,null,null,null,null,null,null,null,null,null,null,null,null,null,null,null,null,null,null,null,null,null,null,null,null,null,null,null,null,null,null,null,null,null,null,null,null,null,null,null,null,null,null,null,null,null,null,null,null,null,null,null,null,{"$f":"SUM(D71:BY71)","v":0},"Km  renseignés",{"$f":"SUM(BZ71+BZ72)","v":0},null,null,null,null,null,null,null,null,null,null,null,null,null,null,null,null,null,{"$f":"SUM(CC71:CS71)","v":0},"Km  renseignés",{"$f":"SUM(CT71+CT72)","v":0},"Km  renseignés",{"$f":"SUM(CB71+CV71)","v":0}]
[null,null,"Ronde",null,null,null,null,null,null,null,null,null,null,null,null,null,null,null,null,null,null,null,null,null,null,null,null,null,null,null,null,null,null,null,null,null,null,null,null,null,null,null,null,null,null,null,null,null,null,null,null,null,null,null,null,null,null,null,null,null,null,null,null,null,null,null,null,null,null,null,null,null,null,null,null,null,null,{"$f":"SUM(D72:BY72)","v":0},"Km confirmés",{"$f":"SUM(D74:BY74)","v":0},null,null,null,null,null,null,null,null,null,null,null,null,null,null,null,null,null,{"$f":"SUM(CC72:CS72)","v":0},"Km confirmés",{"$f":"SUM(CC74:CS74)","v":0},"Km confirmés",{"$f":"SUM(CV72+CB72)","v":0}]
[null,null,null,0,0,0,0,0,0,0,0,0,0,0,0,0,0,0,0,0,0,0,0,0,0,0,0,0,0,0,0,0,0,0,0,0,0,0,0,0,0,0,0,0,0,0,0,0,0,0,0,0,0,0,0,0,0,0,0,0,0,0,0,0,0,0,0,0,0,0,0,0,0,0,0,0,0,null,"Rondes confirmées",{"$f":"SUM(C73:BY73)","v":0},0,0,0,0,0,0,0,0,0,0,0,0,0,0,0,0,0,null,"Rondes confirmées",{"$f":"SUM(CC73:CT73)","v":0},"Rondes confirmées",{"$f":"SUM(CV73+CB73)","v":0}]
[null,null,null,{"$f":"SUM((D71+D72)*D73)","v":0},0,0,0,0,0,0,0,0,0,0,0,0,0,0,0,0,0,0,0,0,0,0,0,0,0,0,0,0,0,0,0,0,0,0,0,0,0,0,0,0,0,0,0,0,0,0,0,0,0,0,0,0,0,0,0,0,{"$f":"SUM((BI71+BI72)*BI73)","v":0},{"$f":"SUM((BJ71+BJ72)*BJ73)","v":0},0,0,0,{"$f":"SUM((BN71+BN72)*BN73)","v":0},0,0,0,0,0,{"$f":"SUM((BT71+BT72)*BT73)","v":0},{"$f":"SUM((BU71+BU72)*BU73)","v":0},{"$f":"SUM((BV71+BV72)*BV73)","v":0},0,0,0,null,"Rondes effectuées",{"$f":"COUNTIF(D71:BY71,\">0\")","v":0},{"$f":"SUM((CC71+CC72)*CC73)","v":0},0,0,0,0,0,0,0,0,0,0,0,0,0,0,0,0,null,"Rondes Effectuées",{"$f":"COUNTIF(CC71:CS71,\">0\")","v":0},"Rondes effectuées",{"$f":"SUM(CV74+CB74)","v":0}]
[18,{"$f":"VLOOKUP(A75,'Numéro licences'!$A$4:$B$32,2)","v":0},"Aller-Retour",null,null,null,null,null,null,null,null,null,null,null,null,null,null,null,null,null,null,null,null,null,null,null,null,null,null,null,null,null,null,null,null,null,null,null,null,null,null,null,null,null,null,null,null,null,null,null,null,null,null,null,null,null,null,null,null,null,null,null,null,null,null,null,null,null,null,null,null,null,null,null,null,null,null,{"$f":"SUM(D75:BY75)","v":0},"Km  renseignés",{"$f":"SUM(BZ75+BZ76)","v":0},null,null,null,null,null,null,null,null,null,null,null,null,null,null,null,null,null,{"$f":"SUM(CC75:CS75)","v":0},"Km  renseignés",{"$f":"SUM(CT75+CT76)","v":0},"Km  renseignés",{"$f":"SUM(CB75+CV75)","v":0}]
[null,null,"Ronde",null,null,null,null,null,null,null,null,null,null,null,null,null,null,null,null,null,null,null,null,null,null,null,null,null,null,null,null,null,null,null,null,null,null,null,null,null,null,null,null,null,null,null,null,null,null,null,null,null,null,null,null,null,null,null,null,null,null,null,null,null,null,null,null,null,null,null,null,null,null,null,null,null,null,{"$f":"SUM(D76:BY76)","v":0},"Km confirmés",{"$f":"SUM(D78:BY78)","v":0},null,null,null,null,null,null,null,null,null,null,null,null,null,null,null,null,null,{"$f":"SUM(CC76:CS76)","v":0},"Km confirmés",{"$f":"SUM(CC78:CS78)","v":0},"Km confirmés",{"$f":"SUM(CV76+CB76)","v":0}]
[null,null,null,0,0,0,0,0,0,0,0,0,0,0,0,0,0,0,0,0,0,0,0,0,0,0,0,0,0,0,0,0,0,0,0,0,0,0,0,0,0,0,0,0,0,0,0,0,0,0,0,0,0,0,0,0,0,0,0,0,0,0,0,0,0,0,0,0,0,0,0,0,0,0,0,0,0,null,"Rondes confirmées",{"$f":"SUM(C77:BY77)","v":0},0,0,0,0,0,0,0,0,0,0,0,0,0,0,0,0,0,null,"Rondes confirmées",{"$f":"SUM(CC77:CT77)","v":0},"Rondes confirmées",{"$f":"SUM(CV77+CB77)","v":0}]
[null,null,null,{"$f":"SUM((D75+D76)*D77)","v":0},0,0,0,0,0,0,0,0,0,0,0,0,0,0,0,0,0,0,0,0,0,0,0,0,0,0,0,0,0,0,0,0,0,0,0,0,0,0,0,0,0,0,0,0,0,0,0,0,0,0,0,0,0,0,0,0,{"$f":"SUM((BI75+BI76)*BI77)","v":0},{"$f":"SUM((BJ75+BJ76)*BJ77)","v":0},0,0,0,{"$f":"SUM((BN75+BN76)*BN77)","v":0},0,0,0,0,0,{"$f":"SUM((BT75+BT76)*BT77)","v":0},{"$f":"SUM((BU75+BU76)*BU77)","v":0},{"$f":"SUM((BV75+BV76)*BV77)","v":0},0,0,0,null,"Rondes effectuées",{"$f":"COUNTIF(D75:BY75,\">0\")","v":0},{"$f":"SUM((CC75+CC76)*CC77)","v":0},0,0,0,0,0,0,0,0,0,0,0,0,0,0,0,0,null,"Rondes Effectuées",{"$f":"COUNTIF(CC75:CS75,\">0\")","v":0},"Rondes effectuées",{"$f":"SUM(CV78+CB78)","v":0}]
[19,{"$f":"VLOOKUP(A79,'Numéro licences'!$A$4:$B$32,2)","v":0},"Aller-Retour",null,null,null,null,null,null,null,null,null,null,null,null,null,null,null,null,null,null,null,null,null,null,null,null,null,null,null,null,null,null,null,null,null,null,null,null,null,null,null,null,null,null,null,null,null,null,null,null,null,null,null,null,null,null,null,null,null,null,null,null,null,null,null,null,null,null,null,null,null,null,null,null,null,null,{"$f":"SUM(D79:BY79)","v":0},"Km  renseignés",{"$f":"SUM(BZ79+BZ80)","v":0},null,null,null,null,null,null,null,null,null,null,null,null,null,null,null,null,null,{"$f":"SUM(CC79:CS79)","v":0},"Km  renseignés",{"$f":"SUM(CT79+CT80)","v":0},"Km  renseignés",{"$f":"SUM(CB79+CV79)","v":0}]
[null,null,"Ronde",null,null,null,null,null,null,null,null,null,null,null,null,null,null,null,null,null,null,null,null,null,null,null,null,null,null,null,null,null,null,null,null,null,null,null,null,null,null,null,null,null,null,null,null,null,null,null,null,null,null,null,null,null,null,null,null,null,null,null,null,null,null,null,null,null,null,null,null,null,null,null,null,null,null,{"$f":"SUM(D80:BY80)","v":0},"Km confirmés",{"$f":"SUM(D82:BY82)","v":0},null,null,null,null,null,null,null,null,null,null,null,null,null,null,null,null,null,{"$f":"SUM(CC80:CS80)","v":0},"Km confirmés",{"$f":"SUM(CC82:CS82)","v":0},"Km confirmés",{"$f":"SUM(CV80+CB80)","v":0}]
[null,null,null,0,0,0,0,0,0,0,0,0,0,0,0,0,0,0,0,0,0,0,0,0,0,0,0,0,0,0,0,0,0,0,0,0,0,0,0,0,0,0,0,0,0,0,0,0,0,0,0,0,0,0,0,0,0,0,0,0,0,0,0,0,0,0,0,0,0,0,0,0,0,0,0,0,0,null,"Rondes confirmées",{"$f":"SUM(C81:BY81)","v":0},0,0,0,0,0,0,0,0,0,0,0,0,0,0,0,0,0,null,"Rondes confirmées",{"$f":"SUM(CC81:CT81)","v":0},"Rondes confirmées",{"$f":"SUM(CV81+CB81)","v":0}]
[null,null,null,{"$f":"SUM((D79+D80)*D81)","v":0},0,0,0,0,0,0,0,0,0,0,0,0,0,0,0,0,0,0,0,0,0,0,0,0,0,0,0,0,0,0,0,0,0,0,0,0,0,0,0,0,0,0,0,0,0,0,0,0,0,0,0,0,0,0,0,0,{"$f":"SUM((BI79+BI80)*BI81)","v":0},{"$f":"SUM((BJ79+BJ80)*BJ81)","v":0},0,0,0,{"$f":"SUM((BN79+BN80)*BN81)","v":0},0,0,0,0,0,{"$f":"SUM((BT79+BT80)*BT81)","v":0},{"$f":"SUM((BU79+BU80)*BU81)","v":0},{"$f":"SUM((BV79+BV80)*BV81)","v":0},0,0,0,null,"Rondes effectuées",{"$f":"COUNTIF(D79:BY79,\">0\")","v":0},{"$f":"SUM((CC79+CC80)*CC81)","v":0},0,0,0,0,0,0,0,0,0,0,0,0,0,0,0,0,null,"Rondes Effectuées",{"$f":"COUNTIF(CC79:CS79,\">0\")","v":0},"Rondes effectuées",{"$f":"SUM(CV82+CB82)","v":0}]
[20,{"$f":"VLOOKUP(A83,'Numéro licences'!$A$4:$B$32,2)","v":0},"Aller-Retour",null,null,null,null,null,null,null,null,null,null,null,null,null,null,null,null,null,null,null,null,null,null,null,null,null,null,null,null,null,null,null,null,null,null,null,null,null,null,null,null,null,null,null,null,null,null,null,null,null,null,null,null,null,null,null,null,null,null,null,null,null,null,null,null,null,null,null,null,null,null,null,null,null,null,{"$f":"SUM(D83:BY83)","v":0},"Km  renseignés",{"$f":"SUM(BZ83+BZ84)","v":0},null,null,null,null,null,null,null,null,null,null,null,null,null,null,null,null,null,{"$f":"SUM(CC83:CS83)","v":0},"Km  renseignés",{"$f":"SUM(CT83+CT84)","v":0},"Km  renseignés",{"$f":"SUM(CB83+CV83)","v":0}]
[null,null,"Ronde",null,null,null,null,null,null,null,null,null,null,null,null,null,null,null,null,null,null,null,null,null,null,null,null,null,null,null,null,null,null,null,null,null,null,null,null,null,null,null,null,null,null,null,null,null,null,null,null,null,null,null,null,null,null,null,null,null,null,null,null,null,null,null,null,null,null,null,null,null,null,null,null,null,null,{"$f":"SUM(D84:BY84)","v":0},"Km confirmés",{"$f":"SUM(D86:BY86)","v":0},null,null,null,null,null,null,null,null,null,null,null,null,null,null,null,null,null,{"$f":"SUM(CC84:CS84)","v":0},"Km confirmés",{"$f":"SUM(CC86:CS86)","v":0},"Km confirmés",{"$f":"SUM(CV84+CB84)","v":0}]
[null,null,null,0,0,0,0,0,0,0,0,0,0,0,0,0,0,0,0,0,0,0,0,0,0,0,0,0,0,0,0,0,0,0,0,0,0,0,0,0,0,0,0,0,0,0,0,0,0,0,0,0,0,0,0,0,0,0,0,0,0,0,0,0,0,0,0,0,0,0,0,0,0,0,0,0,0,null,"Rondes confirmées",{"$f":"SUM(C85:BY85)","v":0},0,0,0,0,0,0,0,0,0,0,0,0,0,0,0,0,0,null,"Rondes confirmées",{"$f":"SUM(CC85:CT85)","v":0},"Rondes confirmées",{"$f":"SUM(CV85+CB85)","v":0}]
[null,null,null,{"$f":"SUM((D83+D84)*D85)","v":0},0,0,0,0,0,0,0,0,0,0,0,0,0,0,0,0,0,0,0,0,0,0,0,0,0,0,0,0,0,0,0,0,0,0,0,0,0,0,0,0,0,0,0,0,0,0,0,0,0,0,0,0,0,0,0,0,{"$f":"SUM((BI83+BI84)*BI85)","v":0},{"$f":"SUM((BJ83+BJ84)*BJ85)","v":0},0,0,0,{"$f":"SUM((BN83+BN84)*BN85)","v":0},0,0,0,0,0,{"$f":"SUM((BT83+BT84)*BT85)","v":0},{"$f":"SUM((BU83+BU84)*BU85)","v":0},{"$f":"SUM((BV83+BV84)*BV85)","v":0},0,0,0,null,"Rondes effectuées",{"$f":"COUNTIF(D83:BY83,\">0\")","v":0},{"$f":"SUM((CC83+CC84)*CC85)","v":0},0,0,0,0,0,0,0,0,0,0,0,0,0,0,0,0,null,"Rondes Effectuées",{"$f":"COUNTIF(CC83:CS83,\">0\")","v":0},"Rondes effectuées",{"$f":"SUM(CV86+CB86)","v":0}]
[21,{"$f":"VLOOKUP(A87,'Numéro licences'!$A$4:$B$32,2)","v":0},"Aller-Retour",null,null,null,null,null,null,null,null,null,null,null,null,null,null,null,null,null,null,null,null,null,null,null,null,null,null,null,null,null,null,null,null,null,null,null,null,null,null,null,null,null,null,null,null,null,null,null,null,null,null,null,null,null,null,null,null,null,null,null,null,null,null,null,null,null,null,null,null,null,null,null,null,null,null,{"$f":"SUM(D87:BY87)","v":0},"Km  renseignés",{"$f":"SUM(BZ87+BZ88)","v":0},null,null,null,null,null,null,null,null,null,null,null,null,null,null,null,null,null,{"$f":"SUM(CC87:CS87)","v":0},"Km  renseignés",{"$f":"SUM(CT87+CT88)","v":0},"Km  renseignés",{"$f":"SUM(CB87+CV87)","v":0}]
[null,null,"Ronde",null,null,null,null,null,null,null,null,null,null,null,null,null,null,null,null,null,null,null,null,null,null,null,null,null,null,null,null,null,null,null,null,null,null,null,null,null,null,null,null,null,null,null,null,null,null,null,null,null,null,null,null,null,null,null,null,null,null,null,null,null,null,null,null,null,null,null,null,null,null,null,null,null,null,{"$f":"SUM(D88:BY88)","v":0},"Km confirmés",{"$f":"SUM(D90:BY90)","v":0},null,null,null,null,null,null,null,null,null,null,null,null,null,null,null,null,null,{"$f":"SUM(CC88:CS88)","v":0},"Km confirmés",{"$f":"SUM(CC90:CS90)","v":0},"Km confirmés",{"$f":"SUM(CV88+CB88)","v":0}]
[null,null,null,0,0,0,0,0,0,0,0,0,0,0,0,0,0,0,0,0,0,0,0,0,0,0,0,0,0,0,0,0,0,0,0,0,0,0,0,0,0,0,0,0,0,0,0,0,0,0,0,0,0,0,0,0,0,0,0,0,0,0,0,0,0,0,0,0,0,0,0,0,0,0,0,0,0,null,"Rondes confirmées",{"$f":"SUM(C89:BY89)","v":0},0,0,0,0,0,0,0,0,0,0,0,0,0,0,0,0,0,null,"Rondes confirmées",{"$f":"SUM(CC89:CT89)","v":0},"Rondes confirmées",{"$f":"SUM(CV89+CB89)","v":0}]
[null,null,null,{"$f":"SUM((D87+D88)*D89)","v":0},0,0,0,0,0,0,0,0,0,0,0,0,0,0,0,0,0,0,0,0,0,0,0,0,0,0,0,0,0,0,0,0,0,0,0,0,0,0,0,0,0,0,0,0,0,0,0,0,0,0,0,0,0,0,0,0,{"$f":"SUM((BI87+BI88)*BI89)","v":0},{"$f":"SUM((BJ87+BJ88)*BJ89)","v":0},0,0,0,{"$f":"SUM((BN87+BN88)*BN89)","v":0},0,0,0,0,0,{"$f":"SUM((BT87+BT88)*BT89)","v":0},{"$f":"SUM((BU87+BU88)*BU89)","v":0},{"$f":"SUM((BV87+BV88)*BV89)","v":0},0,0,0,null,"Rondes effectuées",{"$f":"COUNTIF(D87:BY87,\">0\")","v":0},{"$f":"SUM((CC87+CC88)*CC89)","v":0},0,0,0,0,0,0,0,0,0,0,0,0,0,0,0,0,null,"Rondes Effectuées",{"$f":"COUNTIF(CC87:CS87,\">0\")","v":0},"Rondes effectuées",{"$f":"SUM(CV90+CB90)","v":0}]
[22,{"$f":"VLOOKUP(A91,'Numéro licences'!$A$4:$B$32,2)","v":0},"Aller-Retour",null,null,null,null,null,null,null,null,null,null,null,null,null,null,null,null,null,null,null,null,null,null,null,null,null,null,null,null,null,null,null,null,null,null,null,null,null,null,null,null,null,null,null,null,null,null,null,null,null,null,null,null,null,null,null,null,null,null,null,null,null,null,null,null,null,null,null,null,null,null,null,null,null,null,{"$f":"SUM(D91:BY91)","v":0},"Km  renseignés",{"$f":"SUM(BZ91+BZ92)","v":0},null,null,null,null,null,null,null,null,null,null,null,null,null,null,null,null,null,{"$f":"SUM(CC91:CS91)","v":0},"Km  renseignés",{"$f":"SUM(CT91+CT92)","v":0},"Km  renseignés",{"$f":"SUM(CB91+CV91)","v":0}]
[null,null,"Ronde",null,null,null,null,null,null,null,null,null,null,null,null,null,null,null,null,null,null,null,null,null,null,null,null,null,null,null,null,null,null,null,null,null,null,null,null,null,null,null,null,null,null,null,null,null,null,null,null,null,null,null,null,null,null,null,null,null,null,null,null,null,null,null,null,null,null,null,null,null,null,null,null,null,null,{"$f":"SUM(D92:BY92)","v":0},"Km confirmés",{"$f":"SUM(D94:BY94)","v":0},null,null,null,null,null,null,null,null,null,null,null,null,null,null,null,null,null,{"$f":"SUM(CC92:CS92)","v":0},"Km confirmés",{"$f":"SUM(CC94:CS94)","v":0},"Km confirmés",{"$f":"SUM(CV92+CB92)","v":0}]
[null,null,null,0,0,0,0,0,0,0,0,0,0,0,0,0,0,0,0,0,0,0,0,0,0,0,0,0,0,0,0,0,0,0,0,0,0,0,0,0,0,0,0,0,0,0,0,0,0,0,0,0,0,0,0,0,0,0,0,0,0,0,0,0,0,0,0,0,0,0,0,0,0,0,0,0,0,null,"Rondes confirmées",{"$f":"SUM(C93:BY93)","v":0},0,0,0,0,0,0,0,0,0,0,0,0,0,0,0,0,0,null,"Rondes confirmées",{"$f":"SUM(CC93:CT93)","v":0},"Rondes confirmées",{"$f":"SUM(CV93+CB93)","v":0}]
[null,null,null,{"$f":"SUM((D91+D92)*D93)","v":0},0,0,0,0,0,0,0,0,0,0,0,0,0,0,0,0,0,0,0,0,0,0,0,0,0,0,0,0,0,0,0,0,0,0,0,0,0,0,0,0,0,0,0,0,0,0,0,0,0,0,0,0,0,0,0,0,{"$f":"SUM((BI91+BI92)*BI93)","v":0},{"$f":"SUM((BJ91+BJ92)*BJ93)","v":0},0,0,0,{"$f":"SUM((BN91+BN92)*BN93)","v":0},0,0,0,0,0,{"$f":"SUM((BT91+BT92)*BT93)","v":0},{"$f":"SUM((BU91+BU92)*BU93)","v":0},{"$f":"SUM((BV91+BV92)*BV93)","v":0},0,0,0,null,"Rondes effectuées",{"$f":"COUNTIF(D91:BY91,\">0\")","v":0},{"$f":"SUM((CC91+CC92)*CC93)","v":0},0,0,0,0,0,0,0,0,0,0,0,0,0,0,0,0,null,"Rondes Effectuées",{"$f":"COUNTIF(CC91:CS91,\">0\")","v":0},"Rondes effectuées",{"$f":"SUM(CV94+CB94)","v":0}]
[23,{"$f":"VLOOKUP(A95,'Numéro licences'!$A$4:$B$32,2)","v":0},"Aller-Retour",null,null,null,null,null,null,null,null,null,null,null,null,null,null,null,null,null,null,null,null,null,null,null,null,null,null,null,null,null,null,null,null,null,null,null,null,null,null,null,null,null,null,null,null,null,null,null,null,null,null,null,null,null,null,null,null,null,null,null,null,null,null,null,null,null,null,null,null,null,null,null,null,null,null,{"$f":"SUM(D95:BY95)","v":0},"Km  renseignés",{"$f":"SUM(BZ95+BZ96)","v":0},null,null,null,null,null,null,null,null,null,null,null,null,null,null,null,null,null,{"$f":"SUM(CC95:CS95)","v":0},"Km  renseignés",{"$f":"SUM(CT95+CT96)","v":0},"Km  renseignés",{"$f":"SUM(CB95+CV95)","v":0}]
[null,null,"Ronde",null,null,null,null,null,null,null,null,null,null,null,null,null,null,null,null,null,null,null,null,null,null,null,null,null,null,null,null,null,null,null,null,null,null,null,null,null,null,null,null,null,null,null,null,null,null,null,null,null,null,null,null,null,null,null,null,null,null,null,null,null,null,null,null,null,null,null,null,null,null,null,null,null,null,{"$f":"SUM(D96:BY96)","v":0},"Km confirmés",{"$f":"SUM(D98:BY98)","v":0},null,null,null,null,null,null,null,null,null,null,null,null,null,null,null,null,null,{"$f":"SUM(CC96:CS96)","v":0},"Km confirmés",{"$f":"SUM(CC98:CS98)","v":0},"Km confirmés",{"$f":"SUM(CV96+CB96)","v":0}]
[null,null,null,0,0,0,0,0,0,0,0,0,0,0,0,0,0,0,0,0,0,0,0,0,0,0,0,0,0,0,0,0,0,0,0,0,0,0,0,0,0,0,0,0,0,0,0,0,0,0,0,0,0,0,0,0,0,0,0,0,0,0,0,0,0,0,0,0,0,0,0,0,0,0,0,0,0,null,"Rondes confirmées",{"$f":"SUM(C97:BY97)","v":0},0,0,0,0,0,0,0,0,0,0,0,0,0,0,0,0,0,null,"Rondes confirmées",{"$f":"SUM(CC97:CT97)","v":0},"Rondes confirmées",{"$f":"SUM(CV97+CB97)","v":0}]
[null,null,null,{"$f":"SUM((D95+D96)*D97)","v":0},0,0,0,0,0,0,0,0,0,0,0,0,0,0,0,0,0,0,0,0,0,0,0,0,0,0,0,0,0,0,0,0,0,0,0,0,0,0,0,0,0,0,0,0,0,0,0,0,0,0,0,0,0,0,0,0,{"$f":"SUM((BI95+BI96)*BI97)","v":0},{"$f":"SUM((BJ95+BJ96)*BJ97)","v":0},0,0,0,{"$f":"SUM((BN95+BN96)*BN97)","v":0},0,0,0,0,0,{"$f":"SUM((BT95+BT96)*BT97)","v":0},{"$f":"SUM((BU95+BU96)*BU97)","v":0},{"$f":"SUM((BV95+BV96)*BV97)","v":0},0,0,0,null,"Rondes effectuées",{"$f":"COUNTIF(D95:BY95,\">0\")","v":0},{"$f":"SUM((CC95+CC96)*CC97)","v":0},0,0,0,0,0,0,0,0,0,0,0,0,0,0,0,0,null,"Rondes Effectuées",{"$f":"COUNTIF(CC95:CS95,\">0\")","v":0},"Rondes effectuées",{"$f":"SUM(CV98+CB98)","v":0}]
[24,{"$f":"VLOOKUP(A99,'Numéro licences'!$A$4:$B$32,2)","v":0},"Aller-Retour",null,null,null,null,null,null,null,null,null,null,null,null,null,null,null,null,null,null,null,null,null,null,null,null,null,null,null,null,null,null,null,null,null,null,null,null,null,null,null,null,null,null,null,null,null,null,null,null,null,null,null,null,null,null,null,null,null,null,null,null,null,null,null,null,null,null,null,null,null,null,null,null,null,null,{"$f":"SUM(D99:BY99)","v":0},"Km  renseignés",{"$f":"SUM(BZ99+BZ100)","v":0},null,null,null,null,null,null,null,null,null,null,null,null,null,null,null,null,null,{"$f":"SUM(CC99:CS99)","v":0},"Km  renseignés",{"$f":"SUM(CT99+CT100)","v":0},"Km  renseignés",{"$f":"SUM(CB99+CV99)","v":0}]
[null,null,"Ronde",null,null,null,null,null,null,null,null,null,null,null,null,null,null,null,null,null,null,null,null,null,null,null,null,null,null,null,null,null,null,null,null,null,null,null,null,null,null,null,null,null,null,null,null,null,null,null,null,null,null,null,null,null,null,null,null,null,null,null,null,null,null,null,null,null,null,null,null,null,null,null,null,null,null,{"$f":"SUM(D100:BY100)","v":0},"Km confirmés",{"$f":"SUM(D102:BY102)","v":0},null,null,null,null,null,null,null,null,null,null,null,null,null,null,null,null,null,{"$f":"SUM(CC100:CS100)","v":0},"Km confirmés",{"$f":"SUM(CC102:CS102)","v":0},"Km confirmés",{"$f":"SUM(CV100+CB100)","v":0}]
[null,null,null,0,0,0,0,0,0,0,0,0,0,0,0,0,0,0,0,0,0,0,0,0,0,0,0,0,0,0,0,0,0,0,0,0,0,0,0,0,0,0,0,0,0,0,0,0,0,0,0,0,0,0,0,0,0,0,0,0,0,0,0,0,0,0,0,0,0,0,0,0,0,0,0,0,0,null,"Rondes confirmées",{"$f":"SUM(C101:BY101)","v":0},0,0,0,0,0,0,0,0,0,0,0,0,0,0,0,0,0,null,"Rondes confirmées",{"$f":"SUM(CC101:CT101)","v":0},"Rondes confirmées",{"$f":"SUM(CV101+CB101)","v":0}]
[null,null,null,{"$f":"SUM((D99+D100)*D101)","v":0},0,0,0,0,0,0,0,0,0,0,0,0,0,0,0,0,0,0,0,0,0,0,0,0,0,0,0,0,0,0,0,0,0,0,0,0,0,0,0,0,0,0,0,0,0,0,0,0,0,0,0,0,0,0,0,0,{"$f":"SUM((BI99+BI100)*BI101)","v":0},{"$f":"SUM((BJ99+BJ100)*BJ101)","v":0},0,0,0,{"$f":"SUM((BN99+BN100)*BN101)","v":0},0,0,0,0,0,{"$f":"SUM((BT99+BT100)*BT101)","v":0},{"$f":"SUM((BU99+BU100)*BU101)","v":0},{"$f":"SUM((BV99+BV100)*BV101)","v":0},0,0,0,null,"Rondes effectuées",{"$f":"COUNTIF(D99:BY99,\">0\")","v":0},{"$f":"SUM((CC99+CC100)*CC101)","v":0},0,0,0,0,0,0,0,0,0,0,0,0,0,0,0,0,null,"Rondes Effectuées",{"$f":"COUNTIF(CC99:CS99,\">0\")","v":0},"Rondes effectuées",{"$f":"SUM(CV102+CB102)","v":0}]
[25,{"$f":"VLOOKUP(A103,'Numéro licences'!$A$4:$B$32,2)","v":0},"Aller-Retour",null,null,null,null,null,null,null,null,null,null,null,null,null,null,null,null,null,null,null,null,null,null,null,null,null,null,null,null,null,null,null,null,null,null,null,null,null,null,null,null,null,null,null,null,null,null,null,null,null,null,null,null,null,null,null,null,null,null,null,null,null,null,null,null,null,null,null,null,null,null,null,null,null,null,{"$f":"SUM(D103:BY103)","v":0},"Km  renseignés",{"$f":"SUM(BZ103+BZ104)","v":0},null,null,null,null,null,null,null,null,null,null,null,null,null,null,null,null,null,{"$f":"SUM(CC103:CS103)","v":0},"Km  renseignés",{"$f":"SUM(CT103+CT104)","v":0},"Km  renseignés",{"$f":"SUM(CB103+CV103)","v":0}]
[null,null,"Ronde",null,null,null,null,null,null,null,null,null,null,null,null,null,null,null,null,null,null,null,null,null,null,null,null,null,null,null,null,null,null,null,null,null,null,null,null,null,null,null,null,null,null,null,null,null,null,null,null,null,null,null,null,null,null,null,null,null,null,null,null,null,null,null,null,null,null,null,null,null,null,null,null,null,null,{"$f":"SUM(D104:BY104)","v":0},"Km confirmés",{"$f":"SUM(D106:BY106)","v":0},null,null,null,null,null,null,null,null,null,null,null,null,null,null,null,null,null,{"$f":"SUM(CC104:CS104)","v":0},"Km confirmés",{"$f":"SUM(CC106:CS106)","v":0},"Km confirmés",{"$f":"SUM(CV104+CB104)","v":0}]
[null,null,null,0,0,0,0,0,0,0,0,0,0,0,0,0,0,0,0,0,0,0,0,0,0,0,0,0,0,0,0,0,0,0,0,0,0,0,0,0,0,0,0,0,0,0,0,0,0,0,0,0,0,0,0,0,0,0,0,0,0,0,0,0,0,0,0,0,0,0,0,0,0,0,0,0,0,null,"Rondes confirmées",{"$f":"SUM(C105:BY105)","v":0},0,0,0,0,0,0,0,0,0,0,0,0,0,0,0,0,0,null,"Rondes confirmées",{"$f":"SUM(CC105:CT105)","v":0},"Rondes confirmées",{"$f":"SUM(CV105+CB105)","v":0}]
[null,null,null,{"$f":"SUM((D103+D104)*D105)","v":0},0,0,0,0,0,0,0,0,0,0,0,0,0,0,0,0,0,0,0,0,0,0,0,0,0,0,0,0,0,0,0,0,0,0,0,0,0,0,0,0,0,0,0,0,0,0,0,0,0,0,0,0,0,0,0,0,{"$f":"SUM((BI103+BI104)*BI105)","v":0},{"$f":"SUM((BJ103+BJ104)*BJ105)","v":0},0,0,0,{"$f":"SUM((BN103+BN104)*BN105)","v":0},0,0,0,0,0,{"$f":"SUM((BT103+BT104)*BT105)","v":0},{"$f":"SUM((BU103+BU104)*BU105)","v":0},{"$f":"SUM((BV103+BV104)*BV105)","v":0},0,0,0,null,"Rondes effectuées",{"$f":"COUNTIF(D103:BY103,\">0\")","v":0},{"$f":"SUM((CC103+CC104)*CC105)","v":0},0,0,0,0,0,0,0,0,0,0,0,0,0,0,0,0,null,"Rondes Effectuées",{"$f":"COUNTIF(CC103:CS103,\">0\")","v":0},"Rondes effectuées",{"$f":"SUM(CV106+CB106)","v":0}]
[26,{"$f":"VLOOKUP(A107,'Numéro licences'!$A$4:$B$32,2)","v":0},"Aller-Retour",null,null,null,null,null,null,null,null,null,null,null,null,null,null,null,null,null,null,null,null,null,null,null,null,null,null,null,null,null,null,null,null,null,null,null,null,null,null,null,null,null,null,null,null,null,null,null,null,null,null,null,null,null,null,null,null,null,null,null,null,null,null,null,null,null,null,null,null,null,null,null,null,null,null,{"$f":"SUM(D107:BY107)","v":0},"Km  renseignés",{"$f":"SUM(BZ107+BZ108)","v":0},null,null,null,null,null,null,null,null,null,null,null,null,null,null,null,null,null,{"$f":"SUM(CC107:CS107)","v":0},"Km  renseignés",{"$f":"SUM(CT107+CT108)","v":0},"Km  renseignés",{"$f":"SUM(CB107+CV107)","v":0}]
[null,null,"Ronde",null,null,null,null,null,null,null,null,null,null,null,null,null,null,null,null,null,null,null,null,null,null,null,null,null,null,null,null,null,null,null,null,null,null,null,null,null,null,null,null,null,null,null,null,null,null,null,null,null,null,null,null,null,null,null,null,null,null,null,null,null,null,null,null,null,null,null,null,null,null,null,null,null,null,{"$f":"SUM(D108:BY108)","v":0},"Km confirmés",{"$f":"SUM(D110:BY110)","v":0},null,null,null,null,null,null,null,null,null,null,null,null,null,null,null,null,null,{"$f":"SUM(CC108:CS108)","v":0},"Km confirmés",{"$f":"SUM(CC110:CS110)","v":0},"Km confirmés",{"$f":"SUM(CV108+CB108)","v":0}]
[null,null,null,0,0,0,0,0,0,0,0,0,0,0,0,0,0,0,0,0,0,0,0,0,0,0,0,0,0,0,0,0,0,0,0,0,0,0,0,0,0,0,0,0,0,0,0,0,0,0,0,0,0,0,0,0,0,0,0,0,0,0,0,0,0,0,0,0,0,0,0,0,0,0,0,0,0,null,"Rondes confirmées",{"$f":"SUM(C109:BY109)","v":0},0,0,0,0,0,0,0,0,0,0,0,0,0,0,0,0,0,null,"Rondes confirmées",{"$f":"SUM(CC109:CT109)","v":0},"Rondes confirmées",{"$f":"SUM(CV109+CB109)","v":0}]
[null,null,null,{"$f":"SUM((D107+D108)*D109)","v":0},0,0,0,0,0,0,0,0,0,0,0,0,0,0,0,0,0,0,0,0,0,0,0,0,0,0,0,0,0,0,0,0,0,0,0,0,0,0,0,0,0,0,0,0,0,0,0,0,0,0,0,0,0,0,0,0,{"$f":"SUM((BI107+BI108)*BI109)","v":0},{"$f":"SUM((BJ107+BJ108)*BJ109)","v":0},0,0,0,{"$f":"SUM((BN107+BN108)*BN109)","v":0},0,0,0,0,0,{"$f":"SUM((BT107+BT108)*BT109)","v":0},{"$f":"SUM((BU107+BU108)*BU109)","v":0},{"$f":"SUM((BV107+BV108)*BV109)","v":0},0,0,0,null,"Rondes effectuées",{"$f":"COUNTIF(D107:BY107,\">0\")","v":0},{"$f":"SUM((CC107+CC108)*CC109)","v":0},0,0,0,0,0,0,0,0,0,0,0,0,0,0,0,0,null,"Rondes Effectuées",{"$f":"COUNTIF(CC107:CS107,\">0\")","v":0},"Rondes effectuées",{"$f":"SUM(CV110+CB110)","v":0}]
[27,{"$f":"VLOOKUP(A111,'Numéro licences'!$A$4:$B$32,2)","v":0},"Aller-Retour",null,null,null,null,null,null,null,null,null,null,null,null,null,null,null,null,null,null,null,null,null,null,null,null,null,null,null,null,null,null,null,null,null,null,null,null,null,null,null,null,null,null,null,null,null,null,null,null,null,null,null,null,null,null,null,null,null,null,null,null,null,null,null,null,null,null,null,null,null,null,null,null,null,null,{"$f":"SUM(D111:BY111)","v":0},"Km  renseignés",{"$f":"SUM(BZ111+BZ112)","v":0},null,null,null,null,null,null,null,null,null,null,null,null,null,null,null,null,null,{"$f":"SUM(CC111:CS111)","v":0},"Km  renseignés",{"$f":"SUM(CT111+CT112)","v":0},"Km  renseignés",{"$f":"SUM(CB111+CV111)","v":0}]
[null,null,"Ronde",null,null,null,null,null,null,null,null,null,null,null,null,null,null,null,null,null,null,null,null,null,null,null,null,null,null,null,null,null,null,null,null,null,null,null,null,null,null,null,null,null,null,null,null,null,null,null,null,null,null,null,null,null,null,null,null,null,null,null,null,null,null,null,null,null,null,null,null,null,null,null,null,null,null,{"$f":"SUM(D112:BY112)","v":0},"Km confirmés",{"$f":"SUM(D114:BY114)","v":0},null,null,null,null,null,null,null,null,null,null,null,null,null,null,null,null,null,{"$f":"SUM(CC112:CS112)","v":0},"Km confirmés",{"$f":"SUM(CC114:CS114)","v":0},"Km confirmés",{"$f":"SUM(CV112+CB112)","v":0}]
[null,null,null,0,0,0,0,0,0,0,0,0,0,0,0,0,0,0,0,0,0,0,0,0,0,0,0,0,0,0,0,0,0,0,0,0,0,0,0,0,0,0,0,0,0,0,0,0,0,0,0,0,0,0,0,0,0,0,0,0,0,0,0,0,0,0,0,0,0,0,0,0,0,0,0,0,0,null,"Rondes confirmées",{"$f":"SUM(C113:BY113)","v":0},0,0,0,0,0,0,0,0,0,0,0,0,0,0,0,0,0,null,"Rondes confirmées",{"$f":"SUM(CC113:CT113)","v":0},"Rondes confirmées",{"$f":"SUM(CV113+CB113)","v":0}]
[null,null,null,{"$f":"SUM((D111+D112)*D113)","v":0},0,0,0,0,0,0,0,0,0,0,0,0,0,0,0,0,0,0,0,0,0,0,0,0,0,0,0,0,0,0,0,0,0,0,0,0,0,0,0,0,0,0,0,0,0,0,0,0,0,0,0,0,0,0,0,0,{"$f":"SUM((BI111+BI112)*BI113)","v":0},{"$f":"SUM((BJ111+BJ112)*BJ113)","v":0},0,0,0,{"$f":"SUM((BN111+BN112)*BN113)","v":0},0,0,0,0,0,{"$f":"SUM((BT111+BT112)*BT113)","v":0},{"$f":"SUM((BU111+BU112)*BU113)","v":0},{"$f":"SUM((BV111+BV112)*BV113)","v":0},0,0,0,null,"Rondes effectuées",{"$f":"COUNTIF(D111:BY111,\">0\")","v":0},{"$f":"SUM((CC111+CC112)*CC113)","v":0},0,0,0,0,0,0,0,0,0,0,0,0,0,0,0,0,null,"Rondes Effectuées",{"$f":"COUNTIF(CC111:CS111,\">0\")","v":0},"Rondes effectuées",{"$f":"SUM(CV114+CB114)","v":0}]
[28,{"$f":"VLOOKUP(A115,'Numéro licences'!$A$4:$B$32,2)","v":0},"Aller-Retour",null,null,null,null,null,null,null,null,null,null,null,null,null,null,null,null,null,null,null,null,null,null,null,null,null,null,null,null,null,null,null,null,null,null,null,null,null,null,null,null,null,null,null,null,null,null,null,null,null,null,null,null,null,null,null,null,null,null,null,null,null,null,null,null,null,null,null,null,null,null,null,null,null,null,{"$f":"SUM(D115:BY115)","v":0},"Km  renseignés",{"$f":"SUM(BZ115+BZ116)","v":0},null,null,null,null,null,null,null,null,null,null,null,null,null,null,null,null,null,{"$f":"SUM(CC115:CS115)","v":0},"Km  renseignés",{"$f":"SUM(CT115+CT116)","v":0},"Km  renseignés",{"$f":"SUM(CB115+CV115)","v":0}]
[null,null,"Ronde",null,null,null,null,null,null,null,null,null,null,null,null,null,null,null,null,null,null,null,null,null,null,null,null,null,null,null,null,null,null,null,null,null,null,null,null,null,null,null,null,null,null,null,null,null,null,null,null,null,null,null,null,null,null,null,null,null,null,null,null,null,null,null,null,null,null,null,null,null,null,null,null,null,null,{"$f":"SUM(D116:BY116)","v":0},"Km confirmés",{"$f":"SUM(D118:BY118)","v":0},null,null,null,null,null,null,null,null,null,null,null,null,null,null,null,null,null,{"$f":"SUM(CC116:CS116)","v":0},"Km confirmés",{"$f":"SUM(CC118:CS118)","v":0},"Km confirmés",{"$f":"SUM(CV116+CB116)","v":0}]
[null,null,null,0,0,0,0,0,0,0,0,0,0,0,0,0,0,0,0,0,0,0,0,0,0,0,0,0,0,0,0,0,0,0,0,0,0,0,0,0,0,0,0,0,0,0,0,0,0,0,0,0,0,0,0,0,0,0,0,0,0,0,0,0,0,0,0,0,0,0,0,0,0,0,0,0,0,null,"Rondes confirmées",{"$f":"SUM(C117:BY117)","v":0},0,0,0,0,0,0,0,0,0,0,0,0,0,0,0,0,0,null,"Rondes confirmées",{"$f":"SUM(CC117:CT117)","v":0},"Rondes confirmées",{"$f":"SUM(CV117+CB117)","v":0}]
[null,null,null,{"$f":"SUM((D115+D116)*D117)","v":0},0,0,0,0,0,0,0,0,0,0,0,0,0,0,0,0,0,0,0,0,0,0,0,0,0,0,0,0,0,0,0,0,0,0,0,0,0,0,0,0,0,0,0,0,0,0,0,0,0,0,0,0,0,0,0,0,{"$f":"SUM((BI115+BI116)*BI117)","v":0},{"$f":"SUM((BJ115+BJ116)*BJ117)","v":0},0,0,0,{"$f":"SUM((BN115+BN116)*BN117)","v":0},0,0,0,0,0,{"$f":"SUM((BT115+BT116)*BT117)","v":0},{"$f":"SUM((BU115+BU116)*BU117)","v":0},{"$f":"SUM((BV115+BV116)*BV117)","v":0},0,0,0,null,"Rondes effectuées",{"$f":"COUNTIF(D115:BY115,\">0\")","v":0},{"$f":"SUM((CC115+CC116)*CC117)","v":0},0,0,0,0,0,0,0,0,0,0,0,0,0,0,0,0,null,"Rondes Effectuées",{"$f":"COUNTIF(CC115:CS115,\">0\")","v":0},"Rondes effectuées",{"$f":"SUM(CV118+CB118)","v":0}]
[29,{"$f":"VLOOKUP(A119,'Numéro licences'!$A$4:$B$32,2)","v":0},"Aller-Retour",null,null,null,null,null,null,null,null,null,null,null,null,null,null,null,null,null,null,null,null,null,null,null,null,null,null,null,null,null,null,null,null,null,null,null,null,null,null,null,null,null,null,null,null,null,null,null,null,null,null,null,null,null,null,null,null,null,null,null,null,null,null,null,null,null,null,null,null,null,null,null,null,null,null,{"$f":"SUM(D119:BY119)","v":0},"Km  renseignés",{"$f":"SUM(BZ119+BZ120)","v":0},null,null,null,null,null,null,null,null,null,null,null,null,null,null,null,null,null,{"$f":"SUM(CC119:CS119)","v":0},"Km  renseignés",{"$f":"SUM(CT119+CT120)","v":0},"Km  renseignés",{"$f":"SUM(CB119+CV119)","v":0}]
[null,null,"Ronde",null,null,null,null,null,null,null,null,null,null,null,null,null,null,null,null,null,null,null,null,null,null,null,null,null,null,null,null,null,null,null,null,null,null,null,null,null,null,null,null,null,null,null,null,null,null,null,null,null,null,null,null,null,null,null,null,null,null,null,null,null,null,null,null,null,null,null,null,null,null,null,null,null,null,{"$f":"SUM(D120:BY120)","v":0},"Km confirmés",{"$f":"SUM(D122:BY122)","v":0},null,null,null,null,null,null,null,null,null,null,null,null,null,null,null,null,null,{"$f":"SUM(CC120:CS120)","v":0},"Km confirmés",{"$f":"SUM(CC122:CS122)","v":0},"Km confirmés",{"$f":"SUM(CV120+CB120)","v":0}]
[null,null,null,0,0,0,0,0,0,0,0,0,0,0,0,0,0,0,0,0,0,0,0,0,0,0,0,0,0,0,0,0,0,0,0,0,0,0,0,0,0,0,0,0,0,0,0,0,0,0,0,0,0,0,0,0,0,0,0,0,0,0,0,0,0,0,0,0,0,0,0,0,0,0,0,0,0,null,"Rondes confirmées",{"$f":"SUM(C121:BY121)","v":0},0,0,0,0,0,0,0,0,0,0,0,0,0,0,0,0,0,null,"Rondes confirmées",{"$f":"SUM(CC121:CT121)","v":0},"Rondes confirmées",{"$f":"SUM(CV121+CB121)","v":0}]
[null,null,null,{"$f":"SUM((D119+D120)*D121)","v":0},0,0,0,0,0,0,0,0,0,0,0,0,0,0,0,0,0,0,0,0,0,0,0,0,0,0,0,0,0,0,0,0,0,0,0,0,0,0,0,0,0,0,0,0,0,0,0,0,0,0,0,0,0,0,0,0,{"$f":"SUM((BI119+BI120)*BI121)","v":0},{"$f":"SUM((BJ119+BJ120)*BJ121)","v":0},0,0,0,{"$f":"SUM((BN119+BN120)*BN121)","v":0},0,0,0,0,0,{"$f":"SUM((BT119+BT120)*BT121)","v":0},{"$f":"SUM((BU119+BU120)*BU121)","v":0},{"$f":"SUM((BV119+BV120)*BV121)","v":0},0,0,0,null,"Rondes effectuées",{"$f":"COUNTIF(D119:BY119,\">0\")","v":0},{"$f":"SUM((CC119+CC120)*CC121)","v":0},0,0,0,0,0,0,0,0,0,0,0,0,0,0,0,0,null,"Rondes Effectuées",{"$f":"COUNTIF(CC119:CS119,\">0\")","v":0},"Rondes effectuées",{"$f":"SUM(CV122+CB122)","v":0}]
[null,null,"Nat.Pirates-Hors/FMB"]
[null,null,"Inconnu ou non-confirmé"]
[]
[null,null,"Concentres",{"$f":"COUNTIF(D7:D122,D4)","v":58},58,58,58,58,58,58,58,58,58,57,58,58,58,58,58,58,58,0,58,58,58,58,58,58,58,58,58,58,58,58,58,{"$f":"COUNTIF(AJ7:AJ122,AJ4)","v":58},2,58,58,58,58,58,58,58,0,58,58,2,58,58,58,58,58,58,58,58,58,58,58,58,{"$f":"COUNTIF(BI7:BI122,BI4)","v":58},{"$f":"COUNTIF(BJ7:BJ122,BJ4)","v":58},58,58,58,{"$f":"COUNTIF(BN7:BN122,BN4)","v":2},58,58,2,58,58,{"$f":"COUNTIF(BT7:BT122,BT4)","v":58},{"$f":"COUNTIF(BU7:BU122,BU4)","v":58},{"$f":"COUNTIF(BV7:BV122,BV4)","v":58},58,58,58,{"$f":"SUM(D126:BY126)","v":3951},"Concentres",null,{"$f":"COUNTIF(CC7:CC122,CC4)","v":0},58,58,58,58,58,0,0,0,0,0,0,0,0,0,0,0,{"$f":"SUM(CC126:CS126)","v":290},null,null,"Concentres",{"$f":"SUM(CT126+BZ126)","v":4241}]
[null,null,"Rondes",{"$f":"COUNTIF(D8:D123,D5)","v":58},58,58,58,58,58,58,58,58,58,57,58,58,58,58,58,58,58,1,58,58,58,58,0,58,58,0,58,58,58,58,58,{"$f":"COUNTIF(AJ8:AJ123,AJ5)","v":58},57,58,58,58,58,58,58,58,56,58,58,57,58,58,58,58,58,58,58,58,58,58,58,58,{"$f":"COUNTIF(BI8:BI123,BI5)","v":58},{"$f":"COUNTIF(BJ8:BJ123,BJ5)","v":58},58,58,58,{"$f":"COUNTIF(BN8:BN123,BN5)","v":57},58,58,57,58,58,{"$f":"COUNTIF(BT8:BT123,BT5)","v":58},{"$f":"COUNTIF(BU8:BU123,BU5)","v":58},{"$f":"COUNTIF(BV8:BV123,BV5)","v":58},58,58,58,{"$f":"SUM(D127:BY127)","v":4112},"Rondes",null,{"$f":"COUNTIF(CC8:CC123,CC5)","v":3},58,58,58,58,58,0,0,0,0,0,0,0,0,0,0,0,{"$f":"SUM(CC127:CS127)","v":293},null,null,"Rondes",{"$f":"SUM(CT127+BZ127)","v":4405}]
[]
[]
[]
[]
[null,"Colonne1"]
[1,"ALAIMO Rosa"]
[{"$f":"SUM(A133+1)","v":2},"BRIDOUX Jacqueline"]
[{"$f":"SUM(A134+1)","v":3},"COSYNS Carine"]
[4,"DEHAUT Stéphane"]
[5,"GREGORICS Kathy"]
[6,"INGELS Chantal"]
[7,"LAMBILLON Anne"]
[8,"LAMIROY Anne"]
[9,"LEQUEUX Anne"]
[10,"LEROY Laure"]
[11,"PRESTI Rose"]
[12]
[13]
[14]
[15]
[16]
[17]
[18]
[19]
[20]
[21]
[22]
[23]
[24]
[25]
[26]
[27]
[28]
[29]
[30]
[31]
[32]
[33]
[34]
[35]
[36]
[37]
[38]
[39]
[40]
[41]
[42]
[43]
[{"$f":"SUM(A175+1)","v":44}]
[45]
[46]

{"sheet":"Feuil1","index":8,"n_rows":67,"n_cols":8,"rows_kept":67,"cut":false,"hidden":true,"merged":[[68,0,68,3],[0,0,3,0],[0,7,3,7],[5,0,6,1],[5,3,6,3],[5,4,6,5],[66,0,66,3]]}
[null,null,null,"Récapitulatif des licenciés 2022"]
[]
[null,null,null,"Liste mise à jour au 18/02/2022"]
[null,null,null,"Moto Club Saint Servais   713"]
[]
["Nom - Prénom",null,null,"Adresse","Localité"]
[null,null,"Date naiss"]
[]
["Alaimo","Rosa","1969-02-11"," Carrer Llorers , 26","E.08800","Vilanova I La Geltru",null,1]
["Balfroid","Pierre","1962-01-22","Rue Les Fonds , 97",5340,"Gesves"]
["Ballion","Pierre","1978-06-24","Rue de Mosanville , 20",5101,"Namur",null,1]
["Berdoyes","Yannick","1965-12-24","Impasse d'une personne,7",6200,"Chatelet",null,1]
["Briatte","Joelle","1977-11-11","Rue des Forges , 242",1480,"Tubize",null,1]
["Bruneau","Denis Claude","1967-12-17","Rue du Rempart , 55","F.59300","Valencienne"]
["Cappe","Murielle",null,"Chaussée de Louvain, 599",5020,"Champion"]
["Carion ","Sonia",null,"Rue du Try , 17",5300,"Andenne",null,1]
["Dandoy","Antoinne",null,"Rue Muzet , 13",5002,"Saint Servais"]
["Davin","Philippe","1955-02-09","Rue L et V Barre , 47 Bte3",5500,"Dinant",null,1]
["Decelle ","Hubert","1964-01-29","Rue Nouvelle, 30",1340,"Ottignies"]
["Descamps","Geoffrey",null,"Rue Gaston Remson , 39",7050,"Jurbise",null,1]
["De Schepper","Jean Claude","1948-01-17","Avenue des Mésanges , 21",1410,"Waterloo"]
["Desmarée","Francis",null,"Rue G. Genot , 25",5020,"Flawinne",null,1]
["Del Fabbro","Laurence","1970-10-01","Rue du Rempart , 55","F.59300","Valencienne"]
["Demets","Eric","1975-09-03","Rue de la Victoire , 8A",5380,"Noville les Bois"]
["Dewaerseghers","Francis","1954-01-16","Rue des Aulnes , 21",1435,"Mont St Guibert",null,1]
["Dhondt","Jeremy","1961-03-26","Allée du petit Paris , 27",1410,"Waterloo"]
["Dony","Marc","1958-03-25","A Cense Colombier , 35",1400,"Nivelles",null,1]
["Dumont ","Christophe",null,"Rue de la Station , 66A",1360,"Perwez"]
["Erven","France","1956-10-13","Allée des Chevreuils , 113",5600,"Neuville"]
["Favresse ","René",null,"Grand'Place , 10",1360,"Perwez",null,1]
["Fievet","Nathalie","1975-11-07","Rue du Samson , 16",5300,"Thon",null,1]
["Giaux ","Annie","1958-02-07","Rue Nicolas Ansiaux , 8",5300,"Ciney",null,1]
["Goffin","Amaury","1981-05-10","Rue des Forges , 242",1480,"Tubize",null,1]
["Goffin ","Guillaume",null,"Rue des Forges , 242",1480,"Tubize",null,1]
["Gregorics","Katty",null,"Rue Fonds des Marechaux,9",5024,"Marche-L-Dames",null,1]
["Ingels","Chantal","1950-11-03","Avenue des Mésanges , 21",1410,"Waterloo"]
["Jamotte ","Jean","1958-12-09","Chaussée de Namur , 78",5030,"Gembloux",null,1]
["Lambillon ","Anne","1950-12-07","Rue Arnould, 82",5001,"Belgrade",null,1]
["Lambotte ","Didier","1960-05-25","Route de Huy , 22B",5351,"Haillot",null,1]
["Lamiroy"," Anne","1964-02-28","Hotel des Vignes – Les Capitans","F.69840","Julienas",null,1]
["Leroy","Laure","1948-12-18","Zuidlaan, 27",1560,"Hoeilaart",null,1]
["Lescal","Thierry","1962-07-14","Rue Gaston Ragon , 14",5170,"Profondeville",null,1]
["Mallien ","Philippe","1967-11-20","Rue du Samson,16",5300,"Thon",null,1]
["Manzano ","Pascal",null,"Av. du Roi Albert , 75",1120,"Ned-O-Heembeek",null,1]
["Manzano ","Sophie",null,"Av. du Roi Albert , 75",1120,"Ned-O-Heembeek",null,1]
["Mariel","Didier","1963-10-07","Rue de L'Eglise , 65",5030,"Gembloux",null,1]
["Milet","Benoit","1964-11-06","Hotel des Vignes – Les Capitans","F.69840","Julienas",null,1]
["Nicloux ","Christine","1964-11-12","Rue Les Fonds , 97",5340,"Gesves"]
["Nihoul ","Dany","1963-06-12","Rue Fonds des Marechaux,9",5024,"Marche-L-Dames",null,1]
["Ovaere","Jimmy","1982-01-06","Place de la Chapelle , 8",7540,"Tournai",null,1]
["Parmentier","Dominique","1957-12-01","Rue Arnould, 82",5001,"Belgrade",null,1]
["Pirlot"," Francis",null,"Chaussée de Louvain, 599",5020,"Champion"]
["Pochet","Jean Dominique","1950-10-23","Rue Lieutenant Mizzi , 16",1450,"Cortil Noirmont"]
["Pompier","Philippe","1952-08-16","Rue de la Morava, 21",5001,"Belgrade",null,1]
["Pont","Patricia","1965-04-02","Rue Gaston Ragon , 14",5170,"Profondeville",null,1]
["Rameau","Didier",null,"Rue du Try , 17",5300,"Andenne",null,1]
["Spitaels","Bernard","1964-08-20","Allée des Chevreuils , 113",5600,"Neuville"]
["Strypstein","Nicolas","1965-03-26"," Carrer Llorers , 26","E.08800","Vilanova I La Geltru",null,1]
["Terwagne","Freddy",null,"Rue Neuve , 26",6221,"Fleurus"]
["Terwagne","Julien","1985-10-25","Rue du Grenadier , 74",5032,"Corroy le Chateau"]
["Urbain ","Philippe","1973-07-20","Rue Dourlet,83 bte2",6000,"Charleroi",null,1]
["Vanbellingen","Jean-Claude","1948-01-12","Zuidlaan, 27",1560,"Hoeilaart",null,1]
["Vanden Waeyenbergh","Michel","1957-12-04","Chemin Bernard Croix , 49",1325,"Chaumont Gistoux"]
["Vansteyvoort","Andre","1957-01-28","Av. Pois de Senteur , 14",1020,"Bruxelles",null,1]
["Wouters","Olivier","1970-02-14","Av. Alph Allard , 245",1420,"Braine L'Alleud",null,1]
[]
["N° compte F.M.W.B. asbl: 068-2292695-30",null,null,null,null,null,null,{"$f":"SUM(H9:H66)","v":38}]

{"sheet":"Membres couples","index":9,"n_rows":39,"n_cols":10,"rows_kept":39,"cut":false,"hidden":true,"merged":[[6,3,7,3],[6,4,7,4],[6,5,7,5],[6,6,7,6],[6,8,7,8],[0,0,0,9],[4,3,5,3],[4,4,5,4],[4,5,5,5],[4,6,5,6],[8,6,10,6],[8,8,10,8],[11,3,12,3],[11,4,12,4],[11,5,12,5],[8,3,10,3],[8,4,10,4],[8,5,10,5],[13,3,14,3],[13,4,14,4],[13,5,14,5],[13,6,14,6],[13,8,14,8],[18,3,19,3],[18,4,19,4],[18,5,19,5],[18,6,19,6],[15,3,17,3],[15,4,17,4],[15,5,17,5],[20,3,21,3],[20,4,21,4],[20,5,21,5],[28,3,29,3],[28,4,29,4],[28,5,29,5],[28,6,29,6],[22,3,23,3],[22,4,23,4],[22,5,23,5],[22,6,23,6],[24,3,25,3],[24,4,25,4],[24,5,25,5],[24,6,25,6],[24,8,25,8],[26,3,27,3],[26,4,27,4],[26,5,27,5],[26,6,27,6]]}
["LISTE MEMBRES 2023"]
[]
["NOM","PRENOM","DDN","ADRESSE","CP","LOCALITE","TELEPHONE","GSM / Travail","E.MAIL – COURRIER","LICENCE"]
[]
["BRUNEAU","Denis-Claude","1967-12-17","Rue du Rempart,55",59300,"Valenciennes (FR)","0033/327429033","0033/777302057","dc.bruneau@sfr.fr","N"]
["DEL FABBRO","Laurence","1970-10-01",null,null,null,null,"0033/604501854","laurencebdf@gmail.com","N"]
["DE SCHEPPER","Jean-Claude","1948-01-17","Avenue des Mésanges,21",1410,"Waterloo","02/3541642",null,"C","N"]
["INGELS","Chantal","1950-11-03",null,null,null,null,"0476/429868",null,"N"]
["GOFFIN","Amaury","1981-05-10","Rue des Forges,242",1480,"Tubize",null,"0478/355650","amaurygoffin@hotmail.com","N"]
["BRIATTE","Joëlle","1977-11-11",null,null,null,null,"0472/459766",null,"N"]
["GOFFIN","Guillaume","2018-10-12",null,null,null,null,null,null,"N"]
["HINYOT","Thierry","1960-03-27","Avenue du transvaal,122",5020,"Vedrin",null,"0476/994712","th.hinyot@gmail.com","O"]
["DEFAUX","Michèle","1960-09-23",null,null,null,null,"0472/618674","defauxmichele@gmail.com","O"]
["LESCAL","Thierry","1962-07-14","Rue Gaston Ragon,14",5170,"Bois de Villers","081/434956","0471/615897","thierry.lescal@gmail.com","O"]
["PONT","Patricia","1965-04-02",null,null,null,null,"0472/385053",null,"O"]
["MALLIEN","Philippe","1967-11-20","Rue du Samson,16",5300,"Thon-Samson",null,"0495/941414","phil_mallien@hotmail.com","O"]
["FIEVET","Nathalie","1975-11-07",null,null,null,null,"0499/333821","nathfievet@gmail.com","N"]
["MALLIEN","Emelyne","2006-11-29",null,null,null,null,null,null,"N"]
["MANZANO","Pascal","1972-08-20","Avenue du Roi Albert,75",1120,"Bruxelles",null,"0472/092183","manzano.pascal@gmail.com","O"]
["GOUGEUL","Sophie","1972-10-31",null,null,null,null,"0476/218624","sophiemanzano31@gmail.com","O"]
["MILET","Benoit","1964-11-06","Impasse des Capitans,15",69840,"Juliénas (FR)","0033/474044370","0495/509871","president@mcsaintservais.be","O"]
["LAMIROY","Anne","1964-02-28",null,null,null,"0033/630846534","0472/759310","miletbenoit@hotmail.com","N"]
["NIHOUL","Dany","1963-06-12","Fonds des Maréchaux,9",5024,"Marche-Les-Dames","081/581940","0494/815868","nini5024@gmail.com","O"]
["GREGORICS","Katty",null,null,null,null,null,null,"webmaster@motobalade.be","N"]
["PARMENTIER","Dominique","1957-12-01","Rue Arnould,82",5001,"Belgrade","081/739624","0478/472356","dominiqueparmentier@skynet.be","O"]
["LAMBILLON","Anne","1950-12-07",null,null,null,null,null,null,"N"]
["STRYPSTEIN","Nicolas","1965-03-26",null,null,null,null,"0486/899964","n.strypstein@gmail.com","N"]
["ALAIMO","Rosa","1969-02-11",null,null,null,null,"0478/669636","rosa.alaimo@hotmail.com","N"]
["VANBELLINGEN","Jean-Claude","1948-01-12","Zuidlaan,27",1560,"Hoeilaart",null,"0478/888627","vanbellingen@net-c.be","O"]
["LEROY","Laure","1948-12-18",null,null,null,null,"0479/528437","nicla09@hotmail.com","O"]
[null,null,null,null,null,null," "]
[]
[]
[]
[]
[]
[]
[]
[null,null,null,null,null,null," "]

{"sheet":"Membres seuls","index":10,"n_rows":30,"n_cols":10,"rows_kept":30,"cut":false,"hidden":true,"merged":[[0,0,0,9]]}
["LISTE MEMBRES 2023"]
[]
["NOM","PRENOM","DDN","ADRESSE","CP","LOCALITE","TELEPHONE","GSM / Travail","E.MAIL – COURRIER","LICENCE"]
[]
["BALLION","Pierre","1978-06-24","Rue de Mosanville,20",5101,"Lives-sur-Meuse","081/313831","0475/895948","pierre5170@gmail.com","N"]
["BENET","Jean-Pol","1950-09-21","Rue Moncia,12",4218,"Héron",null,"0476/762577","benejepo@hotmail.com","O"]
["BERDOYES","Yannick","1965-12-24","Rue des Ladres,101",6200,"Châtelineau","071/395649","0497/620726","yannick.berdoyes@hotmail.com","O"]
["CARION","Sonia","1962-01-21","Rue de la Citadelle,1a",5372,"Méan",null,"0492/831276","soniacarion6@gmail.com","O"]
["DAVIN","Philippe","1955-02-09","Rue Léopold et Victorien Barré,47 bte3",5500,"Dinant",null,"0474/509704","davinphilippe1@gmail.com","O"]
["DESCAMPS","Geoffrey",null,"Rue Gaston Remson,39",7050,"Masnuy-Saint-Jean",null,"0476/922161","geoffreydescamps@gmail.com","N"]
["DESMAREE","Francis","1958-03-06","Rue Georges Genot,25",5020,"Flawinne",null,"0479/955729","desmaree.francis@gmail.com","O"]
["DEWAERSEGHERS","Francis","1954-01-16","Rue des Aulnes,21",1435,"Mont-Saint-Guibert","010/655584","0485/416538","dewaerseghers@gmail.com","O"]
["DONY","Marc","1958-03-25","Cense du Colombier,35 bte5",1400,"Nivelles",null,"0478/781539","marc.dony@gmail.com","O"]
["D’HONDT","Jerry","1961-12-26","Allée du Petit Paris,27",1410,"Waterloo",null,"0470/529911","jbsa@jerrycare.be","O"]
["FAVRESSE","René","1964-07-02","Grand Place,10",1360,"Perwez",null,"0477/874048","renefavresse@hotmail.com","O"]
["GIAUX","Annie","1958-02-07","Rue Nicolas Ansiaux,8 bte11",5590,"Ciney ",null,"0494/907316","annie.giaux@hotmail.com","O"]
["JAMOTTE","Jean","1958-12-09","Chaussée de Namur,78",5030,"Gembloux","081/614568","0479/610681","jeanjamoto@gmail.com","O"]
["LAMBOTTE","Didier","1960-05-25","Route de Huy,22b",5351,"Haillot","085/616179","0498/844964","d.lambotte@hush.com","N"]
["MARIEL","Didier","1963-10-07","Rue de l'Eglise,65",5030,"Lonzée",null,"0477/555992","didiermariel@hotmail.com","O"]
["NEURAY","Isabelle",null,null,null,null,null,null,null,"N"]
["OVAERE","Jimmy","1981-01-06","Place de la Chapelle,8 ",7540,"Kain",null,"0491/547481","jimmyovaere@live.fr","Sportif"]
["PIERARD","Anne-sophie","1959-12-05","Avenue du Centenaire,59 bte32",1400,"Nivelles",null,"0486/450234","pierardannesophie59@gmail.com","O"]
["PIERARD","Marc",null,null,6111,"Landelies",null,"0475/842555","mpierard@palettesexport@be","N"]
["POMPIER","Philippe","1952-08-16","Rue de la Morava,21",5001,"Belgrade",null,"0478/666962","gwing600@hotmail.com","N"]
["RAMEAU","Didier","1961-03-27","Rue du Try,17",5300,"Thon-Samson",null,"0495/493607","didierrameau@outlook.com","O"]
["SMEETS","Carine","1964-05-06","Rue d’Oleye,97",4300,"Waremme",null,"0473/832568","carine.smeets2@gmail.com","O"]
["URBAIN","Philippe","1973-07-20","Rue Dourlet,83 bte2",6000,"Charleroi",null,"0477/241687","chouille@skynet.be","N"]
["VAN DER BEETEN","Pascal","1961-07-25","Rue du cheval Godet,27",1400,"Nivelles",null,"0473/586728","pascalvanderbeeten@skinet.be","O"]
["VANSTEYVOORT","André","1957-01-28","Avenue Clays,42",1030,"Bruxelles",null,"0475/341151","andre.vansteyvoort@scarlet.be","O"]
["WOUTERS","Olivier","1970-02-14","Avenue Alphonse Allard,245",1420,"Braine-l'Alleud","02/6600072","0486/847678","o.wo@skynet.be","O"]

{"sheet":"Numéro licences 23","index":11,"n_rows":55,"n_cols":5,"rows_kept":55,"cut":false,"hidden":true,"merged":[[0,1,0,3]]}
[null,"LISTE DES NUMEROS DE LICENCE (713/)"]
[null,"NOM","Num. Licence","TYPE","Anciens membres 2022"]
[]
[1,"BALLION Pierre","NON","PIL"]
[2,"BENET Jean-Pol",26887,"PIL"]
[3,"BERDOYES Yannick",19037,"PIL"]
[4,"BRIATTE Joëlle",18595,"PAS"]
[5,"BRUNEAU Denis-Claude","NON","PIL"]
[6,"DAVIN Philippe",19631,"PIL"]
[7,"DEFAUX Michèle",18979,"PAS"]
[8,"DESCAMPS Geoffrey","NON","PIL"]
[9,"DESMAREE Francis",19698,"PIL"]
[10,"DEWAERSEGHERS Francis",20162,"PIL"]
[11,"DEL FABBRO Laurence","NON","PAS"]
[12,"DHONDT Jerry",26377,"PIL"]
[13,"DONY Marc",20151,"PIL"]
[14,"FAVRESSSE René",18519,"PIL"]
[15,"FIEVET Nathalie","NON","PAS"]
[16,"GOFFIN Amaury",18593,"PIL"]
[17,"GOFFIN Guillaume","NON","PAS"]
[18,"GOUGEUL Sophie",24216,"PAS"]
[19,"GREGORICS Kathy","NON","PAS"]
[20,"HINYOT Thierry",18977,"PIL"]
[21,"JAMOTTE Jean",18669,"PIL"]
[22,"LAMBILLON Anne","NON","PAS"]
[23,"LAMBOTTE Didier","NON","PIL"]
[24,"LAMIROY Anne","NON","PAS"]
[25,"LEROY Laure",18484,"PAS"]
[26,"LESCAL Thierry",19633,"PIL"]
[27,"MALLIEN Philippe",18532,"PIL"]
[28,"MALLIEN Emelyne","NON","-"]
[29,"MANZANO Pascal",23677,"PIL"]
[30,"MARIEL Didier",18589,"PIL"]
[31,"MILET Benoit",18739,"PIL"]
[32,"NIHOUL Dany",18497,"PIL"]
[33,"PARMENTIER Dominique",18521,"PIL"]
[34,"PIERARD Anne-Sophie",18475,"PAS"]
[35,"PONT Patricia",19634,"PAS"]
[36,"RAMEAU Didier",25477,"PIL"]
[37,"SMEETS Carine",26383,"PIL"]
[38,"STRYPSTEIN Nicolas","NON","PIL"]
[39,"URBAIN Philippe","NON","PIL"]
[40,"VANBELLINGEN Jean-Claude",20177,"PIL"]
[41,"VAN DER BEETEN Pascal",18499,"PIL"]
[42,"VANSTEYVOORT André",19366,"PIL"]
[43,"WOUTERS Olivier",19074,"PIL"]
[44]
[45]
[46]
[47]
[48]
[49]
[50]
[51]
[52]

{"sheet":"Numéro licences","index":12,"n_rows":93,"n_cols":20,"rows_kept":93,"cut":false,"hidden":false,"merged":[[0,1,0,3]]}
[null,"LISTE DES NUMEROS DE LICENCE (713/)",null,null,null,null,null,null,"LISTE DES NUMEROS DE LICENCE (713/)"]
[]
[null,"NOM","NUMERO","TYPE","Anciens membres 2014",null,null,null,"NOM","NUMERO","TYPE"]
[1,"BRIATTE Joëlle",18595,"PAS","Magenta 3",null,null,1,"BALLION Pierre","NON","PIL",null,1]
[2,"DEFAUX Michèle",18979,"PAS",null,null,null,2,"BENET Jean-Pol",26887,"PIL",null,2,null,null,null,null,"BALLION Pierre","NON","PIL"]
[3,"DEL FABBRO Laurence","NON","PAS",null,null,null,3,"BERDOYES Yannick",19037,"PIL",null,3,null,null,null,null,"BENET Jean-Pol",26887,"PIL"]
[4,"FIEVET Nathalie","NON","PAS",null,null,null,4,"BRUNEAU Denis-Claude","NON","PIL",null,4,null,null,null,null,"BERDOYES Yannick",19037,"PIL"]
[5,"GOFFIN Guillaume","NON","PAS",null,null,null,5,"DAVIN Philippe",19631,"PIL",null,5,null,null,null,null,"BRIATTE Joëlle",18595,"PAS"]
[6,"GOUGEUL Sophie",24216,"PAS",null,null,null,6,"DESCAMPS Geoffrey","NON","PIL",null,6,null,null,null,null,"BRUNEAU Denis-Claude","NON","PIL"]
[7,"GREGORICS Kathy","NON","PAS",null,null,null,7,"DESMAREE Francis",19698,"PIL",null,7,null,null,null,null,"DAVIN Philippe",19631,"PIL"]
[8,"LAMBILLON Anne","NON","PAS",null,null,null,8,"DEWAERSEGHERS Francis",20162,"PIL",null,8,null,null,null,null,"DEFAUX Michèle",18979,"PAS"]
[9,"LAMIROY Anne","NON","PAS",null,null,null,9,"DHONDT Jerry",26377,"PIL",null,9,null,null,null,null,"DESCAMPS Geoffrey","NON","PIL"]
[10,"LEROY Laure",18484,"PAS",null,null,null,10,"DONY Marc",20151,"PIL",null,10,null,null,null,null,"DESMAREE Francis",19698,"PIL"]
[11,"MALLIEN Emelyne","NON","-",null,null,null,11,"FAVRESSSE René",18519,"PIL",null,11,null,null,null,null,"DEWAERSEGHERS Francis",20162,"PIL"]
[12,"PIERARD Anne-Sophie",18475,"PAS",null,null,null,12,"GOFFIN Amaury",18593,"PIL",null,12,null,null,null,null,"DEL FABBRO Laurence","NON","PAS"]
[13,"PONT Patricia",19634,"PAS",null,null,null,13,"HINYOT Thierry",18977,"PIL",null,13,null,null,null,null,"DHONDT Jerry",26377,"PIL"]
[14,"MISEUR Carine",null,null,null,null,null,14,"JAMOTTE Jean",18669,"PIL",null,14,null,null,null,null,"DONY Marc",20151,"PIL"]
[15,"ARENZANA Jennifer",null,null,null,null,null,15,"LAMBOTTE Didier","NON","PIL",null,15,null,null,null,null,"FAVRESSSE René",18519,"PIL"]
[16,null,null,null,null,null,null,16,"LESCAL Thierry",19633,"PIL",null,16,null,null,null,null,"FIEVET Nathalie","NON","PAS"]
[17,null,null,null,null,null,null,17,"MALLIEN Philippe",18532,"PIL",null,17,null,null,null,null,"GOFFIN Amaury",18593,"PIL"]
[null,null,null,null,null,null,null,18,"MANZANO Pascal",23677,"PIL",null,18,null,null,null,null,"GOFFIN Guillaume","NON","PAS"]
[null,null,null,null,null,null,null,19,"MARIEL Didier",18589,"PIL",null,19,null,null,null,null,"GOUGEUL Sophie",24216,"PAS"]
[null,null,null,null,null,null,null,20,"MILET Benoit",18739,"PIL",null,20,null,null,null,null,"GREGORICS Kathy","NON","PAS"]
[null,null,null,null,null,null,null,21,"NIHOUL Dany",18497,"PIL",null,21,null,null,null,null,"HINYOT Thierry",18977,"PIL"]
[null,null,null,null,null,null,null,22,"PARMENTIER Dominique",18521,"PIL",null,22,null,null,null,null,"JAMOTTE Jean",18669,"PIL"]
[null,null,null,null,null,null,null,23,"RAMEAU Didier",25477,"PIL",null,23,null,null,null,null,"LAMBILLON Anne","NON","PAS"]
[null,null,null,null,null,null,null,24,"SMEETS Carine",26383,"PIL",null,24,null,null,null,null,"LAMBOTTE Didier","NON","PIL"]
[null,null,null,null,null,null,null,25,"STRYPSTEIN Nicolas","NON","PIL",null,25,null,null,null,null,"LAMIROY Anne","NON","PAS"]
[null,null,null,null,null,null,null,26,"URBAIN Philippe","NON","PIL",null,26,null,null,null,null,"LEROY Laure",18484,"PAS"]
[null,null,null,null,null,null,null,27,"VANBELLINGEN Jean-Claude",20177,"PIL",null,27,null,null,null,null,"LESCAL Thierry",19633,"PIL"]
[null,null,null,null,null,null,null,28,"VAN DER BEETEN Pascal",18499,"PIL",null,28,null,null,null,null,"MALLIEN Philippe",18532,"PIL"]
[null,null,null,null,null,null,null,29,"VANSTEYVOORT André",19366,"PIL",null,29,null,null,null,null,"MALLIEN Emelyne","NON","PAS"]
[null,null,null,null,null,null,null,30,"WOUTERS Olivier",19074,"PIL",null,30,null,null,null,null,"MANZANO Pascal",23677,"PIL"]
[null,null,null,null,null,null,null,31,"THIRIFAYS Vincent",null,null,null,31,null,null,null,null,"MARIEL Didier",18589,"PIL"]
[null,null,null,null,null,null,null,32,"VANDY Rudi",null,null,null,32,null,null,null,null,"MILET Benoit",18739,"PIL"]
[null,null,null,null,null,null,null,33,"LEFRANT Sébastien",null,null,null,33,null,null,null,null,"NIHOUL Dany",18497,"PIL"]
[null,null,null,null,null,null,null,34,null,null,null,null,34,null,null,null,null,"PARMENTIER Dominique",18521,"PIL"]
[null,null,null,null,null,null,null,35,null,null,null,null,35,null,null,null,null,"PIERARD Anne-Sophie",18475,"PAS"]
[null,null,null,null,null,null,null,36,null,null,null,null,36,null,null,null,null,"PONT Patricia",19634,"PAS"]
[null,null,null,null,null,null,null,37,null,null,null,null,37,null,null,null,null,"RAMEAU Didier",25477,"PIL"]
[null,null,null,null,null,null,null,38,null,null,null,null,38,null,null,null,null,"SMEETS Carine",26383,"PIL"]
[null,null,null,null,null,null,null,39,null,null,null,null,39,null,null,null,null,"STRYPSTEIN Nicolas","NON","PIL"]
[null,null,null,null,null,null,null,40,null,null,null,null,40,null,null,null,null,"URBAIN Philippe","NON","PIL"]
[null,null,null,null,null,null,null,null,null,null,null,null,41,null,null,null,null,"VANBELLINGEN Jean-Claude",20177,"PIL"]
[null,null,null,null,null,null,null,null,null,null,null,null,42,null,null,null,null,"VAN DER BEETEN Pascal",18499,"PIL"]
[null,null,null,null,null,null,null,null,null,null,null,null,43,null,null,null,null,"VANSTEYVOORT André",19366,"PIL"]
[null,"Colonne1","Colonne2","Colonne3",null,null,null,null,null,null,null,null,null,null,null,null,null,"WOUTERS Olivier",19074,"PIL"]
[1,"BALLION Pierre","NON","PIL"]
[2,"BENET Jean-Pol",26887,"PIL"]
[3,"BERDOYES Yannick",19037,"PIL"]
[4,"BRIATTE Joëlle",18595,"PAS"]
[5,"BRUNEAU Denis-Claude","NON","PIL"]
[6,"DAVIN Philippe",19631,"PIL"]
[7,"DEFAUX Michèle",18979,"PAS"]
[8,"DESCAMPS Geoffrey","NON","PIL"]
[9,"DESMAREE Francis",19698,"PIL"]
[10,"DEWAERSEGHERS Francis",20162,"PIL"]
[11,"DEL FABBRO Laurence","NON","PAS"]
[12,"DHONDT Jerry",26377,"PIL"]
[13,"DONY Marc",20151,"PIL"]
[14,"FAVRESSSE René",18519,"PIL"]
[15,"FIEVET Nathalie","NON","PAS"]
[16,"GOFFIN Amaury",18593,"PIL"]
[17,"GOFFIN Guillaume","NON","PAS"]
[18,"GOUGEUL Sophie",24216,"PAS"]
[19,"GREGORICS Kathy","NON","PAS"]
[20,"HINYOT Thierry",18977,"PIL"]
[21,"JAMOTTE Jean",18669,"PIL"]
[22,"LAMBILLON Anne","NON","PAS"]
[23,"LAMBOTTE Didier","NON","PIL"]
[24,"LAMIROY Anne","NON","PAS"]
[25,"LEROY Laure",18484,"PAS"]
[26,"LESCAL Thierry",19633,"PIL"]
[27,"MALLIEN Philippe",18532,"PIL"]
[28,"MALLIEN Emelyne","NON","PAS"]
[29,"MANZANO Pascal",23677,"PIL"]
[30,"MARIEL Didier",18589,"PIL"]
[31,"MILET Benoit",18739,"PIL"]
[32,"NIHOUL Dany",18497,"PIL"]
[33,"PARMENTIER Dominique",18521,"PIL"]
[34,"PIERARD Anne-Sophie",18475,"PAS"]
[35,"PONT Patricia",19634,"PAS"]
[36,"RAMEAU Didier",25477,"PIL"]
[37,"SMEETS Carine",26383,"PIL"]
[38,"STRYPSTEIN Nicolas","NON","PIL"]
[39,"URBAIN Philippe","NON","PIL"]
[40,"VANBELLINGEN Jean-Claude",20177,"PIL"]
[41,"VAN DER BEETEN Pascal",18499,"PIL"]
[42,"VANSTEYVOORT André",19366,"PIL"]
[43,"WOUTERS Olivier",19074,"PIL"]
[44]
[45]
[46]

{"sheet":"Kilomètre AR","index":13,"n_rows":68,"n_cols":16,"rows_kept":68,"cut":false,"hidden":true,"merged":[]}
[0,"RONDE FMB",0,0,null,"Club","A","AR"]
[103,"KAMC HERENTALS",133,266,null,"103  KAMC HERENTALS",95,190,null,"103  KAMC HERENTALS",95,190,null,"103  KAMC HERENTALS",133,266]
[107,"KAMV MORTSEL",101,202,null,"126  MTC TOERVRIENDEN  Brasschaat",109,218,null,"126  MTC TOERVRIENDEN  Berendrecht",120,240,null,"107  KAMV MORTSEL",101,202]
[123,"MC LILLE",135,270,null,"136  MTC AMIGO'S   Schoten",104,208,null,"136  MTC AMIGO'S   Schoten",104,208,null,"123  MC LILLE",135,270]
[126,"MTC TOERVRIENDEN  Berendrecht",127,254,null,"137  MTC YELLS ARMY   Berchem",96,192,null,"137  MTC YELLS ARMY   Berchem",96,192,null,"126  MTC TOERVRIENDEN  Berendrecht",127,254]
[136,"MTC AMIGO'S   Schoten",112,224,null,"138  MC TIGRIS PANTERA  Brasschaat",109,218,null,"138  MC TIGRIS PANTERA  Brasschaat",109,218,null,"136  MTC AMIGO'S   Schoten",112,224]
[137,"MTC YELLS ARMY   Berchem",102,204,null,"206  MC L'EQUIPE  Bruxelles",58,116,null,"206  MC L'EQUIPE  Nivelles",41,82,null,"137  MTC YELLS ARMY   Berchem",102,204]
[138,"MC TIGRIS PANTERA  Brasschaat",117,234,null,"223  RMU WAVRIEN",34,68,null,"223  RMU WAVRIEN",34,68,null,"138  MC TIGRIS PANTERA  Brasschaat",117,234]
[223,"RMU WAVRIEN",40,80,null,"228  RMC PIERREUX  Mt St Guibert",28,56,null,"228  RMC PIERREUX  Mt St Guibert",28,56,null,"223  RMU WAVRIEN",40,80]
[228,"RMC PIERREUX  Mt St Guibert",27,54,null,"243  MACADAM BOYS    Bruxelles",58,116,null,"243  MACADAM BOYS    Bruxelles",58,116,null,"228  RMC PIERREUX  Mt St Guibert",27,54]
[306,"CIRCUIT DE CHIMAY",93,186,null,"306  CIRCUIT DE CHIMAY",74,148,null,"306  CIRCUIT DE CHIMAY",74,148,null,"306  CIRCUIT DE CHIMAY",93,186]
[312,"MC RESSAIX",66,132,null,"312  MC RESSAIX",52,104,null,"312  MC RESSAIX",52,104,null,"312  MC RESSAIX",66,132]
[317,"MC CADRE BLANC HAUTRAGE",84,168,null,"317  MC CADRE BLANC HAUTRAGE",81,162,null,"317  MC CADRE BLANC HAUTRAGE",81,162,null,"317  MC CADRE BLANC HAUTRAGE",84,168]
[327,"MCC BEAUMONT   Beaumont",67,134,null,"332  MC BUTZ BIKERS 95   Ecaussinnes",54,108,null,"327  MCC BEAUMONT   Beaumont",59,118,null,"327  MCC BEAUMONT   Beaumont",67,134]
[332,"MC BUTZ BIKERS 95   Ecaussinnes",59,118,null,"406  RAMC EUPEN",97,194,null,"332  MC BUTZ BIKERS 95   Ecaussinnes",54,108,null,"332  MC BUTZ BIKERS 95   Ecaussinnes",59,118]
[335,"ENDURO CLUB TOURNAI",120,240,null,"417  AMC RAC JUNIOR  Liège",62,124,null,"336  MC SPIRIT OF V TWIN   Châtelet",31,62,null,"335  ENDURO CLUB TOURNAI",120,240]
[406,"RAMC EUPEN",105,210,null,"419  AMC ST VITH",131,262,null,"406  RAMC EUPEN",97,194,null,"406  RAMC EUPEN",105,210]
[419,"AMC ST VITH",142,284,null,"422  MC THEUX-FRANCHIMONT",83,166,null,"417  AMC RAC JUNIOR  Liège",62,124,null,"419  AMC ST VITH",142,284]
[424,"RMC VERVIETOIS",97,194,null,"424  RMC VERVIETOIS",88,176,null,"419  AMC ST VITH",131,262,null,"424  RMC VERVIETOIS",97,194]
[426,"MTC WELKENRAEDT",102,204,null,"426  MTC WELKENRAEDT",93,186,null,"422  MC THEUX-FRANCHIMONT",83,166,null,"426  MTC WELKENRAEDT",102,204]
[427,"MC ZEBUS",59,118,null,"427  MC ZEBUS  Flémalle",52,104,null,"424  RMC VERVIETOIS",88,176,null,"427  MC ZEBUS  Flémalle",59,118]
[446,"MC PAYS DE HERVE",94,188,null,"438  MC DUREN   Elsenborn",127,254,null,"426  MTC WELKENRAEDT",93,186,null,"446  MC PAYS DE HERVE  Thimister-Clermont",94,188]
[508,"AMC KOERSEL",130,260,null,"445  MC INDIAN SPIRIT BELGIUM Cheratte",70,140,null,"427  MC ZEBUS  Flémalle",52,104,null,"508  AMC KOERSEL",130,260]
[516,"MC LOTUS",80,160,null,"454  MC ARIZONABIKERS  Andrimont",90,180,null,"438  MC DUREN   Elsenborn",127,254,null,"516  MC LOTUS  Bilzen",80,160]
[531,"MC HOESELT",93,186,null,"508  AMC KOERSEL",88,176,null,"445  MC INDIAN SPIRIT BELGIUM Cheratte",70,140,null,"531  MC HOESELT",93,186]
[533,"MTC 13  Leopoldsburg",134,268,null,"516  MC LOTUS  Bilzen",74,148,null,"446  MC PAYS DE HERVE  Thimister-Clermont",85,170,null,"533  MTC 13  Leopoldsburg",134,268]
[549,"MTC WELLEN",78,156,null,"531  MC HOESELT",70,140,null,"454  MC ARIZONABIKERS  Andrimont",90,180,null,"549  MTC WELLEN   Wellen",78,156]
[614,"MC CHEVY RACING   Libramont-Chevigny",87,174,null,"533  MTC 13  Leopoldsburg",92,184,null,"508  AMC KOERSEL",88,176,null,"614  MC CHEVY RACING   Libramont-Chevigny",87,174]
[617,"MC GRANDS DUCS   Martelange",111,222,null,"549  MTC WELLEN   Wellen",65,130,null,"516  MC LOTUS  Bilzen",74,148,null,"617  MC GRANDS DUCS   Martelange",111,222]
[622,"MC DÜREN",140,280,null,"614  MC CHEVY RACING   Libramont-Chevigny",81,162,null,"531  MC HOESELT",70,140,null,"622  MC DÜREN",140,280]
[703,"R CINEY MC",34,68,null,"617  MC GRANDS DUCS   Martelange",109,218,null,"533  MTC 13  Leopoldsburg",92,184,null,"703  R CINEY MC",34,68]
[705,"MC DINANT",43,86,null,"703  R CINEY MC",30,60,null,"549  MTC WELLEN   Wellen",65,130,null,"705  MC DINANT  Sinsin",43,86]
[709,"RUMESM METTET",26,52,null,"705  MC DINANT",30,60,null,"614  MC CHEVY RACING   Libramont-Chevigny",81,162,null,"709  RUMESM METTET",26,52]
[710,"MC MOLIGNARD",9,18,null,"709  RUMESM METTET",27,54,null,"617  MC GRANDS DUCS   Martelange",109,218,null,"710  MC MOLIGNARD  Wépion",9,18]
[712,"AMC EAU NOIRE  Nismes",82,164,null,"710  MC MOLIGNARD  Warnant",26,52,null,"703  R CINEY MC",30,60,null,"712  AMC EAU NOIRE  Nismes",82,164]
[713,"MC ST SERVAIS",0,0,null,"712  AMC EAU NOIRE  Nismes",63,126,null,"705  MC DINANT   Sinsin",30,60,null,"713  MC ST SERVAIS",0,0]
[716,"AMC FLOREFFE",9,18,null,"713  MC ST SERVAIS",0,0,null,"709  RUMESM METTET",27,54,null,"716  AMC FLOREFFE",9,18]
[721,"MC LES PETITS GRIS   Warisoulx",10,20,null,"716  AMC FLOREFFE",10,20,null,"710  MC MOLIGNARD  Warnant",26,52,null,"721  MC LES PETITS GRIS   Warisoulx",10,20]
[726,"MC BIKE AND TRIKE BELGIUM  Dhuy",17,34,null,"721  MC LES PETITS GRIS   Warisoulx",10,20,null,"712  AMC EAU NOIRE  Nismes",63,126,null,"726  MC BIKE AND TRIKE BELGIUM  Dhuy",17,34]
[729,"VIROINVAL MOTOR SPORT Dourbes",82,164,null,"726  MC BIKE AND TRIKE BELGIUM  Dhuy",17,34,null,"713  MC ST SERVAIS",0,0,null,"729  VIROINVAL MOTOR SPORT Dourbes",82,164]
[730,"MC LES 4 & CO  Assesse",22,44,null,"729  VIROINVAL MOTOR SPORT Dourbes",62,124,null,"716  AMC FLOREFFE",10,20,null,"730  MC LES 4 & CO  Assesse",22,44]
[806,"MC SCHELDELAND  Wichelen",111,222,null,"730  MC LES 4 & CO  Assesse",19,38,null,"721  MC LES PETITS GRIS   Warisoulx",10,20,null,"806  MC SCHELDELAND  Wichelen",111,222]
[810,"BMW MC VLAANDEREN  Lede",106,212,null,"806  MC SCHELDELAND  Wichelen",97,194,null,"726  MC BIKE AND TRIKE BELGIUM  Dhuy",17,34,null,"810  BMW MC VLAANDEREN  Lede",106,212]
[813,"MOTORSPORT   Aalst",102,204,null,"810  BMW MC VLAANDEREN  Lede",92,184,null,"729  VIROINVAL MOTOR SPORT Dourbes",62,124,null,"813  MOTORSPORT   Aalst",102,204]
[900,"Randonnée Amitié","?",null,null,"813  MOTORSPORT   Aalst",88,176,null,"730  MC LES 4 & CO  Assesse",19,38,null,"818  MTC VLAANDEREN   Aalst",102,204]
[902,"AMC GIJVERINKHOVE",197,394,null,"818  MTC VLAANDEREN   Aalst",88,176,null,"806  MC SCHELDELAND  Wichelen",97,194,null,"902  AMC GIJVERINKHOVE",197,394]
[903,"AMSC LEIELAND  Wervik",166,332,null,"Randonnée Amitié","?",null,null,"810  BMW MC VLAANDEREN  Lede",92,184,null,"903  AMSC LEIELAND  Wervik",166,332]
[904,"KAMC MENEN",155,310,null,"902  AMC GIJVERINKHOVE",190,380,null,"813  MOTORSPORT   Aalst",88,176,null,"904  KAMC MENEN",155,310]
[907,"KV OSTEND MS",184,368,null,"903  AMSC LEIELAND  Wervik",148,296,null,"818  MTC VLAANDEREN   Aalst",88,176,null,"907  KV OSTEND MS",184,368]
[908,"AMC POPERINGE",188,376,null,"904  KAMC MENEN",148,296,null,"902  AMC GIJVERINKHOVE",190,380,null,"908  AMC POPERINGE",188,376]
[910,"AMC EENDRACHT TORHOUT",176,352,null,"907  KV OSTEND MS",172,344,null,"903  AMSC LEIELAND  Wervik",148,296,null,"910  AMC EENDRACHT TORHOUT",176,352]
[912,"MTC ZEDELGEM",169,338,null,"908  AMC POPERINGE",178,356,null,"904  KAMC MENEN",148,296,null,"912  MTC ZEDELGEM",169,338]
[920,"WESTHOEK BIKERS  Houtem",208,416,null,"910  AMC EENDRACHT TORHOUT",162,324,null,"907  KV OSTEND MS",172,344,null,"920  WESTHOEK BIKERS  Houtem",208,416]
[921,"MTC VRIJBOS   Houthulst",187,374,null,"912  MTC ZEDELGEM",156,312,null,"908  AMC POPERINGE",178,356,null,"921  MTC VRIJBOS   Houthulst",187,374]
[923,"VESPA CLUB OOSTENDE",184,368,null,"920  WESTHOEK BIKERS  Houtem",193,386,null,"910  AMC EENDRACHT TORHOUT",162,324,null,"923  VESPA CLUB OOSTENDE",184,368]
[1000,"FREE",1000,null,null,"921  MTC VRIJBOS   Houthulst",172,344,null,"912  MTC ZEDELGEM",156,312]
[2000,null,null,null,null,"922  MTC REDBONE  Wevezele",146,292,null,"920  WESTHOEK BIKERS  Houtem",193,386]
[null,null,null,null,null,null,null,0,null,"921  MTC VRIJBOS   Houthulst",172,344]
[null,null,null,null,null,null,null,0,null,"922  MTC REDBONE  Wevezele",146,292]
[null,null,null,null,null,null,null,0,null,"923  VESPA CLUB OOSTENDE",172,344]
[null,null,null,null,null,null,null,0]
[null,null,null,null,null,null,null,0]
[null,null,null,null,null,null,null,0]
[null,null,null,null,null,null,null,0]
[null,null,null,null,null,null,null,0]
[null,null,null,null,null,null,null,0]
[null,null,null,null,null,null,null,0]
[null,null,null,null,null,null,null,0]