{"text_format":"1","workbook":"xlsx","n_sheets":15,"sheets":["Classements","Classements non-confirmé","Résumé Pilotes","Résumé Passagers","Pilotes Nat","Passagers Nat","Pilotes Inter","Passagers Inter","Résumés","Numéro licences","2020-02-28","A","Numéro licences (2)","Numéro licences (3)","Kilomètre AR"],"not_rendered":{"charts":0,"images":2,"macros":1,"external_links":0,"defined_names":21,"comments":0,"pivot_tables":0},"unopened":[],"bounds":{"document_bytes":16777216,"sheet_cells":100000,"rows_first":2000,"rows_last":500,"rows_between":2000,"halvings":0,"cell_chars":16384,"cell_head_chars":4096},"cells_cut":0,"cells_raw":0,"read":"whole","date_system":"1900"}

{"sheet":"Classements","index":0,"n_rows":51,"n_cols":11,"rows_kept":51,"cut":false,"hidden":false,"merged":[[37,7,38,10]]}
[null,"Pilotes","NAT","INT","SCRATCH",null,null,"Passagers","Nat","Inter","Scratch"]
[1,"LESCAL Thierry",8518,0,8518,null,1,"PONT Patricia",8518,0,8518]
[2,"JAMOTTE Jean",8023,1470,9493,null,2,"GREGORICS Kathy",0,1462,1462]
[3,"NIHOUL Dany",5197,1462,6659,null,3,"DEL FABBRO Laurence",0,1379,1379]
[4,"WOUTERS Olivier",4681,0,4681,null,4,"LAMIROY Anne",0,532,532]
[5,"DAVIN Philippe",4300,1407,5707,null,5,"BRIATTE Joëlle",0,0,0]
[6,"PARMENTIER Dominique",564,0,564,null,6,"ERVEN France",0,0,0]
[7,"DONY Marc",0,2682,2682,null,7,"FIEVET Nathalie",0,0,0]
[8,"URBAIN Philippe",0,1417,1417,null,8,"GIAUX Annie",0,0,0]
[9,"BRUNEAU Denis-Claude",0,1379,1379,null,9,"GOFFIN Guillaume",0,0,0]
[10,"MILET Benoit",0,532,532,null,10,"GRIGNET Audrey",0,0,0]
[11,"BALFROID Pierre",0,0,0,null,11,"LAMBILLON Anne",0,0,0]
[12,"BALLION Pierre",0,0,0,null,12,"LEROY Laure",0,0,0]
[13,"BERDOYES Bruno",0,0,0,null,13,"NICLOUX Christine",0,0,0]
[14,"BERDOYES Yannick",0,0,0,null,14,"THOMAS Isabelle",0,0,0]
[15,"DE SCHEPPERS Jean-Claude",0,0,0,null,15,0,0,0,0]
[16,"DECUYPER Frédéric",0,0,0,null,16,0,0,0,0]
[17,"DEWAERSEGHERS Francis",0,0,0,null,17,0,0,0,0]
[18,"DHONDT Jerry",0,0,0,null,18,0,0,0,0]
[19,"DUMONT Christophe",0,0,0,null,19,0,0,0,0]
[20,"FAVRESSSE René",0,0,0,null,20,0,0,0,0]
[21,"GOFFIN Amaury",0,0,0,null,21,0,0,0,0]
[22,"LAMBOTTE Didier",0,0,0,null,22,0,0,0,0]
[23,"LEFEVRE Francis",0,0,0,null,23,0,0,0,0]
[24,"MALLIEN Philippe",0,0,0,null,24,0,0,0,0]
[25,"MARIEL Didier",0,0,0,null,25,0,0,0,0]
[26,"OVAERE Jimmy",0,0,0,null,26,0,0,0,0]
[27,"POCHET Jean-Dominique",0,0,0,null,27,0,0,0,0]
[28,"POMPIER Philippe",0,0,0,null,28,0,0,0,0]
[29,"RAMEAU Didier",0,0,0,null,29,0,0,0,0]
[30,"SPITAELS Bernard",0,0,0,null,null,null,{"$f":"SUM(K2:K30)","v":11891},{"$f":"SUM(J2:J30)","v":3373},{"$f":"SUM(I31:J31)","v":15264}]
[31,"TERWAGNE Freddy",0,0,0,null,null,null,{"$f":"SUM(I31/K31)","v":0.779022536687631},{"$f":"SUM(J31/K31)","v":0.22097746331236898}]
[32,"TERWAGNE Julien",0,0,0,null,null,null,"NAT","INT"]
[33,"THOMAS Isabelle",0,0,0]
[34,"VANBELLINGEN Jean-Claude",0,0,0]
[35,"VANDEN BOSSCHE Vincent",0,0,0]
[36,"VANDEN WAEYENBERGH Michel",0,0,0]
[37,"VANSTEYVOORT André",0,0,0,null,null,"Classements vérifiés"]
[38,"DEMETS Eric",0,0,0]
[39,"DECELLE Hubert",0,0,0]
[40,0,0,0,0]
[41,0,0,0,0]
[42,0,0,0,0]
[43,0,0,0,0]
[44,0,0,0,0]
[45,0,0,0,0]
[46,0,0,0,0]
[]
[null,null,{"$f":"SUM(C2:C48)","v":31283},{"$f":"SUM(D2:D48)","v":10349},{"$f":"SUM(E2:E48)","v":41632}]
[null,null,{"$f":"SUM(C49/E49)","v":0.75141717909300543},{"$f":"SUM(D49/E49)","v":0.24858282090699463}]
[null,null,"NAT","INT"]

{"sheet":"Classements non-confirmé","index":1,"n_rows":51,"n_cols":11,"rows_kept":51,"cut":false,"hidden":false,"merged":[]}
[" ","Pilotes","NAT","INT","SCRATCH",null,null,"Passagers","Nat","Inter","Scratch"]
[1,"LESCAL Thierry",8518,0,8518,null,1,"PONT Patricia",8518,0,8518]
[2,"JAMOTTE Jean",8023,1470,9493,null,2,"GREGORICS Kathy",200,1462,1662]
[3,"NIHOUL Dany",5197,1462,6659,null,3,"DEL FABBRO Laurence",200,1379,1579]
[4,"WOUTERS Olivier",4681,0,4681,null,4,"GIAUX Annie",846,0,846]
[5,"DAVIN Philippe",4300,1407,5707,null,5,"LAMIROY Anne",0,532,532]
[6,"DONY Marc",2338,2682,5020,null,6,"ERVEN France",517,0,517]
[7,"DHONDT Jerry",2096,0,2096,null,7,"LAMBILLON Anne",200,0,200]
[8,"RAMEAU Didier",1311,0,1311,null,8,"LEROY Laure",112,0,112]
[9,"VANBELLINGEN Jean-Claude",863,0,863,null,9,"BRIATTE Joëlle",0,0,0]
[10,"MARIEL Didier",808,0,808,null,10,"FIEVET Nathalie",0,0,0]
[11,"FAVRESSSE René",751,0,751,null,11,"GOFFIN Guillaume",0,0,0]
[12,"DEMETS Eric",751,0,751,null,12,"GRIGNET Audrey",0,0,0]
[13,"DECELLE Hubert",751,0,751,null,13,"NICLOUX Christine",0,0,0]
[14,"DEWAERSEGHERS Francis",589,0,589,null,14,"THOMAS Isabelle",0,0,0]
[15,"PARMENTIER Dominique",564,0,564,null,15,0,0,0,0]
[16,"SPITAELS Bernard",517,0,517,null,16,0,0,0,0]
[17,"BALLION Pierre",200,0,200,null,17,0,0,0,0]
[18,"BERDOYES Yannick",200,0,200,null,18,0,0,0,0]
[19,"BRUNEAU Denis-Claude",200,1379,1579,null,19,0,0,0,0]
[20,"MALLIEN Philippe",200,0,200,null,20,0,0,0,0]
[21,"VANSTEYVOORT André",200,0,200,null,21,0,0,0,0]
[22,"URBAIN Philippe",156,1417,1573,null,22,0,0,0,0]
[23,"BALFROID Pierre",0,0,0,null,23,0,0,0,0]
[24,"BERDOYES Bruno",0,0,0,null,24,0,0,0,0]
[25,"DE SCHEPPERS Jean-Claude",0,0,0,null,25,0,0,0,0]
[26,"DECUYPER Frédéric",0,0,0,null,26,0,0,0,0]
[27,"DUMONT Christophe",0,0,0,null,27,0,0,0,0]
[28,"GOFFIN Amaury",0,0,0,null,28,0,0,0,0]
[29,"LAMBOTTE Didier",0,0,0,null,29,0,0,0,0]
[30,"LEFEVRE Francis",0,0,0,null,null,null,{"$f":"SUM(K2:K30)","v":13966},{"$f":"SUM(J2:J30)","v":3373},{"$f":"SUM(I31:J31)","v":17339}]
[31,"MILET Benoit",0,532,532,null,null,null,{"$f":"SUM(I31/K31)","v":0.80546744333583253},{"$f":"SUM(J31/K31)","v":0.19453255666416749}]
[32,"OVAERE Jimmy",0,0,0,null,null,null,"NAT","INT"]
[33,"POCHET Jean-Dominique",0,0,0]
[34,"POMPIER Philippe",0,0,0]
[35,"TERWAGNE Freddy",0,0,0]
[36,"TERWAGNE Julien",0,0,0]
[37,"THOMAS Isabelle",0,0,0]
[38,"VANDEN BOSSCHE Vincent",0,0,0]
[39,"VANDEN WAEYENBERGH Michel",0,0,0]
[40,0,0,0,0]
[41,0,0,0,0]
[42,0,0,0,0]
[43,0,0,0,0]
[44,0,0,0,0]
[45,0,0,0,0]
[46,0,0,0,0]
[]
[null,null,{"$f":"SUM(C2:C48)","v":43214},{"$f":"SUM(D2:D48)","v":10349},{"$f":"SUM(E2:E48)","v":53563}]
[null,null,{"$f":"SUM(C49/E49)","v":0.80678826802083525},{"$f":"SUM(D49/E49)","v":0.19321173197916472}]
[null,null,"NAT","INT"]

{"sheet":"Résumé Pilotes","index":2,"n_rows":246,"n_cols":24,"rows_kept":246,"cut":false,"hidden":false,"merged":[[186,1,189,1],[166,1,169,1],[170,1,173,1],[174,1,177,1],[178,1,181,1],[182,1,185,1],[146,1,149,1],[150,1,153,1],[154,1,157,1],[158,1,161,1],[162,1,165,1],[126,1,129,1],[130,1,133,1],[134,1,137,1],[138,1,141,1],[142,1,145,1],[106,1,109,1],[110,1,113,1],[114,1,117,1],[118,1,121,1],[122,1,125,1],[86,1,89,1],[90,1,93,1],[94,1,97,1],[98,1,101,1],[102,1,105,1],[66,1,69,1],[70,1,73,1],[74,1,77,1],[78,1,81,1],[82,1,85,1],[46,1,49,1],[50,1,53,1],[54,1,57,1],[58,1,61,1],[62,1,65,1],[26,1,29,1],[30,1,33,1],[34,1,37,1],[38,1,41,1],[42,1,45,1],[6,1,9,1],[10,1,13,1],[14,1,17,1],[18,1,21,1],[22,1,25,1],[4,20,5,23],[4,3,4,4],[4,6,4,7],[4,9,4,10],[0,3,0,11],[4,14,5,17]]}
[null,null,null,"PILOTES"]
[]
[]
[null,"Aller-Retour",null,null,null,null,null,null,null,null,null,"Aller-Retour"]
[null,"Ronde",null,"NATIONAL",null,null,"INTERNATIONAL",null,null,"SCRATCH",null,"Ronde",null,null,"Confirmé",null,null,null,null,null,"Non-confirmé"]
[null,null,null,null,"TOTAL",null,null,"TOTAL",null,null,"TOTAL"]
[1,{"$f":"VLOOKUP(A7,'Numéro licences'!$H$4:$I$47,2)","v":"BALFROID Pierre"},"Aller-Retour","Km  renseignés",{"$f":"SUM('Pilotes Nat'!CL8)","v":0},null,"Km  renseignés",{"$f":"SUM('Pilotes Inter'!CM7)","v":0},null,"Km  renseignés",{"$f":"SUM(E7+H7)","v":0},null,null,"Colonne1","Pilotes","NAT","INT","SCRATCH",null,null,"Pilotes","NAT","INT","SCRATCH"]
[null,null,"Ronde","Km confirmés",{"$f":"SUM('Pilotes Nat'!CL9)","v":0},null,"Km confirmés",{"$f":"SUM('Pilotes Inter'!CM8)","v":0},null,"Km confirmés",{"$f":"SUM(E8+H8)","v":0},null,null,1,{"$f":"VLOOKUP(N8,'Numéro licences'!$H$4:$I$47,2)","v":"BALFROID Pierre"},{"$f":"SUM(E8)","v":0},{"$f":"SUM(H8)","v":0},{"$f":"SUM(P8:Q8)","v":0},null,1,{"$f":"VLOOKUP(T8,'Numéro licences'!$H$4:$I$47,2)","v":"BALFROID Pierre"},{"$f":"SUM(E7)","v":0},{"$f":"SUM(H7)","v":0},{"$f":"SUM(V8:W8)","v":0}]
[null,null,null,"Rondes confirmées",{"$f":"SUM('Pilotes Nat'!CL10)","v":0},null,"Rondes confirmées",{"$f":"SUM('Pilotes Inter'!CM9)","v":0},null,"Rondes confirmées",0,null,null,2,{"$f":"VLOOKUP(N9,'Numéro licences'!$H$4:$I$47,2)","v":"BALLION Pierre"},{"$f":"SUM(E12)","v":0},{"$f":"SUM(H12)","v":0},0,null,2,{"$f":"VLOOKUP(T9,'Numéro licences'!$H$4:$I$47,2)","v":"BALLION Pierre"},{"$f":"SUM(E11)","v":200},{"$f":"SUM(H11)","v":0},{"$f":"SUM(V9:W9)","v":200}]
[null,null,null,"Rondes effectuées",{"$f":"SUM('Pilotes Nat'!CL11)","v":0},null,"Rondes effectuées",{"$f":"SUM('Pilotes Inter'!CM10)","v":0},null,"Rondes effectuées",0,null,null,3,{"$f":"VLOOKUP(N10,'Numéro licences'!$H$4:$I$47,2)","v":"BERDOYES Bruno"},{"$f":"SUM(E16)","v":0},{"$f":"SUM(H16)","v":0},0,null,3,{"$f":"VLOOKUP(T10,'Numéro licences'!$H$4:$I$47,2)","v":"BERDOYES Bruno"},{"$f":"SUM(E15)","v":0},{"$f":"SUM(H15)","v":0},0]
[2,{"$f":"VLOOKUP(A11,'Numéro licences'!$H$4:$I$47,2)","v":"BALLION Pierre"},"Aller-Retour","Km  renseignés",{"$f":"SUM('Pilotes Nat'!CL12)","v":200},null,"Km  renseignés",{"$f":"SUM('Pilotes Inter'!CM11)","v":0},null,"Km  renseignés",200,null,null,4,{"$f":"VLOOKUP(N11,'Numéro licences'!$H$4:$I$47,2)","v":"BERDOYES Yannick"},{"$f":"SUM(E20)","v":0},{"$f":"SUM(H20)","v":0},0,null,4,{"$f":"VLOOKUP(T11,'Numéro licences'!$H$4:$I$47,2)","v":"BERDOYES Yannick"},{"$f":"SUM(E19)","v":200},{"$f":"SUM(H19)","v":0},200]
[null,null,"Ronde","Km confirmés",{"$f":"SUM('Pilotes Nat'!CL13)","v":0},null,"Km confirmés",{"$f":"SUM('Pilotes Inter'!CM12)","v":0},null,"Km confirmés",0,null,null,5,{"$f":"VLOOKUP(N12,'Numéro licences'!$H$4:$I$47,2)","v":"BRUNEAU Denis-Claude"},{"$f":"SUM(E24)","v":0},{"$f":"SUM(H24)","v":1379},1379,null,5,{"$f":"VLOOKUP(T12,'Numéro licences'!$H$4:$I$47,2)","v":"BRUNEAU Denis-Claude"},{"$f":"SUM(E23)","v":200},{"$f":"SUM(H23)","v":1379},1579]
[null,null,null,"Rondes confirmées",{"$f":"SUM('Pilotes Nat'!CL14)","v":0},null,"Rondes confirmées",{"$f":"SUM('Pilotes Inter'!CM13)","v":0},null,"Rondes confirmées",0,null,null,6,{"$f":"VLOOKUP(N13,'Numéro licences'!$H$4:$I$47,2)","v":"DAVIN Philippe"},{"$f":"SUM(E28)","v":4300},{"$f":"SUM(H28)","v":1407},5707,null,6,{"$f":"VLOOKUP(T13,'Numéro licences'!$H$4:$I$47,2)","v":"DAVIN Philippe"},{"$f":"SUM(E27)","v":4300},{"$f":"SUM(H27)","v":1407},5707]
[null,null,null,"Rondes effectuées",{"$f":"SUM('Pilotes Nat'!CL15)","v":0},null,"Rondes effectuées",{"$f":"SUM('Pilotes Inter'!CM14)","v":0},null,"Rondes effectuées",0,null,null,7,{"$f":"VLOOKUP(N14,'Numéro licences'!$H$4:$I$47,2)","v":"DE SCHEPPERS Jean-Claude"},{"$f":"SUM(E32)","v":0},{"$f":"SUM(H32)","v":0},0,null,7,{"$f":"VLOOKUP(T14,'Numéro licences'!$H$4:$I$47,2)","v":"DE SCHEPPERS Jean-Claude"},{"$f":"SUM(E31)","v":0},{"$f":"SUM(H31)","v":0},0]
[3,{"$f":"VLOOKUP(A15,'Numéro licences'!$H$4:$I$47,2)","v":"BERDOYES Bruno"},"Aller-Retour","Km  renseignés",{"$f":"SUM('Pilotes Nat'!CL16)","v":0},null,"Km  renseignés",{"$f":"SUM('Pilotes Inter'!CM15)","v":0},null,"Km  renseignés",0,null,null,8,{"$f":"VLOOKUP(N15,'Numéro licences'!$H$4:$I$47,2)","v":"DECUYPER Frédéric"},{"$f":"SUM(E36)","v":0},{"$f":"SUM(H36)","v":0},0,null,8,{"$f":"VLOOKUP(T15,'Numéro licences'!$H$4:$I$47,2)","v":"DECUYPER Frédéric"},{"$f":"SUM(E35)","v":0},{"$f":"SUM(H35)","v":0},0]
[null,null,"Ronde","Km confirmés",{"$f":"SUM('Pilotes Nat'!CL17)","v":0},null,"Km confirmés",{"$f":"SUM('Pilotes Inter'!CM16)","v":0},null,"Km confirmés",0,null,null,9,{"$f":"VLOOKUP(N16,'Numéro licences'!$H$4:$I$47,2)","v":"DEWAERSEGHERS Francis"},{"$f":"SUM(E40)","v":0},{"$f":"SUM(H40)","v":0},0,null,9,{"$f":"VLOOKUP(T16,'Numéro licences'!$H$4:$I$47,2)","v":"DEWAERSEGHERS Francis"},{"$f":"SUM(E39)","v":589},{"$f":"SUM(H39)","v":0},589]
[null,null,null,"Rondes confirmées",{"$f":"SUM('Pilotes Nat'!CL18)","v":0},null,"Rondes confirmées",{"$f":"SUM('Pilotes Inter'!CM17)","v":0},null,"Rondes confirmées",0,null,null,10,{"$f":"VLOOKUP(N17,'Numéro licences'!$H$4:$I$47,2)","v":"DHONDT Jerry"},{"$f":"SUM(E44)","v":0},{"$f":"SUM(H44)","v":0},0,null,10,{"$f":"VLOOKUP(T17,'Numéro licences'!$H$4:$I$47,2)","v":"DHONDT Jerry"},{"$f":"SUM(E43)","v":2096},{"$f":"SUM(H43)","v":0},2096]
[null,null,null,"Rondes effectuées",{"$f":"SUM('Pilotes Nat'!CL19)","v":0},null,"Rondes effectuées",{"$f":"SUM('Pilotes Inter'!CM18)","v":0},null,"Rondes effectuées",0,null,null,11,{"$f":"VLOOKUP(N18,'Numéro licences'!$H$4:$I$47,2)","v":"DONY Marc"},{"$f":"SUM(E48)","v":0},{"$f":"SUM(H48)","v":2682},2682,null,11,{"$f":"VLOOKUP(T18,'Numéro licences'!$H$4:$I$47,2)","v":"DONY Marc"},{"$f":"SUM(E47)","v":2338},{"$f":"SUM(H47)","v":2682},5020]
[4,{"$f":"VLOOKUP(A19,'Numéro licences'!$H$4:$I$47,2)","v":"BERDOYES Yannick"},"Aller-Retour","Km  renseignés",{"$f":"SUM('Pilotes Nat'!CL20)","v":200},null,"Km  renseignés",{"$f":"SUM('Pilotes Inter'!CM19)","v":0},null,"Km  renseignés",200,null,null,12,{"$f":"VLOOKUP(N19,'Numéro licences'!$H$4:$I$47,2)","v":"DUMONT Christophe"},{"$f":"SUM(E52)","v":0},{"$f":"SUM(H52)","v":0},0,null,12,{"$f":"VLOOKUP(T19,'Numéro licences'!$H$4:$I$47,2)","v":"DUMONT Christophe"},{"$f":"SUM(E51)","v":0},{"$f":"SUM(H51)","v":0},0]
[null,null,"Ronde","Km confirmés",{"$f":"SUM('Pilotes Nat'!CL21)","v":0},null,"Km confirmés",{"$f":"SUM('Pilotes Inter'!CM20)","v":0},null,"Km confirmés",0,null,null,13,{"$f":"VLOOKUP(N20,'Numéro licences'!$H$4:$I$47,2)","v":"FAVRESSSE René"},{"$f":"SUM(E56)","v":0},{"$f":"SUM(H56)","v":0},0,null,13,{"$f":"VLOOKUP(T20,'Numéro licences'!$H$4:$I$47,2)","v":"FAVRESSSE René"},{"$f":"SUM(E55)","v":751},{"$f":"SUM(H55)","v":0},751]
[null,null,null,"Rondes confirmées",{"$f":"SUM('Pilotes Nat'!CL22)","v":0},null,"Rondes confirmées",{"$f":"SUM('Pilotes Inter'!CM21)","v":0},null,"Rondes confirmées",0,null,null,14,{"$f":"VLOOKUP(N21,'Numéro licences'!$H$4:$I$47,2)","v":"GOFFIN Amaury"},{"$f":"SUM(E60)","v":0},{"$f":"SUM(H60)","v":0},0,null,14,{"$f":"VLOOKUP(T21,'Numéro licences'!$H$4:$I$47,2)","v":"GOFFIN Amaury"},{"$f":"SUM(E59)","v":0},{"$f":"SUM(H59)","v":0},0]
[null,null,null,"Rondes effectuées",{"$f":"SUM('Pilotes Nat'!CL23)","v":0},null,"Rondes effectuées",{"$f":"SUM('Pilotes Inter'!CM22)","v":0},null,"Rondes effectuées",0,null,null,15,{"$f":"VLOOKUP(N22,'Numéro licences'!$H$4:$I$47,2)","v":"JAMOTTE Jean"},{"$f":"SUM(E64)","v":8023},{"$f":"SUM(H64)","v":1470},9493,null,15,{"$f":"VLOOKUP(T22,'Numéro licences'!$H$4:$I$47,2)","v":"JAMOTTE Jean"},{"$f":"SUM(E63)","v":8023},{"$f":"SUM(H63)","v":1470},9493]
[5,{"$f":"VLOOKUP(A23,'Numéro licences'!$H$4:$I$47,2)","v":"BRUNEAU Denis-Claude"},"Aller-Retour","Km  renseignés",{"$f":"SUM('Pilotes Nat'!CL24)","v":200},null,"Km  renseignés",{"$f":"SUM('Pilotes Inter'!CM23)","v":1379},null,"Km  renseignés",1579,null,null,16,{"$f":"VLOOKUP(N23,'Numéro licences'!$H$4:$I$47,2)","v":"LAMBOTTE Didier"},{"$f":"SUM(E68)","v":0},{"$f":"SUM(H68)","v":0},0,null,16,{"$f":"VLOOKUP(T23,'Numéro licences'!$H$4:$I$47,2)","v":"LAMBOTTE Didier"},{"$f":"SUM(E67)","v":0},{"$f":"SUM(H67)","v":0},0]
[null,null,"Ronde","Km confirmés",{"$f":"SUM('Pilotes Nat'!CL25)","v":0},null,"Km confirmés",{"$f":"SUM('Pilotes Inter'!CM24)","v":1379},null,"Km confirmés",1379,null,null,17,{"$f":"VLOOKUP(N24,'Numéro licences'!$H$4:$I$47,2)","v":"LEFEVRE Francis"},{"$f":"SUM(E72)","v":0},{"$f":"SUM(H72)","v":0},0,null,17,{"$f":"VLOOKUP(T24,'Numéro licences'!$H$4:$I$47,2)","v":"LEFEVRE Francis"},{"$f":"SUM(E71)","v":0},{"$f":"SUM(H71)","v":0},0]
[null,null,null,"Rondes confirmées",{"$f":"SUM('Pilotes Nat'!CL26)","v":0},null,"Rondes confirmées",{"$f":"SUM('Pilotes Inter'!CM25)","v":1},null,"Rondes confirmées",1,null,null,18,{"$f":"VLOOKUP(N25,'Numéro licences'!$H$4:$I$47,2)","v":"LESCAL Thierry"},{"$f":"SUM(E76)","v":8518},{"$f":"SUM(H76)","v":0},8518,null,18,{"$f":"VLOOKUP(T25,'Numéro licences'!$H$4:$I$47,2)","v":"LESCAL Thierry"},{"$f":"SUM(E75)","v":8518},{"$f":"SUM(H75)","v":0},8518]
[null,null,null,"Rondes effectuées",{"$f":"SUM('Pilotes Nat'!CL27)","v":0},null,"Rondes effectuées",{"$f":"SUM('Pilotes Inter'!CM26)","v":1},null,"Rondes effectuées",1,null,null,19,{"$f":"VLOOKUP(N26,'Numéro licences'!$H$4:$I$47,2)","v":"MALLIEN Philippe"},{"$f":"SUM(E80)","v":200},{"$f":"SUM(H80)","v":0},200,null,19,{"$f":"VLOOKUP(T26,'Numéro licences'!$H$4:$I$47,2)","v":"MALLIEN Philippe"},{"$f":"SUM(E79)","v":200},{"$f":"SUM(H79)","v":0},200]
[6,{"$f":"VLOOKUP(A27,'Numéro licences'!$H$4:$I$47,2)","v":"DAVIN Philippe"},"Aller-Retour","Km  renseignés",{"$f":"SUM('Pilotes Nat'!CL28)","v":4300},null,"Km  renseignés",{"$f":"SUM('Pilotes Inter'!CM27)","v":1407},null,"Km  renseignés",5707,null,null,20,{"$f":"VLOOKUP(N27,'Numéro licences'!$H$4:$I$47,2)","v":"MARIEL Didier"},{"$f":"SUM(E84)","v":0},{"$f":"SUM(H84)","v":0},0,null,20,{"$f":"VLOOKUP(T27,'Numéro licences'!$H$4:$I$47,2)","v":"MARIEL Didier"},{"$f":"SUM(E83)","v":808},{"$f":"SUM(H83)","v":0},808]
[null,null,"Ronde","Km confirmés",{"$f":"SUM('Pilotes Nat'!CL29)","v":4300},null,"Km confirmés",{"$f":"SUM('Pilotes Inter'!CM28)","v":1407},null,"Km confirmés",5707,null,null,21,{"$f":"VLOOKUP(N28,'Numéro licences'!$H$4:$I$47,2)","v":"MILET Benoit"},{"$f":"SUM(E88)","v":0},{"$f":"SUM(H88)","v":532},532,null,21,{"$f":"VLOOKUP(T28,'Numéro licences'!$H$4:$I$47,2)","v":"MILET Benoit"},{"$f":"SUM(E87)","v":0},{"$f":"SUM(H87)","v":532},532]
[null,null,null,"Rondes confirmées",{"$f":"SUM('Pilotes Nat'!CL30)","v":14},null,"Rondes confirmées",{"$f":"SUM('Pilotes Inter'!CM29)","v":1},null,"Rondes confirmées",15,null,null,22,{"$f":"VLOOKUP(N29,'Numéro licences'!$H$4:$I$47,2)","v":"NIHOUL Dany"},{"$f":"SUM(E92)","v":5197},{"$f":"SUM(H92)","v":1462},6659,null,22,{"$f":"VLOOKUP(T29,'Numéro licences'!$H$4:$I$47,2)","v":"NIHOUL Dany"},{"$f":"SUM(E91)","v":5197},{"$f":"SUM(H91)","v":1462},6659]
[null,null,null,"Rondes effectuées",{"$f":"SUM('Pilotes Nat'!CL31)","v":12},null,"Rondes effectuées",{"$f":"SUM('Pilotes Inter'!CM30)","v":1},null,"Rondes effectuées",13,null,null,23,{"$f":"VLOOKUP(N30,'Numéro licences'!$H$4:$I$47,2)","v":"OVAERE Jimmy"},{"$f":"SUM(E96)","v":0},{"$f":"SUM(H96)","v":0},0,null,23,{"$f":"VLOOKUP(T30,'Numéro licences'!$H$4:$I$47,2)","v":"OVAERE Jimmy"},{"$f":"SUM(E95)","v":0},{"$f":"SUM(H95)","v":0},0]
[7,{"$f":"VLOOKUP(A31,'Numéro licences'!$H$4:$I$47,2)","v":"DE SCHEPPERS Jean-Claude"},"Aller-Retour","Km  renseignés",{"$f":"SUM('Pilotes Nat'!CL32)","v":0},null,"Km  renseignés",{"$f":"SUM('Pilotes Inter'!CM31)","v":0},null,"Km  renseignés",0,null,null,24,{"$f":"VLOOKUP(N31,'Numéro licences'!$H$4:$I$47,2)","v":"PARMENTIER Dominique"},{"$f":"SUM(E100)","v":564},{"$f":"SUM(H100)","v":0},564,null,24,{"$f":"VLOOKUP(T31,'Numéro licences'!$H$4:$I$47,2)","v":"PARMENTIER Dominique"},{"$f":"SUM(E99)","v":564},{"$f":"SUM(H99)","v":0},564]
[null,null,"Ronde","Km confirmés",{"$f":"SUM('Pilotes Nat'!CL33)","v":0},null,"Km confirmés",{"$f":"SUM('Pilotes Inter'!CM32)","v":0},null,"Km confirmés",0,null,null,25,{"$f":"VLOOKUP(N32,'Numéro licences'!$H$4:$I$47,2)","v":"POCHET Jean-Dominique"},{"$f":"SUM(E104)","v":0},{"$f":"SUM(H104)","v":0},0,null,25,{"$f":"VLOOKUP(T32,'Numéro licences'!$H$4:$I$47,2)","v":"POCHET Jean-Dominique"},{"$f":"SUM(E103)","v":0},{"$f":"SUM(H103)","v":0},0]
[null,null,null,"Rondes confirmées",{"$f":"SUM('Pilotes Nat'!CL34)","v":0},null,"Rondes confirmées",{"$f":"SUM('Pilotes Inter'!CM33)","v":0},null,"Rondes confirmées",0,null,null,26,{"$f":"VLOOKUP(N33,'Numéro licences'!$H$4:$I$47,2)","v":"POMPIER Philippe"},{"$f":"SUM(E108)","v":0},{"$f":"SUM(H108)","v":0},0,null,26,{"$f":"VLOOKUP(T33,'Numéro licences'!$H$4:$I$47,2)","v":"POMPIER Philippe"},{"$f":"SUM(E107)","v":0},{"$f":"SUM(H107)","v":0},0]
[null,null,null,"Rondes effectuées",{"$f":"SUM('Pilotes Nat'!CL35)","v":0},null,"Rondes effectuées",{"$f":"SUM('Pilotes Inter'!CM34)","v":0},null,"Rondes effectuées",0,null,null,27,{"$f":"VLOOKUP(N34,'Numéro licences'!$H$4:$I$47,2)","v":"RAMEAU Didier"},{"$f":"SUM(E112)","v":0},{"$f":"SUM(H112)","v":0},0,null,27,{"$f":"VLOOKUP(T34,'Numéro licences'!$H$4:$I$47,2)","v":"RAMEAU Didier"},{"$f":"SUM(E111)","v":1311},{"$f":"SUM(H111)","v":0},1311]
[8,{"$f":"VLOOKUP(A35,'Numéro licences'!$H$4:$I$47,2)","v":"DECUYPER Frédéric"},"Aller-Retour","Km  renseignés",{"$f":"SUM('Pilotes Nat'!CL36)","v":0},null,"Km  renseignés",{"$f":"SUM('Pilotes Inter'!CM35)","v":0},null,"Km  renseignés",0,null,null,28,{"$f":"VLOOKUP(N35,'Numéro licences'!$H$4:$I$47,2)","v":"SPITAELS Bernard"},{"$f":"SUM(E116)","v":0},{"$f":"SUM(H116)","v":0},0,null,28,{"$f":"VLOOKUP(T35,'Numéro licences'!$H$4:$I$47,2)","v":"SPITAELS Bernard"},{"$f":"SUM(E115)","v":517},{"$f":"SUM(H115)","v":0},517]
[null,null,"Ronde","Km confirmés",{"$f":"SUM('Pilotes Nat'!CL37)","v":0},null,"Km confirmés",{"$f":"SUM('Pilotes Inter'!CM36)","v":0},null,"Km confirmés",0,null,null,29,{"$f":"VLOOKUP(N36,'Numéro licences'!$H$4:$I$47,2)","v":"TERWAGNE Freddy"},{"$f":"SUM(E120)","v":0},{"$f":"SUM(H120)","v":0},0,null,29,{"$f":"VLOOKUP(T36,'Numéro licences'!$H$4:$I$47,2)","v":"TERWAGNE Freddy"},{"$f":"SUM(E119)","v":0},{"$f":"SUM(H119)","v":0},0]
[null,null,null,"Rondes confirmées",{"$f":"SUM('Pilotes Nat'!CL38)","v":0},null,"Rondes confirmées",{"$f":"SUM('Pilotes Inter'!CM37)","v":0},null,"Rondes confirmées",0,null,null,30,{"$f":"VLOOKUP(N37,'Numéro licences'!$H$4:$I$47,2)","v":"TERWAGNE Julien"},{"$f":"SUM(E124)","v":0},{"$f":"SUM(H124)","v":0},0,null,30,{"$f":"VLOOKUP(T37,'Numéro licences'!$H$4:$I$47,2)","v":"TERWAGNE Julien"},{"$f":"SUM(E123)","v":0},{"$f":"SUM(H123)","v":0},0]
[null,null,null,"Rondes effectuées",{"$f":"SUM('Pilotes Nat'!CL39)","v":0},null,"Rondes effectuées",{"$f":"SUM('Pilotes Inter'!CM38)","v":0},null,"Rondes effectuées",0,null,null,31,{"$f":"VLOOKUP(N38,'Numéro licences'!$H$4:$I$47,2)","v":"THOMAS Isabelle"},{"$f":"SUM(E128)","v":0},{"$f":"SUM(H128)","v":0},0,null,31,{"$f":"VLOOKUP(T38,'Numéro licences'!$H$4:$I$47,2)","v":"THOMAS Isabelle"},{"$f":"SUM(E127)","v":0},{"$f":"SUM(H127)","v":0},0]
[9,{"$f":"VLOOKUP(A39,'Numéro licences'!$H$4:$I$47,2)","v":"DEWAERSEGHERS Francis"},"Aller-Retour","Km  renseignés",{"$f":"SUM('Pilotes Nat'!CL40)","v":589},null,"Km  renseignés",{"$f":"SUM('Pilotes Inter'!CM39)","v":0},null,"Km  renseignés",589,null,null,32,{"$f":"VLOOKUP(N39,'Numéro licences'!$H$4:$I$47,2)","v":"URBAIN Philippe"},{"$f":"SUM(E132)","v":0},{"$f":"SUM(H132)","v":1417},1417,null,32,{"$f":"VLOOKUP(T39,'Numéro licences'!$H$4:$I$47,2)","v":"URBAIN Philippe"},{"$f":"SUM(E131)","v":156},{"$f":"SUM(H131)","v":1417},1573]
[null,null,"Ronde","Km confirmés",{"$f":"SUM('Pilotes Nat'!CL41)","v":0},null,"Km confirmés",{"$f":"SUM('Pilotes Inter'!CM40)","v":0},null,"Km confirmés",0,null,null,33,{"$f":"VLOOKUP(N40,'Numéro licences'!$H$4:$I$47,2)","v":"VANBELLINGEN Jean-Claude"},{"$f":"SUM(E136)","v":0},{"$f":"SUM(H136)","v":0},0,null,33,{"$f":"VLOOKUP(T40,'Numéro licences'!$H$4:$I$47,2)","v":"VANBELLINGEN Jean-Claude"},{"$f":"SUM(E135)","v":863},{"$f":"SUM(H135)","v":0},863]
[null,null,null,"Rondes confirmées",{"$f":"SUM('Pilotes Nat'!CL42)","v":0},null,"Rondes confirmées",{"$f":"SUM('Pilotes Inter'!CM41)","v":0},null,"Rondes confirmées",0,null,null,34,{"$f":"VLOOKUP(N41,'Numéro licences'!$H$4:$I$47,2)","v":"VANDEN BOSSCHE Vincent"},{"$f":"SUM(E140)","v":0},{"$f":"SUM(H140)","v":0},0,null,34,{"$f":"VLOOKUP(T41,'Numéro licences'!$H$4:$I$47,2)","v":"VANDEN BOSSCHE Vincent"},{"$f":"SUM(E139)","v":0},{"$f":"SUM(H139)","v":0},0]
[null,null,null,"Rondes effectuées",{"$f":"SUM('Pilotes Nat'!CL43)","v":2},null,"Rondes effectuées",{"$f":"SUM('Pilotes Inter'!CM42)","v":0},null,"Rondes effectuées",2,null,null,35,{"$f":"VLOOKUP(N42,'Numéro licences'!$H$4:$I$47,2)","v":"VANDEN WAEYENBERGH Michel"},{"$f":"SUM(E144)","v":0},{"$f":"SUM(H144)","v":0},0,null,35,{"$f":"VLOOKUP(T42,'Numéro licences'!$H$4:$I$47,2)","v":"VANDEN WAEYENBERGH Michel"},{"$f":"SUM(E143)","v":0},{"$f":"SUM(H143)","v":0},0]
[10,{"$f":"VLOOKUP(A43,'Numéro licences'!$H$4:$I$47,2)","v":"DHONDT Jerry"},"Aller-Retour","Km  renseignés",{"$f":"SUM('Pilotes Nat'!CL44)","v":2096},null,"Km  renseignés",{"$f":"SUM('Pilotes Inter'!CM43)","v":0},null,"Km  renseignés",2096,null,null,36,{"$f":"VLOOKUP(N43,'Numéro licences'!$H$4:$I$47,2)","v":"VANSTEYVOORT André"},{"$f":"SUM(E148)","v":0},{"$f":"SUM(H148)","v":0},0,null,36,{"$f":"VLOOKUP(T43,'Numéro licences'!$H$4:$I$47,2)","v":"VANSTEYVOORT André"},{"$f":"SUM(E147)","v":200},{"$f":"SUM(H147)","v":0},200]
[null,null,"Ronde","Km confirmés",{"$f":"SUM('Pilotes Nat'!CL45)","v":0},null,"Km confirmés",{"$f":"SUM('Pilotes Inter'!CM44)","v":0},null,"Km confirmés",0,null,null,37,{"$f":"VLOOKUP(N44,'Numéro licences'!$H$4:$I$47,2)","v":"WOUTERS Olivier"},{"$f":"SUM(E152)","v":4681},{"$f":"SUM(H152)","v":0},4681,null,37,{"$f":"VLOOKUP(T44,'Numéro licences'!$H$4:$I$47,2)","v":"WOUTERS Olivier"},{"$f":"SUM(E151)","v":4681},{"$f":"SUM(H151)","v":0},4681]
[null,null,null,"Rondes confirmées",{"$f":"SUM('Pilotes Nat'!CL46)","v":0},null,"Rondes confirmées",{"$f":"SUM('Pilotes Inter'!CM45)","v":0},null,"Rondes confirmées",0,null,null,38,{"$f":"VLOOKUP(N45,'Numéro licences'!$H$4:$I$47,2)","v":"DEMETS Eric"},{"$f":"SUM(E156)","v":0},{"$f":"SUM(H156)","v":0},0,null,38,{"$f":"VLOOKUP(T45,'Numéro licences'!$H$4:$I$47,2)","v":"DEMETS Eric"},{"$f":"SUM(E155)","v":751},{"$f":"SUM(H155)","v":0},751]
[null,null,null,"Rondes effectuées",{"$f":"SUM('Pilotes Nat'!CL47)","v":7},null,"Rondes effectuées",{"$f":"SUM('Pilotes Inter'!CM46)","v":0},null,"Rondes effectuées",7,null,null,39,{"$f":"VLOOKUP(N46,'Numéro licences'!$H$4:$I$47,2)","v":"DECELLE Hubert"},{"$f":"SUM(E160)","v":0},{"$f":"SUM(H160)","v":0},0,null,39,{"$f":"VLOOKUP(T46,'Numéro licences'!$H$4:$I$47,2)","v":"DECELLE Hubert"},{"$f":"SUM(E159)","v":751},{"$f":"SUM(H159)","v":0},751]
[11,{"$f":"VLOOKUP(A47,'Numéro licences'!$H$4:$I$47,2)","v":"DONY Marc"},"Aller-Retour","Km  renseignés",{"$f":"SUM('Pilotes Nat'!CL48)","v":2338},null,"Km  renseignés",{"$f":"SUM('Pilotes Inter'!CM47)","v":2682},null,"Km  renseignés",5020,null,null,40,{"$f":"VLOOKUP(N47,'Numéro licences'!$H$4:$I$47,2)","v":0},{"$f":"SUM(E164)","v":0},{"$f":"SUM(H164)","v":0},0,null,40,{"$f":"VLOOKUP(T47,'Numéro licences'!$H$4:$I$47,2)","v":0},{"$f":"SUM(E163)","v":0},{"$f":"SUM(H163)","v":0},0]
[null,null,"Ronde","Km confirmés",{"$f":"SUM('Pilotes Nat'!CL49)","v":0},null,"Km confirmés",{"$f":"SUM('Pilotes Inter'!CM48)","v":2682},null,"Km confirmés",2682,null,null,41,{"$f":"VLOOKUP(N48,'Numéro licences'!$H$4:$I$47,2)","v":0},{"$f":"SUM(E168)","v":0},{"$f":"SUM(H168)","v":0},0,null,41,{"$f":"VLOOKUP(T48,'Numéro licences'!$H$4:$I$47,2)","v":0},{"$f":"SUM(E167)","v":0},{"$f":"SUM(H167)","v":0},0]
[null,null,null,"Rondes confirmées",{"$f":"SUM('Pilotes Nat'!CL50)","v":0},null,"Rondes confirmées",{"$f":"SUM('Pilotes Inter'!CM49)","v":2},null,"Rondes confirmées",2,null,null,42,{"$f":"VLOOKUP(N49,'Numéro licences'!$H$4:$I$47,2)","v":0},{"$f":"SUM(E172)","v":0},{"$f":"SUM(H172)","v":0},0,null,42,{"$f":"VLOOKUP(T49,'Numéro licences'!$H$4:$I$47,2)","v":0},{"$f":"SUM(E171)","v":0},{"$f":"SUM(H171)","v":0},0]
[null,null,null,"Rondes effectuées",{"$f":"SUM('Pilotes Nat'!CL51)","v":6},null,"Rondes effectuées",{"$f":"SUM('Pilotes Inter'!CM50)","v":2},null,"Rondes effectuées",8,null,null,43,{"$f":"VLOOKUP(N50,'Numéro licences'!$H$4:$I$47,2)","v":0},{"$f":"SUM(E176)","v":0},{"$f":"SUM(H176)","v":0},0,null,43,{"$f":"VLOOKUP(T50,'Numéro licences'!$H$4:$I$47,2)","v":0},{"$f":"SUM(E175)","v":0},{"$f":"SUM(H175)","v":0},0]
[12,{"$f":"VLOOKUP(A51,'Numéro licences'!$H$4:$I$47,2)","v":"DUMONT Christophe"},"Aller-Retour","Km  renseignés",{"$f":"SUM('Pilotes Nat'!CL52)","v":0},null,"Km  renseignés",{"$f":"SUM('Pilotes Inter'!CM51)","v":0},null,"Km  renseignés",0,null,null,44,{"$f":"VLOOKUP(N51,'Numéro licences'!$H$4:$I$47,2)","v":0},{"$f":"SUM(E180)","v":0},{"$f":"SUM(H180)","v":0},0,null,44,{"$f":"VLOOKUP(T51,'Numéro licences'!$H$4:$I$47,2)","v":0},{"$f":"SUM(E179)","v":0},{"$f":"SUM(H179)","v":0},0]
[null,null,"Ronde","Km confirmés",{"$f":"SUM('Pilotes Nat'!CL53)","v":0},null,"Km confirmés",{"$f":"SUM('Pilotes Inter'!CM52)","v":0},null,"Km confirmés",0,null,null,45,{"$f":"VLOOKUP(N52,'Numéro licences'!$H$4:$I$47,2)","v":0},{"$f":"SUM(E184)","v":0},{"$f":"SUM(H184)","v":0},0,null,45,{"$f":"VLOOKUP(T52,'Numéro licences'!$H$4:$I$47,2)","v":0},{"$f":"SUM(E183)","v":0},{"$f":"SUM(H183)","v":0},0]
[null,null,null,"Rondes confirmées",{"$f":"SUM('Pilotes Nat'!CL54)","v":0},null,"Rondes confirmées",{"$f":"SUM('Pilotes Inter'!CM53)","v":0},null,"Rondes confirmées",0,null,null,46,{"$f":"VLOOKUP(N53,'Numéro licences'!$H$4:$I$47,2)","v":0},{"$f":"SUM(E188)","v":0},{"$f":"SUM(H188)","v":0},0,null,46,{"$f":"VLOOKUP(T53,'Numéro licences'!$H$4:$I$47,2)","v":0},{"$f":"SUM(E187)","v":0},{"$f":"SUM(H187)","v":0},0]
[null,null,null,"Rondes effectuées",{"$f":"SUM('Pilotes Nat'!CL55)","v":0},null,"Rondes effectuées",{"$f":"SUM('Pilotes Inter'!CM54)","v":0},null,"Rondes effectuées",0]
[13,{"$f":"VLOOKUP(A55,'Numéro licences'!$H$4:$I$47,2)","v":"FAVRESSSE René"},"Aller-Retour","Km  renseignés",{"$f":"SUM('Pilotes Nat'!CL56)","v":751},null,"Km  renseignés",{"$f":"SUM('Pilotes Inter'!CM55)","v":0},null,"Km  renseignés",751]
[null,null,"Ronde","Km confirmés",{"$f":"SUM('Pilotes Nat'!CL57)","v":0},null,"Km confirmés",{"$f":"SUM('Pilotes Inter'!CM56)","v":0},null,"Km confirmés",0]
[null,null,null,"Rondes confirmées",{"$f":"SUM('Pilotes Nat'!CL58)","v":0},null,"Rondes confirmées",{"$f":"SUM('Pilotes Inter'!CM57)","v":0},null,"Rondes confirmées",0]
[null,null,null,"Rondes effectuées",{"$f":"SUM('Pilotes Nat'!CL59)","v":1},null,"Rondes effectuées",{"$f":"SUM('Pilotes Inter'!CM58)","v":0},null,"Rondes effectuées",1]
[14,{"$f":"VLOOKUP(A59,'Numéro licences'!$H$4:$I$47,2)","v":"GOFFIN Amaury"},"Aller-Retour","Km  renseignés",{"$f":"SUM('Pilotes Nat'!CL60)","v":0},null,"Km  renseignés",{"$f":"SUM('Pilotes Inter'!CM59)","v":0},null,"Km  renseignés",0,null,null,null,null,{"$f":"SUM(P8:P53)","v":31483},{"$f":"SUM(Q8:Q53)","v":10349},{"$f":"SUM(P59:Q59)","v":41832},null,null,null,{"$f":"SUM(V8:V53)","v":43214},{"$f":"SUM(W8:W53)","v":10349},{"$f":"SUM(V59:W59)","v":53563}]
[null,null,"Ronde","Km confirmés",{"$f":"SUM('Pilotes Nat'!CL61)","v":0},null,"Km confirmés",{"$f":"SUM('Pilotes Inter'!CM60)","v":0},null,"Km confirmés",0,null,null,null,null,{"$f":"SUM(P59/R59)","v":0.75260566073819091},{"$f":"SUM(Q59/R59)","v":0.24739433926180915},null,null,null,null,{"$f":"SUM(V59/X59)","v":0.80678826802083525},{"$f":"SUM(W59/X59)","v":0.19321173197916472}]
[null,null,null,"Rondes confirmées",{"$f":"SUM('Pilotes Nat'!CL62)","v":0},null,"Rondes confirmées",{"$f":"SUM('Pilotes Inter'!CM61)","v":0},null,"Rondes confirmées",0,null,null,null,null,"NAT","INT",null,null,null,null,"NAT","INT"]
[null,null,null,"Rondes effectuées",{"$f":"SUM('Pilotes Nat'!CL63)","v":0},null,"Rondes effectuées",{"$f":"SUM('Pilotes Inter'!CM62)","v":0},null,"Rondes effectuées",0]
[15,{"$f":"VLOOKUP(A63,'Numéro licences'!$H$4:$I$47,2)","v":"JAMOTTE Jean"},"Aller-Retour","Km  renseignés",{"$f":"SUM('Pilotes Nat'!CL64)","v":8023},null,"Km  renseignés",{"$f":"SUM('Pilotes Inter'!CM63)","v":1470},null,"Km  renseignés",9493]
[null,null,"Ronde","Km confirmés",{"$f":"SUM('Pilotes Nat'!CL65)","v":8023},null,"Km confirmés",{"$f":"SUM('Pilotes Inter'!CM64)","v":1470},null,"Km confirmés",9493]
[null,null,null,"Rondes confirmées",{"$f":"SUM('Pilotes Nat'!CL66)","v":25},null,"Rondes confirmées",{"$f":"SUM('Pilotes Inter'!CM65)","v":1},null,"Rondes confirmées",26]
[null,null,null,"Rondes effectuées",{"$f":"SUM('Pilotes Nat'!CL67)","v":23},null,"Rondes effectuées",{"$f":"SUM('Pilotes Inter'!CM66)","v":1},null,"Rondes effectuées",24]
[16,{"$f":"VLOOKUP(A67,'Numéro licences'!$H$4:$I$47,2)","v":"LAMBOTTE Didier"},"Aller-Retour","Km  renseignés",{"$f":"SUM('Pilotes Nat'!CL68)","v":0},null,"Km  renseignés",{"$f":"SUM('Pilotes Inter'!CM67)","v":0},null,"Km  renseignés",0]
[null,null,"Ronde","Km confirmés",{"$f":"SUM('Pilotes Nat'!CL69)","v":0},null,"Km confirmés",{"$f":"SUM('Pilotes Inter'!CM68)","v":0},null,"Km confirmés",0]
[null,null,null,"Rondes confirmées",{"$f":"SUM('Pilotes Nat'!CL70)","v":0},null,"Rondes confirmées",{"$f":"SUM('Pilotes Inter'!CM69)","v":0},null,"Rondes confirmées",0]
[null,null,null,"Rondes effectuées",{"$f":"SUM('Pilotes Nat'!CL71)","v":0},null,"Rondes effectuées",{"$f":"SUM('Pilotes Inter'!CM70)","v":0},null,"Rondes effectuées",0]
[17,{"$f":"VLOOKUP(A71,'Numéro licences'!$H$4:$I$47,2)","v":"LEFEVRE Francis"},"Aller-Retour","Km  renseignés",{"$f":"SUM('Pilotes Nat'!CL72)","v":0},null,"Km  renseignés",{"$f":"SUM('Pilotes Inter'!CM71)","v":0},null,"Km  renseignés",0]
[null,null,"Ronde","Km confirmés",{"$f":"SUM('Pilotes Nat'!CL73)","v":0},null,"Km confirmés",{"$f":"SUM('Pilotes Inter'!CM72)","v":0},null,"Km confirmés",{"$f":"SUM(E72+H72)","v":0}]
[null,null,null,"Rondes confirmées",{"$f":"SUM('Pilotes Nat'!CL74)","v":0},null,"Rondes confirmées",{"$f":"SUM('Pilotes Inter'!CM73)","v":0},null,"Rondes confirmées",0]
[null,null,null,"Rondes effectuées",{"$f":"SUM('Pilotes Nat'!CL75)","v":0},null,"Rondes effectuées",{"$f":"SUM('Pilotes Inter'!CM74)","v":0},null,"Rondes effectuées",0]
[18,{"$f":"VLOOKUP(A75,'Numéro licences'!$H$4:$I$47,2)","v":"LESCAL Thierry"},"Aller-Retour","Km  renseignés",{"$f":"SUM('Pilotes Nat'!CL76)","v":8518},null,"Km  renseignés",{"$f":"SUM('Pilotes Inter'!CM75)","v":0},null,"Km  renseignés",8518]
[null,null,"Ronde","Km confirmés",{"$f":"SUM('Pilotes Nat'!CL77)","v":8518},null,"Km confirmés",{"$f":"SUM('Pilotes Inter'!CM76)","v":0},null,"Km confirmés",8518]
[null,null,null,"Rondes confirmées",{"$f":"SUM('Pilotes Nat'!CL78)","v":26},null,"Rondes confirmées",{"$f":"SUM('Pilotes Inter'!CM77)","v":0},null,"Rondes confirmées",26]
[null,null,null,"Rondes effectuées",{"$f":"SUM('Pilotes Nat'!CL79)","v":24},null,"Rondes effectuées",{"$f":"SUM('Pilotes Inter'!CM78)","v":0},null,"Rondes effectuées",24]
[19,{"$f":"VLOOKUP(A79,'Numéro licences'!$H$4:$I$47,2)","v":"MALLIEN Philippe"},"Aller-Retour","Km  renseignés",{"$f":"SUM('Pilotes Nat'!CL80)","v":200},null,"Km  renseignés",{"$f":"SUM('Pilotes Inter'!CM79)","v":0},null,"Km  renseignés",200]
[null,null,"Ronde","Km confirmés",{"$f":"SUM('Pilotes Nat'!CL81)","v":200},null,"Km confirmés",{"$f":"SUM('Pilotes Inter'!CM80)","v":0},null,"Km confirmés",200]
[null,null,null,"Rondes confirmées",{"$f":"SUM('Pilotes Nat'!CL82)","v":0},null,"Rondes confirmées",{"$f":"SUM('Pilotes Inter'!CM81)","v":0},null,"Rondes confirmées",0]
[null,null,null,"Rondes effectuées",{"$f":"SUM('Pilotes Nat'!CL83)","v":0},null,"Rondes effectuées",{"$f":"SUM('Pilotes Inter'!CM82)","v":0},null,"Rondes effectuées",0]
[20,{"$f":"VLOOKUP(A83,'Numéro licences'!$H$4:$I$47,2)","v":"MARIEL Didier"},"Aller-Retour","Km  renseignés",{"$f":"SUM('Pilotes Nat'!CL84)","v":808},null,"Km  renseignés",{"$f":"SUM('Pilotes Inter'!CM83)","v":0},null,"Km  renseignés",808]
[null,null,"Ronde","Km confirmés",{"$f":"SUM('Pilotes Nat'!CL85)","v":0},null,"Km confirmés",{"$f":"SUM('Pilotes Inter'!CM84)","v":0},null,"Km confirmés",0]
[null,null,null,"Rondes confirmées",{"$f":"SUM('Pilotes Nat'!CL86)","v":0},null,"Rondes confirmées",{"$f":"SUM('Pilotes Inter'!CM85)","v":0},null,"Rondes confirmées",0]
[null,null,null,"Rondes effectuées",{"$f":"SUM('Pilotes Nat'!CL87)","v":3},null,"Rondes effectuées",{"$f":"SUM('Pilotes Inter'!CM86)","v":0},null,"Rondes effectuées",3]
[21,{"$f":"VLOOKUP(A87,'Numéro licences'!$H$4:$I$47,2)","v":"MILET Benoit"},"Aller-Retour","Km  renseignés",{"$f":"SUM('Pilotes Nat'!CL88)","v":0},null,"Km  renseignés",{"$f":"SUM('Pilotes Inter'!CM87)","v":532},null,"Km  renseignés",532]
[null,null,"Ronde","Km confirmés",{"$f":"SUM('Pilotes Nat'!CL89)","v":0},null,"Km confirmés",{"$f":"SUM('Pilotes Inter'!CM88)","v":532},null,"Km confirmés",532]
[null,null,null,"Rondes confirmées",{"$f":"SUM('Pilotes Nat'!CL90)","v":0},null,"Rondes confirmées",{"$f":"SUM('Pilotes Inter'!CM89)","v":1},null,"Rondes confirmées",1]
[null,null,null,"Rondes effectuées",{"$f":"SUM('Pilotes Nat'!CL91)","v":0},null,"Rondes effectuées",{"$f":"SUM('Pilotes Inter'!CM90)","v":1},null,"Rondes effectuées",1]
[22,{"$f":"VLOOKUP(A91,'Numéro licences'!$H$4:$I$47,2)","v":"NIHOUL Dany"},"Aller-Retour","Km  renseignés",{"$f":"SUM('Pilotes Nat'!CL92)","v":5197},null,"Km  renseignés",{"$f":"SUM('Pilotes Inter'!CM91)","v":1462},null,"Km  renseignés",6659]
[null,null,"Ronde","Km confirmés",{"$f":"SUM('Pilotes Nat'!CL93)","v":5197},null,"Km confirmés",{"$f":"SUM('Pilotes Inter'!CM92)","v":1462},null,"Km confirmés",6659]
[null,null,null,"Rondes confirmées",{"$f":"SUM('Pilotes Nat'!CL94)","v":16},null,"Rondes confirmées",{"$f":"SUM('Pilotes Inter'!CM93)","v":1},null,"Rondes confirmées",17]
[null,null,null,"Rondes effectuées",{"$f":"SUM('Pilotes Nat'!CL95)","v":14},null,"Rondes effectuées",{"$f":"SUM('Pilotes Inter'!CM94)","v":1},null,"Rondes effectuées",15]
[23,{"$f":"VLOOKUP(A95,'Numéro licences'!$H$4:$I$47,2)","v":"OVAERE Jimmy"},"Aller-Retour","Km  renseignés",{"$f":"SUM('Pilotes Nat'!CL96)","v":0},null,"Km  renseignés",{"$f":"SUM('Pilotes Inter'!CM95)","v":0},null,"Km  renseignés",0]
[null,null,"Ronde","Km confirmés",{"$f":"SUM('Pilotes Nat'!CL97)","v":0},null,"Km confirmés",{"$f":"SUM('Pilotes Inter'!CM96)","v":0},null,"Km confirmés",0]
[null,null,null,"Rondes confirmées",{"$f":"SUM('Pilotes Nat'!CL98)","v":0},null,"Rondes confirmées",{"$f":"SUM('Pilotes Inter'!CM97)","v":0},null,"Rondes confirmées",0]
[null,null,null,"Rondes effectuées",{"$f":"SUM('Pilotes Nat'!CL99)","v":0},null,"Rondes effectuées",{"$f":"SUM('Pilotes Inter'!CM98)","v":0},null,"Rondes effectuées",0]
[24,{"$f":"VLOOKUP(A99,'Numéro licences'!$H$4:$I$47,2)","v":"PARMENTIER Dominique"},"Aller-Retour","Km  renseignés",{"$f":"SUM('Pilotes Nat'!CL100)","v":564},null,"Km  renseignés",{"$f":"SUM('Pilotes Inter'!CM99)","v":0},null,"Km  renseignés",564]
[null,null,"Ronde","Km confirmés",{"$f":"SUM('Pilotes Nat'!CL101)","v":564},null,"Km confirmés",{"$f":"SUM('Pilotes Inter'!CM100)","v":0},null,"Km confirmés",564]
[null,null,null,"Rondes confirmées",{"$f":"SUM('Pilotes Nat'!CL102)","v":1},null,"Rondes confirmées",{"$f":"SUM('Pilotes Inter'!CM101)","v":0},null,"Rondes confirmées",1]
[null,null,null,"Rondes effectuées",{"$f":"SUM('Pilotes Nat'!CL103)","v":3},null,"Rondes effectuées",{"$f":"SUM('Pilotes Inter'!CM102)","v":0},null,"Rondes effectuées",3]
[25,{"$f":"VLOOKUP(A103,'Numéro licences'!$H$4:$I$47,2)","v":"POCHET Jean-Dominique"},"Aller-Retour","Km  renseignés",{"$f":"SUM('Pilotes Nat'!CL104)","v":0},null,"Km  renseignés",{"$f":"SUM('Pilotes Inter'!CM103)","v":0},null,"Km  renseignés",0]
[null,null,"Ronde","Km confirmés",{"$f":"SUM('Pilotes Nat'!CL105)","v":0},null,"Km confirmés",{"$f":"SUM('Pilotes Inter'!CM104)","v":0},null,"Km confirmés",0]
[null,null,null,"Rondes confirmées",{"$f":"SUM('Pilotes Nat'!CL106)","v":0},null,"Rondes confirmées",{"$f":"SUM('Pilotes Inter'!CM105)","v":0},null,"Rondes confirmées",0]
[null,null,null,"Rondes effectuées",{"$f":"SUM('Pilotes Nat'!CL107)","v":0},null,"Rondes effectuées",{"$f":"SUM('Pilotes Inter'!CM106)","v":0},null,"Rondes effectuées",0]
[26,{"$f":"VLOOKUP(A107,'Numéro licences'!$H$4:$I$47,2)","v":"POMPIER Philippe"},"Aller-Retour","Km  renseignés",{"$f":"SUM('Pilotes Nat'!CL108)","v":0},null,"Km  renseignés",{"$f":"SUM('Pilotes Inter'!CM107)","v":0},null,"Km  renseignés",0]
[null,null,"Ronde","Km confirmés",{"$f":"SUM('Pilotes Nat'!CL109)","v":0},null,"Km confirmés",{"$f":"SUM('Pilotes Inter'!CM108)","v":0},null,"Km confirmés",0]
[null,null,null,"Rondes confirmées",{"$f":"SUM('Pilotes Nat'!CL110)","v":0},null,"Rondes confirmées",{"$f":"SUM('Pilotes Inter'!CM109)","v":0},null,"Rondes confirmées",0]
[null,null,null,"Rondes effectuées",{"$f":"SUM('Pilotes Nat'!CL111)","v":0},null,"Rondes effectuées",{"$f":"SUM('Pilotes Inter'!CM110)","v":0},null,"Rondes effectuées",0]
[27,{"$f":"VLOOKUP(A111,'Numéro licences'!$H$4:$I$47,2)","v":"RAMEAU Didier"},"Aller-Retour","Km  renseignés",{"$f":"SUM('Pilotes Nat'!CL112)","v":1311},null,"Km  renseignés",{"$f":"SUM('Pilotes Inter'!CM111)","v":0},null,"Km  renseignés",1311]
[null,null,"Ronde","Km confirmés",{"$f":"SUM('Pilotes Nat'!CL113)","v":0},null,"Km confirmés",{"$f":"SUM('Pilotes Inter'!CM112)","v":0},null,"Km confirmés",0]
[null,null,null,"Rondes confirmées",{"$f":"SUM('Pilotes Nat'!CL114)","v":0},null,"Rondes confirmées",{"$f":"SUM('Pilotes Inter'!CM113)","v":0},null,"Rondes confirmées",0]
[null,null,null,"Rondes effectuées",{"$f":"SUM('Pilotes Nat'!CL115)","v":4},null,"Rondes effectuées",{"$f":"SUM('Pilotes Inter'!CM114)","v":0},null,"Rondes effectuées",4]
[28,{"$f":"VLOOKUP(A115,'Numéro licences'!$H$4:$I$47,2)","v":"SPITAELS Bernard"},"Aller-Retour","Km  renseignés",{"$f":"SUM('Pilotes Nat'!CL116)","v":517},null,"Km  renseignés",{"$f":"SUM('Pilotes Inter'!CM115)","v":0},null,"Km  renseignés",517]
[null,null,"Ronde","Km confirmés",{"$f":"SUM('Pilotes Nat'!CL117)","v":0},null,"Km confirmés",{"$f":"SUM('Pilotes Inter'!CM116)","v":0},null,"Km confirmés",0]
[null,null,null,"Rondes confirmées",{"$f":"SUM('Pilotes Nat'!CL118)","v":0},null,"Rondes confirmées",{"$f":"SUM('Pilotes Inter'!CM117)","v":0},null,"Rondes confirmées",0]
[null,null,null,"Rondes effectuées",{"$f":"SUM('Pilotes Nat'!CL119)","v":2},null,"Rondes effectuées",{"$f":"SUM('Pilotes Inter'!CM118)","v":0},null,"Rondes effectuées",2]
[29,{"$f":"VLOOKUP(A119,'Numéro licences'!$H$4:$I$47,2)","v":"TERWAGNE Freddy"},"Aller-Retour","Km  renseignés",{"$f":"SUM('Pilotes Nat'!CL120)","v":0},null,"Km  renseignés",{"$f":"SUM('Pilotes Inter'!CM119)","v":0},null,"Km  renseignés",0]
[null,null,"Ronde","Km confirmés",{"$f":"SUM('Pilotes Nat'!CL121)","v":0},null,"Km confirmés",{"$f":"SUM('Pilotes Inter'!CM120)","v":0},null,"Km confirmés",0]
[null,null,null,"Rondes confirmées",{"$f":"SUM('Pilotes Nat'!CL122)","v":0},null,"Rondes confirmées",{"$f":"SUM('Pilotes Inter'!CM121)","v":0},null,"Rondes confirmées",0]
[null,null,null,"Rondes effectuées",{"$f":"SUM('Pilotes Nat'!CL123)","v":0},null,"Rondes effectuées",{"$f":"SUM('Pilotes Inter'!CM122)","v":0},null,"Rondes effectuées",0]
[30,{"$f":"VLOOKUP(A123,'Numéro licences'!$H$4:$I$47,2)","v":"TERWAGNE Julien"},"Aller-Retour","Km  renseignés",{"$f":"SUM('Pilotes Nat'!CL124)","v":0},null,"Km  renseignés",{"$f":"SUM('Pilotes Inter'!CM123)","v":0},null,"Km  renseignés",0]
[null,null,"Ronde","Km confirmés",{"$f":"SUM('Pilotes Nat'!CL125)","v":0},null,"Km confirmés",{"$f":"SUM('Pilotes Inter'!CM124)","v":0},null,"Km confirmés",0]
[null,null,null,"Rondes confirmées",{"$f":"SUM('Pilotes Nat'!CL126)","v":0},null,"Rondes confirmées",{"$f":"SUM('Pilotes Inter'!CM125)","v":0},null,"Rondes confirmées",0]
[null,null,null,"Rondes effectuées",{"$f":"SUM('Pilotes Nat'!CL127)","v":0},null,"Rondes effectuées",{"$f":"SUM('Pilotes Inter'!CM126)","v":0},null,"Rondes effectuées",0]
[31,{"$f":"VLOOKUP(A127,'Numéro licences'!$H$4:$I$47,2)","v":"THOMAS Isabelle"},"Aller-Retour","Km  renseignés",{"$f":"SUM('Pilotes Nat'!CL128)","v":0},null,"Km  renseignés",{"$f":"SUM('Pilotes Inter'!CM127)","v":0},null,"Km  renseignés",0]
[null,null,"Ronde","Km confirmés",{"$f":"SUM('Pilotes Nat'!CL129)","v":0},null,"Km confirmés",{"$f":"SUM('Pilotes Inter'!CM128)","v":0},null,"Km confirmés",0]
[null,null,null,"Rondes confirmées",{"$f":"SUM('Pilotes Nat'!CL130)","v":0},null,"Rondes confirmées",{"$f":"SUM('Pilotes Inter'!CM129)","v":0},null,"Rondes confirmées",0]
[null,null,null,"Rondes effectuées",{"$f":"SUM('Pilotes Nat'!CL131)","v":0},null,"Rondes effectuées",{"$f":"SUM('Pilotes Inter'!CM130)","v":0},null,"Rondes effectuées",0]
[32,{"$f":"VLOOKUP(A131,'Numéro licences'!$H$4:$I$47,2)","v":"URBAIN Philippe"},"Aller-Retour","Km  renseignés",{"$f":"SUM('Pilotes Nat'!CL132)","v":156},null,"Km  renseignés",{"$f":"SUM('Pilotes Inter'!CM131)","v":1417},null,"Km  renseignés",1573]
[null,null,"Ronde","Km confirmés",{"$f":"SUM('Pilotes Nat'!CL133)","v":0},null,"Km confirmés",{"$f":"SUM('Pilotes Inter'!CM132)","v":1417},null,"Km confirmés",1417]
[null,null,null,"Rondes confirmées",{"$f":"SUM('Pilotes Nat'!CL134)","v":0},null,"Rondes confirmées",{"$f":"SUM('Pilotes Inter'!CM133)","v":1},null,"Rondes confirmées",1]
[null,null,null,"Rondes effectuées",{"$f":"SUM('Pilotes Nat'!CL135)","v":1},null,"Rondes effectuées",{"$f":"SUM('Pilotes Inter'!CM134)","v":1},null,"Rondes effectuées",2]
[33,{"$f":"VLOOKUP(A135,'Numéro licences'!$H$4:$I$47,2)","v":"VANBELLINGEN Jean-Claude"},"Aller-Retour","Km  renseignés",{"$f":"SUM('Pilotes Nat'!CL136)","v":863},null,"Km  renseignés",{"$f":"SUM('Pilotes Inter'!CM135)","v":0},null,"Km  renseignés",863]
[null,null,"Ronde","Km confirmés",{"$f":"SUM('Pilotes Nat'!CL137)","v":0},null,"Km confirmés",{"$f":"SUM('Pilotes Inter'!CM136)","v":0},null,"Km confirmés",{"$f":"SUM(E136+H136)","v":0}]
[null,null,null,"Rondes confirmées",{"$f":"SUM('Pilotes Nat'!CL138)","v":0},null,"Rondes confirmées",{"$f":"SUM('Pilotes Inter'!CM137)","v":0},null,"Rondes confirmées",0]
[null,null,null,"Rondes effectuées",{"$f":"SUM('Pilotes Nat'!CL139)","v":3},null,"Rondes effectuées",{"$f":"SUM('Pilotes Inter'!CM138)","v":0},null,"Rondes effectuées",3]
[34,{"$f":"VLOOKUP(A139,'Numéro licences'!$H$4:$I$47,2)","v":"VANDEN BOSSCHE Vincent"},"Aller-Retour","Km  renseignés",{"$f":"SUM('Pilotes Nat'!CL140)","v":0},null,"Km  renseignés",{"$f":"SUM('Pilotes Inter'!CM139)","v":0},null,"Km  renseignés",0]
[null,null,"Ronde","Km confirmés",{"$f":"SUM('Pilotes Nat'!CL141)","v":0},null,"Km confirmés",{"$f":"SUM('Pilotes Inter'!CM140)","v":0},null,"Km confirmés",0]
[null,null,null,"Rondes confirmées",{"$f":"SUM('Pilotes Nat'!CL142)","v":0},null,"Rondes confirmées",{"$f":"SUM('Pilotes Inter'!CM141)","v":0},null,"Rondes confirmées",0]
[null,null,null,"Rondes effectuées",{"$f":"SUM('Pilotes Nat'!CL143)","v":0},null,"Rondes effectuées",{"$f":"SUM('Pilotes Inter'!CM142)","v":0},null,"Rondes effectuées",0]
[35,{"$f":"VLOOKUP(A143,'Numéro licences'!$H$4:$I$47,2)","v":"VANDEN WAEYENBERGH Michel"},"Aller-Retour","Km  renseignés",{"$f":"SUM('Pilotes Nat'!CL144)","v":0},null,"Km  renseignés",{"$f":"SUM('Pilotes Inter'!CM143)","v":0},null,"Km  renseignés",0]
[null,null,"Ronde","Km confirmés",{"$f":"SUM('Pilotes Nat'!CL145)","v":0},null,"Km confirmés",{"$f":"SUM('Pilotes Inter'!CM144)","v":0},null,"Km confirmés",0]
[null,null,null,"Rondes confirmées",{"$f":"SUM('Pilotes Nat'!CL146)","v":0},null,"Rondes confirmées",{"$f":"SUM('Pilotes Inter'!CM145)","v":0},null,"Rondes confirmées",0]
[null,null,null,"Rondes effectuées",{"$f":"SUM('Pilotes Nat'!CL147)","v":0},null,"Rondes effectuées",{"$f":"SUM('Pilotes Inter'!CM146)","v":0},null,"Rondes effectuées",0]
[36,{"$f":"VLOOKUP(A147,'Numéro licences'!$H$4:$I$47,2)","v":"VANSTEYVOORT André"},"Aller-Retour","Km  renseignés",{"$f":"SUM('Pilotes Nat'!CL148)","v":200},null,"Km  renseignés",{"$f":"SUM('Pilotes Inter'!CM147)","v":0},null,"Km  renseignés",200]
[null,null,"Ronde","Km confirmés",{"$f":"SUM('Pilotes Nat'!CL149)","v":0},null,"Km confirmés",{"$f":"SUM('Pilotes Inter'!CM148)","v":0},null,"Km confirmés",0]
[null,null,null,"Rondes confirmées",{"$f":"SUM('Pilotes Nat'!CL150)","v":0},null,"Rondes confirmées",{"$f":"SUM('Pilotes Inter'!CM149)","v":0},null,"Rondes confirmées",0]
[null,null,null,"Rondes effectuées",{"$f":"SUM('Pilotes Nat'!CL151)","v":0},null,"Rondes effectuées",{"$f":"SUM('Pilotes Inter'!CM150)","v":0},null,"Rondes effectuées",0]
[37,{"$f":"VLOOKUP(A151,'Numéro licences'!$H$4:$I$47,2)","v":"WOUTERS Olivier"},"Aller-Retour","Km  renseignés",{"$f":"SUM('Pilotes Nat'!CL152)","v":4681},null,"Km  renseignés",{"$f":"SUM('Pilotes Inter'!CM151)","v":0},null,"Km  renseignés",4681]
[null,null,"Ronde","Km confirmés",{"$f":"SUM('Pilotes Nat'!CL153)","v":4681},null,"Km confirmés",{"$f":"SUM('Pilotes Inter'!CM152)","v":0},null,"Km confirmés",4681]
[null,null,null,"Rondes confirmées",{"$f":"SUM('Pilotes Nat'!CL154)","v":14},null,"Rondes confirmées",{"$f":"SUM('Pilotes Inter'!CM153)","v":0},null,"Rondes confirmées",14]
[null,null,null,"Rondes effectuées",{"$f":"SUM('Pilotes Nat'!CL155)","v":13},null,"Rondes effectuées",{"$f":"SUM('Pilotes Inter'!CM154)","v":0},null,"Rondes effectuées",13]
[38,{"$f":"VLOOKUP(A155,'Numéro licences'!$H$4:$I$47,2)","v":"DEMETS Eric"},"Aller-Retour","Km  renseignés",{"$f":"SUM('Pilotes Nat'!CL156)","v":751},null,"Km  renseignés",{"$f":"SUM('Pilotes Inter'!CM155)","v":0},null,"Km  renseignés",751]
[null,null,"Ronde","Km confirmés",{"$f":"SUM('Pilotes Nat'!CL157)","v":0},null,"Km confirmés",{"$f":"SUM('Pilotes Inter'!CM156)","v":0},null,"Km confirmés",0]
[null,null,null,"Rondes confirmées",{"$f":"SUM('Pilotes Nat'!CL158)","v":0},null,"Rondes confirmées",{"$f":"SUM('Pilotes Inter'!CM157)","v":0},null,"Rondes confirmées",0]
[null,null,null,"Rondes effectuées",{"$f":"SUM('Pilotes Nat'!CL159)","v":1},null,"Rondes effectuées",{"$f":"SUM('Pilotes Inter'!CM158)","v":0},null,"Rondes effectuées",1]
[39,{"$f":"VLOOKUP(A159,'Numéro licences'!$H$4:$I$47,2)","v":"DECELLE Hubert"},"Aller-Retour","Km  renseignés",{"$f":"SUM('Pilotes Nat'!CL160)","v":751},null,"Km  renseignés",{"$f":"SUM('Pilotes Inter'!CM159)","v":0},null,"Km  renseignés",751]
[null,null,"Ronde","Km confirmés",{"$f":"SUM('Pilotes Nat'!CL161)","v":0},null,"Km confirmés",{"$f":"SUM('Pilotes Inter'!CM160)","v":0},null,"Km confirmés",0]
[null,null,null,"Rondes confirmées",{"$f":"SUM('Pilotes Nat'!CL162)","v":0},null,"Rondes confirmées",{"$f":"SUM('Pilotes Inter'!CM161)","v":0},null,"Rondes confirmées",0]
[null,null,null,"Rondes effectuées",{"$f":"SUM('Pilotes Nat'!CL163)","v":1},null,"Rondes effectuées",{"$f":"SUM('Pilotes Inter'!CM162)","v":0},null,"Rondes effectuées",1]
[40,{"$f":"VLOOKUP(A163,'Numéro licences'!$H$4:$I$47,2)","v":0},"Aller-Retour","Km  renseignés",{"$f":"SUM('Pilotes Nat'!CL164)","v":0},null,"Km  renseignés",{"$f":"SUM('Pilotes Inter'!CM163)","v":0},null,"Km  renseignés",0]
[null,null,"Ronde","Km confirmés",{"$f":"SUM('Pilotes Nat'!CL165)","v":0},null,"Km confirmés",{"$f":"SUM('Pilotes Inter'!CM164)","v":0},null,"Km confirmés",0]
[null,null,null,"Rondes confirmées",{"$f":"SUM('Pilotes Nat'!CL166)","v":0},null,"Rondes confirmées",{"$f":"SUM('Pilotes Inter'!CM165)","v":0},null,"Rondes confirmées",0]
[null,null,null,"Rondes effectuées",{"$f":"SUM('Pilotes Nat'!CL167)","v":0},null,"Rondes effectuées",{"$f":"SUM('Pilotes Inter'!CM166)","v":0},null,"Rondes effectuées",0]
[41,{"$f":"VLOOKUP(A167,'Numéro licences'!$H$4:$I$47,2)","v":0},"Aller-Retour","Km  renseignés",{"$f":"SUM('Pilotes Nat'!CL168)","v":0},null,"Km  renseignés",{"$f":"SUM('Pilotes Inter'!CM167)","v":0},null,"Km  renseignés",0]
[null,null,"Ronde","Km confirmés",{"$f":"SUM('Pilotes Nat'!CL169)","v":0},null,"Km confirmés",{"$f":"SUM('Pilotes Inter'!CM168)","v":0},null,"Km confirmés",0]
[null,null,null,"Rondes confirmées",{"$f":"SUM('Pilotes Nat'!CL170)","v":0},null,"Rondes confirmées",{"$f":"SUM('Pilotes Inter'!CM169)","v":0},null,"Rondes confirmées",0]
[null,null,null,"Rondes effectuées",{"$f":"SUM('Pilotes Nat'!CL171)","v":0},null,"Rondes effectuées",{"$f":"SUM('Pilotes Inter'!CM170)","v":0},null,"Rondes effectuées",0]
[42,{"$f":"VLOOKUP(A171,'Numéro licences'!$H$4:$I$47,2)","v":0},"Aller-Retour","Km  renseignés",{"$f":"SUM('Pilotes Nat'!CL172)","v":0},null,"Km  renseignés",{"$f":"SUM('Pilotes Inter'!CM171)","v":0},null,"Km  renseignés",0]
[null,null,"Ronde","Km confirmés",{"$f":"SUM('Pilotes Nat'!CL173)","v":0},null,"Km confirmés",{"$f":"SUM('Pilotes Inter'!CM172)","v":0},null,"Km confirmés",0]
[null,null,null,"Rondes confirmées",{"$f":"SUM('Pilotes Nat'!CL174)","v":0},null,"Rondes confirmées",{"$f":"SUM('Pilotes Inter'!CM173)","v":0},null,"Rondes confirmées",0]
[null,null,null,"Rondes effectuées",{"$f":"SUM('Pilotes Nat'!CL175)","v":0},null,"Rondes effectuées",{"$f":"SUM('Pilotes Inter'!CM174)","v":0},null,"Rondes effectuées",0]
[43,{"$f":"VLOOKUP(A175,'Numéro licences'!$H$4:$I$47,2)","v":0},"Aller-Retour","Km  renseignés",{"$f":"SUM('Pilotes Nat'!CL176)","v":0},null,"Km  renseignés",{"$f":"SUM('Pilotes Inter'!CM175)","v":0},null,"Km  renseignés",0]
[null,null,"Ronde","Km confirmés",{"$f":"SUM('Pilotes Nat'!CL177)","v":0},null,"Km confirmés",{"$f":"SUM('Pilotes Inter'!CM176)","v":0},null,"Km confirmés",0]
[null,null,null,"Rondes confirmées",{"$f":"SUM('Pilotes Nat'!CL178)","v":0},null,"Rondes confirmées",{"$f":"SUM('Pilotes Inter'!CM177)","v":0},null,"Rondes confirmées",0]
[null,null,null,"Rondes effectuées",{"$f":"SUM('Pilotes Nat'!CL179)","v":0},null,"Rondes effectuées",{"$f":"SUM('Pilotes Inter'!CM178)","v":0},null,"Rondes effectuées",0]
[44,{"$f":"VLOOKUP(A179,'Numéro licences'!$H$4:$I$47,2)","v":0},"Aller-Retour","Km  renseignés",{"$f":"SUM('Pilotes Nat'!CL180)","v":0},null,"Km  renseignés",{"$f":"SUM('Pilotes Inter'!CM179)","v":0},null,"Km  renseignés",0]
[null,null,"Ronde","Km confirmés",{"$f":"SUM('Pilotes Nat'!CL181)","v":0},null,"Km confirmés",{"$f":"SUM('Pilotes Inter'!CM180)","v":0},null,"Km confirmés",0]
[null,null,null,"Rondes confirmées",{"$f":"SUM('Pilotes Nat'!CL182)","v":0},null,"Rondes confirmées",{"$f":"SUM('Pilotes Inter'!CM181)","v":0},null,"Rondes confirmées",0]
[null,null,null,"Rondes effectuées",{"$f":"SUM('Pilotes Nat'!CL183)","v":0},null,"Rondes effectuées",{"$f":"SUM('Pilotes Inter'!CM182)","v":0},null,"Rondes effectuées",0]
[45,{"$f":"VLOOKUP(A183,'Numéro licences'!$H$4:$I$47,2)","v":0},"Aller-Retour","Km  renseignés",{"$f":"SUM('Pilotes Nat'!CL184)","v":0},null,"Km  renseignés",{"$f":"SUM('Pilotes Inter'!CM183)","v":0},null,"Km  renseignés",0]
[null,null,"Ronde","Km confirmés",{"$f":"SUM('Pilotes Nat'!CL185)","v":0},null,"Km confirmés",{"$f":"SUM('Pilotes Inter'!CM184)","v":0},null,"Km confirmés",0]
[null,null,null,"Rondes confirmées",{"$f":"SUM('Pilotes Nat'!CL186)","v":0},null,"Rondes confirmées",{"$f":"SUM('Pilotes Inter'!CM185)","v":0},null,"Rondes confirmées",0]
[null,null,null,"Rondes effectuées",{"$f":"SUM('Pilotes Nat'!CL187)","v":0},null,"Rondes effectuées",{"$f":"SUM('Pilotes Inter'!CM186)","v":0},null,"Rondes effectuées",0]
[46,{"$f":"VLOOKUP(A187,'Numéro licences'!$H$4:$I$47,2)","v":0},"Aller-Retour","Km  renseignés",{"$f":"SUM('Pilotes Nat'!CL188)","v":0},null,"Km  renseignés",{"$f":"SUM('Pilotes Inter'!CM187)","v":0},null,"Km  renseignés",0]
[null,null,"Ronde","Km confirmés",{"$f":"SUM('Pilotes Nat'!CL189)","v":0},null,"Km confirmés",{"$f":"SUM('Pilotes Inter'!CM188)","v":0},null,"Km confirmés",0]
[null,null,null,"Rondes confirmées",{"$f":"SUM('Pilotes Nat'!CL190)","v":0},null,"Rondes confirmées",{"$f":"SUM('Pilotes Inter'!CM189)","v":0},null,"Rondes confirmées",0]
[null,null,null,"Rondes effectuées",{"$f":"SUM('Pilotes Nat'!CL191)","v":0},null,"Rondes effectuées",{"$f":"SUM('Pilotes Inter'!CM190)","v":0},null,"Rondes effectuées",0]
[]
[]
[null,null,null,"Rondes confirmées",{"$f":"SUM(E9+E13+E17+E21+E25+E29+E33+E37+E41+E45+E49+E53+E57+E61+E65+E69+E73+E77+E81+E85+E89+E93+E97+E101+E105+E109+E113+E117+E121+E125+E129+E133+E137+E141+E145+E149+E153+E157+E161+E165+E169+E173+E177+E181+E185+E189)","v":96},null,"Rondes confirmées",{"$f":"SUM(H9+H13+H17+H21+H25+H29+H33+H37+H41+H45+H49+H53+H57+H61+H65+H69+H73+H77+H81+H85+H89+H93+H97+H101+H105+H109+H113+H117+H121+H125+H129+H133+H137+H141+H145+H149+H153+H157+H161+H165+H169+H173+H177+H181+H185+H189)","v":8},null,"Rondes confirmées",{"$f":"SUM(K9+K13+K17+K21+K25+K29+K33+K37+K41+K45+K49+K53+K57+K61+K65+K69+K73+K77+K81+K85+K89+K93+K97+K101+K105+K109+K113+K117+K121+K125+K129+K133+K137+K141+K145+K149+K153+K157+K161+K165+K169+K173+K177+K181+K185+K189)","v":104}]
[null,null,null,"Rondes effectuées",{"$f":"SUM(E10+E14+E18+E22+E26+E30+E34+E38+E42+E46+E50+E54+E58+E62+E66+E70+E74+E78+E82+E86+E90+E94+E98+E102+E106+E110+E114+E118+E122+E126+E130+E134+E138+E142+E146+E150+E154+E158+E162+E166+E170+E174+E178+E182+E186+E190)","v":120},null,"Rondes effectuées",{"$f":"SUM(H10+H14+H18+H22+H26+H30+H34+H38+H42+H46+H50+H54+H58+H62+H66+H70+H74+H78+H82+H86+H90+H94+H98+H102+H106+H110+H114+H118+H122+H126+H130+H134+H138+H142+H146+H150+H154+H158+H162+H166+H170+H174+H178+H182+H186+H190)","v":8},null,"Rondes effectuées",{"$f":"SUM(K10+K14+K18+K22+K26+K30+K34+K38+K42+K46+K50+K54+K58+K62+K66+K70+K74+K78+K82+K86+K90+K94+K98+K102+K106+K110+K114+K118+K122+K126+K130+K134+K138+K142+K146+K150+K154+K158+K162+K166+K170+K174+K178+K182+K186+K190)","v":128}]
[]
[]
[]
[]
[]
[null,"Colonne1"]
[1,"BALLION Pierre"]
[{"$f":"SUM(A201+1)","v":2},"BERDOYES Yannick"]
[3,"CLAISSE Jean-Luc"]
[4,"DAVIN Philippe"]
[5,"DE BONDT Philippe"]
[6,"DE SCHEPPERS Jean-Claude"]
[7,"DECELLE Hubert"]
[8,"DEHAUT Didier"]
[9,"DELFORGE Patrice"]
[10,"DONY Marc"]
[11,"FAVRESSSE René"]
[12,"FONTAINE Guy"]
[13,"GOOSSENS Joël"]
[14,"LAMBOTTE Didier"]
[15,"LEFEVRE Didier"]
[16,"LEROY Michel"]
[17,"LONDOT Philippe"]
[18,"MALLIEN Philippe"]
[19,"MILET Benoit"]
[20,"MOTTE Albert"]
[21,"NIHOUL Dany"]
[22,"PARMENTIER Dominique"]
[23,"POMPIER Philippe"]
[24,"QUETS Serge"]
[25,"RICHARD Didier"]
[26,"SERGI Gérard"]
[27,"SMETS Rudy"]
[28,"STRYPSTEIN Nicolas"]
[29,"VAN DEN ABBEEL Christian"]
[30,"VANBELLINGEN Jean-Claude"]
[31,"VANDERVELDEN Robert"]
[32]
[33]
[34]
[35]
[36]
[37]
[38]
[39]
[40]
[41]
[42]
[43]
[44]
[45]
[46]

{"sheet":"Résumé Passagers","index":3,"n_rows":178,"n_cols":24,"rows_kept":178,"cut":false,"hidden":false,"merged":[[106,1,109,1],[110,1,113,1],[114,1,117,1],[118,1,121,1],[86,1,89,1],[90,1,93,1],[94,1,97,1],[98,1,101,1],[102,1,105,1],[66,1,69,1],[70,1,73,1],[74,1,77,1],[78,1,81,1],[82,1,85,1],[46,1,49,1],[50,1,53,1],[54,1,57,1],[58,1,61,1],[62,1,65,1],[26,1,29,1],[30,1,33,1],[34,1,37,1],[38,1,41,1],[42,1,45,1],[6,1,9,1],[10,1,13,1],[14,1,17,1],[18,1,21,1],[22,1,25,1],[0,3,0,10],[2,20,3,23],[2,14,3,17],[4,3,4,4],[4,6,4,7],[4,9,4,10]]}
[null,null,null,"PASSAGERS"]
[]
[null,null,null,null,null,null,null,null,null,null,null,null,null,null,"Confirmé",null,null,null,null,null,"Non-confirmé"]
[null,"Aller-Retour"]
[null,"Ronde",null,"NATIONAL",null,null,"INTERNATIONAL",null,null,"SCRATCH",null,null,null,null,"Passager","National","International","Total",null,null,"Passager","National","International","Total"]
[null,null,null,null,"TOTAL",null,null,"TOTAL",null,null,"TOTAL",null,null,1,{"$f":"VLOOKUP(N6,'Numéro licences'!$A$4:$B$32,2)","v":"BRIATTE Joëlle"},{"$f":"SUM(E8)","v":0},{"$f":"SUM(H8)","v":0},{"$f":"SUM(P6:Q6)","v":0},null,1,{"$f":"VLOOKUP(T6,'Numéro licences'!$A$4:$B$32,2)","v":"BRIATTE Joëlle"},{"$f":"SUM(E7)","v":0},{"$f":"SUM(H7)","v":0},{"$f":"SUM(V6:W6)","v":0}]
[1,{"$f":"VLOOKUP(A7,'Numéro licences'!$A$4:$B$32,2)","v":"BRIATTE Joëlle"},"Aller-Retour","Km  renseignés",{"$f":"SUM('Passagers Nat'!CL8)","v":0},null,"Km  renseignés",{"$f":"SUM('Passagers Inter'!CM7)","v":0},null,"Km  renseignés",{"$f":"SUM(E7+H7)","v":0},null,null,2,{"$f":"VLOOKUP(N7,'Numéro licences'!$A$4:$B$32,2)","v":"DEL FABBRO Laurence"},{"$f":"SUM(E12)","v":0},{"$f":"SUM(H12)","v":1379},{"$f":"SUM(P7:Q7)","v":1379},null,2,{"$f":"VLOOKUP(T7,'Numéro licences'!$A$4:$B$32,2)","v":"DEL FABBRO Laurence"},{"$f":"SUM(E11)","v":200},{"$f":"SUM(H11)","v":1379},1579]
[null,null,"Ronde","Km confirmés",{"$f":"SUM('Passagers Nat'!CL9)","v":0},null,"Km confirmés",{"$f":"SUM('Passagers Inter'!CM8)","v":0},null,"Km confirmés",{"$f":"SUM(E8+H8)","v":0},null,null,3,{"$f":"VLOOKUP(N8,'Numéro licences'!$A$4:$B$32,2)","v":"ERVEN France"},{"$f":"SUM(E16)","v":0},{"$f":"SUM(H16)","v":0},0,null,3,{"$f":"VLOOKUP(T8,'Numéro licences'!$A$4:$B$32,2)","v":"ERVEN France"},{"$f":"SUM(E15)","v":517},{"$f":"SUM(H15)","v":0},517]
[null,null,null,"Rondes confirmées",{"$f":"SUM('Passagers Nat'!CL10)","v":0},null,"Rondes confirmées",{"$f":"SUM('Passagers Inter'!CM9)","v":0},null,"Rondes confirmées",0,null,null,4,{"$f":"VLOOKUP(N9,'Numéro licences'!$A$4:$B$32,2)","v":"FIEVET Nathalie"},{"$f":"SUM(E20)","v":0},{"$f":"SUM(H20)","v":0},0,null,4,{"$f":"VLOOKUP(T9,'Numéro licences'!$A$4:$B$32,2)","v":"FIEVET Nathalie"},{"$f":"SUM(E19)","v":0},{"$f":"SUM(H19)","v":0},0]
[null,null,null,"Rondes effectuées",{"$f":"SUM('Passagers Nat'!CL11)","v":0},null,"Rondes effectuées",{"$f":"SUM('Passagers Inter'!CM10)","v":0},null,"Rondes effectuées",0,null,null,5,{"$f":"VLOOKUP(N10,'Numéro licences'!$A$4:$B$32,2)","v":"GIAUX Annie"},{"$f":"SUM(E24)","v":0},{"$f":"SUM(H24)","v":0},0,null,5,{"$f":"VLOOKUP(T10,'Numéro licences'!$A$4:$B$32,2)","v":"GIAUX Annie"},{"$f":"SUM(E23)","v":846},{"$f":"SUM(H23)","v":0},846]
[2,{"$f":"VLOOKUP(A11,'Numéro licences'!$A$4:$B$32,2)","v":"DEL FABBRO Laurence"},"Aller-Retour","Km  renseignés",{"$f":"SUM('Passagers Nat'!CL12)","v":200},null,"Km  renseignés",{"$f":"SUM('Passagers Inter'!CM11)","v":1379},null,"Km  renseignés",1579,null,null,6,{"$f":"VLOOKUP(N11,'Numéro licences'!$A$4:$B$32,2)","v":"GOFFIN Guillaume"},{"$f":"SUM(E28)","v":0},{"$f":"SUM(H28)","v":0},0,null,6,{"$f":"VLOOKUP(T11,'Numéro licences'!$A$4:$B$32,2)","v":"GOFFIN Guillaume"},{"$f":"SUM(E27)","v":0},{"$f":"SUM(H27)","v":0},0]
[null,null,"Ronde","Km confirmés",{"$f":"SUM('Passagers Nat'!CL13)","v":0},null,"Km confirmés",{"$f":"SUM('Passagers Inter'!CM12)","v":1379},null,"Km confirmés",1379,null,null,7,{"$f":"VLOOKUP(N12,'Numéro licences'!$A$4:$B$32,2)","v":"GREGORICS Kathy"},{"$f":"SUM(E32)","v":0},{"$f":"SUM(H32)","v":1462},1462,null,7,{"$f":"VLOOKUP(T12,'Numéro licences'!$A$4:$B$32,2)","v":"GREGORICS Kathy"},{"$f":"SUM(E31)","v":200},{"$f":"SUM(H31)","v":1462},1662]
[null,null,null,"Rondes confirmées",{"$f":"SUM('Passagers Nat'!CL14)","v":0},null,"Rondes confirmées",{"$f":"SUM('Passagers Inter'!CM13)","v":1},null,"Rondes confirmées",1,null,null,8,{"$f":"VLOOKUP(N13,'Numéro licences'!$A$4:$B$32,2)","v":"GRIGNET Audrey"},{"$f":"SUM(E36)","v":0},{"$f":"SUM(H36)","v":0},0,null,8,{"$f":"VLOOKUP(T13,'Numéro licences'!$A$4:$B$32,2)","v":"GRIGNET Audrey"},{"$f":"SUM(E35)","v":0},{"$f":"SUM(H35)","v":0},0]
[null,null,null,"Rondes effectuées",{"$f":"SUM('Passagers Nat'!CL15)","v":0},null,"Rondes effectuées",{"$f":"SUM('Passagers Inter'!CM14)","v":1},null,"Rondes effectuées",1,null,null,9,{"$f":"VLOOKUP(N14,'Numéro licences'!$A$4:$B$32,2)","v":"LAMBILLON Anne"},{"$f":"SUM(E40)","v":0},{"$f":"SUM(H40)","v":0},0,null,9,{"$f":"VLOOKUP(T14,'Numéro licences'!$A$4:$B$32,2)","v":"LAMBILLON Anne"},{"$f":"SUM(E39)","v":200},{"$f":"SUM(H39)","v":0},200]
[3,{"$f":"VLOOKUP(A15,'Numéro licences'!$A$4:$B$32,2)","v":"ERVEN France"},"Aller-Retour","Km  renseignés",{"$f":"SUM('Passagers Nat'!CL16)","v":517},null,"Km  renseignés",{"$f":"SUM('Passagers Inter'!CM15)","v":0},null,"Km  renseignés",517,null,null,10,{"$f":"VLOOKUP(N15,'Numéro licences'!$A$4:$B$32,2)","v":"LAMIROY Anne"},{"$f":"SUM(E44)","v":0},{"$f":"SUM(H44)","v":532},532,null,10,{"$f":"VLOOKUP(T15,'Numéro licences'!$A$4:$B$32,2)","v":"LAMIROY Anne"},{"$f":"SUM(E43)","v":0},{"$f":"SUM(H43)","v":532},532]
[null,null,"Ronde","Km confirmés",{"$f":"SUM('Passagers Nat'!CL17)","v":0},null,"Km confirmés",{"$f":"SUM('Passagers Inter'!CM16)","v":0},null,"Km confirmés",0,null,null,11,{"$f":"VLOOKUP(N16,'Numéro licences'!$A$4:$B$32,2)","v":"LEROY Laure"},{"$f":"SUM(E48)","v":0},{"$f":"SUM(H48)","v":0},0,null,11,{"$f":"VLOOKUP(T16,'Numéro licences'!$A$4:$B$32,2)","v":"LEROY Laure"},{"$f":"SUM(E47)","v":112},{"$f":"SUM(H47)","v":0},112]
[null,null,null,"Rondes confirmées",{"$f":"SUM('Passagers Nat'!CL18)","v":0},null,"Rondes confirmées",{"$f":"SUM('Passagers Inter'!CM17)","v":0},null,"Rondes confirmées",0,null,null,12,{"$f":"VLOOKUP(N17,'Numéro licences'!$A$4:$B$32,2)","v":"NICLOUX Christine"},{"$f":"SUM(E52)","v":0},{"$f":"SUM(H52)","v":0},0,null,12,{"$f":"VLOOKUP(T17,'Numéro licences'!$A$4:$B$32,2)","v":"NICLOUX Christine"},{"$f":"SUM(E51)","v":0},{"$f":"SUM(H51)","v":0},0]
[null,null,null,"Rondes effectuées",{"$f":"SUM('Passagers Nat'!CL19)","v":2},null,"Rondes effectuées",{"$f":"SUM('Passagers Inter'!CM18)","v":0},null,"Rondes effectuées",2,null,null,13,{"$f":"VLOOKUP(N18,'Numéro licences'!$A$4:$B$32,2)","v":"PONT Patricia"},{"$f":"SUM(E56)","v":8518},{"$f":"SUM(H56)","v":0},8518,null,13,{"$f":"VLOOKUP(T18,'Numéro licences'!$A$4:$B$32,2)","v":"PONT Patricia"},{"$f":"SUM(E55)","v":8518},{"$f":"SUM(H55)","v":0},8518]
[4,{"$f":"VLOOKUP(A19,'Numéro licences'!$A$4:$B$32,2)","v":"FIEVET Nathalie"},"Aller-Retour","Km  renseignés",{"$f":"SUM('Passagers Nat'!CL20)","v":0},null,"Km  renseignés",{"$f":"SUM('Passagers Inter'!CM19)","v":0},null,"Km  renseignés",0,null,null,14,{"$f":"VLOOKUP(N19,'Numéro licences'!$A$4:$B$32,2)","v":"THOMAS Isabelle"},{"$f":"SUM(E60)","v":0},{"$f":"SUM(H60)","v":0},0,null,14,{"$f":"VLOOKUP(T19,'Numéro licences'!$A$4:$B$32,2)","v":"THOMAS Isabelle"},{"$f":"SUM(E59)","v":0},{"$f":"SUM(H59)","v":0},0]
[null,null,"Ronde","Km confirmés",{"$f":"SUM('Passagers Nat'!CL21)","v":0},null,"Km confirmés",{"$f":"SUM('Passagers Inter'!CM20)","v":0},null,"Km confirmés",0,null,null,15,{"$f":"VLOOKUP(N20,'Numéro licences'!$A$4:$B$32,2)","v":0},{"$f":"SUM(E64)","v":0},{"$f":"SUM(H64)","v":0},0,null,15,{"$f":"VLOOKUP(T20,'Numéro licences'!$A$4:$B$32,2)","v":0},{"$f":"SUM(E78)","v":0},{"$f":"SUM(H78)","v":0},0]
[null,null,null,"Rondes confirmées",{"$f":"SUM('Passagers Nat'!CL22)","v":0},null,"Rondes confirmées",{"$f":"SUM('Passagers Inter'!CM21)","v":0},null,"Rondes confirmées",0,null,null,16,{"$f":"VLOOKUP(N21,'Numéro licences'!$A$4:$B$32,2)","v":0},{"$f":"SUM(E68)","v":0},{"$f":"SUM(H68)","v":0},0,null,16,{"$f":"VLOOKUP(T21,'Numéro licences'!$A$4:$B$32,2)","v":0},{"$f":"SUM(E64)","v":0},{"$f":"SUM(H64)","v":0},0]
[null,null,null,"Rondes effectuées",{"$f":"SUM('Passagers Nat'!CL23)","v":0},null,"Rondes effectuées",{"$f":"SUM('Passagers Inter'!CM22)","v":0},null,"Rondes effectuées",0,null,null,17,{"$f":"VLOOKUP(N22,'Numéro licences'!$A$4:$B$32,2)","v":0},{"$f":"SUM(E72)","v":0},{"$f":"SUM(H72)","v":0},0,null,17,{"$f":"VLOOKUP(T22,'Numéro licences'!$A$4:$B$32,2)","v":0},{"$f":"SUM(E68)","v":0},{"$f":"SUM(H68)","v":0},0]
[5,{"$f":"VLOOKUP(A23,'Numéro licences'!$A$4:$B$32,2)","v":"GIAUX Annie"},"Aller-Retour","Km  renseignés",{"$f":"SUM('Passagers Nat'!CL24)","v":846},null,"Km  renseignés",{"$f":"SUM('Passagers Inter'!CM23)","v":0},null,"Km  renseignés",846,null,null,18,{"$f":"VLOOKUP(N23,'Numéro licences'!$A$4:$B$32,2)","v":0},{"$f":"SUM(E76)","v":0},{"$f":"SUM(H76)","v":0},0,null,18,{"$f":"VLOOKUP(T23,'Numéro licences'!$A$4:$B$32,2)","v":0},{"$f":"SUM(E72)","v":0},{"$f":"SUM(H72)","v":0},0]
[null,null,"Ronde","Km confirmés",{"$f":"SUM('Passagers Nat'!CL25)","v":0},null,"Km confirmés",{"$f":"SUM('Passagers Inter'!CM24)","v":0},null,"Km confirmés",0,null,null,19,{"$f":"VLOOKUP(N24,'Numéro licences'!$A$4:$B$32,2)","v":0},{"$f":"SUM(E80)","v":0},{"$f":"SUM(H80)","v":0},0,null,19,{"$f":"VLOOKUP(T24,'Numéro licences'!$A$4:$B$32,2)","v":0},{"$f":"SUM(E76)","v":0},{"$f":"SUM(H76)","v":0},0]
[null,null,null,"Rondes confirmées",{"$f":"SUM('Passagers Nat'!CL26)","v":0},null,"Rondes confirmées",{"$f":"SUM('Passagers Inter'!CM25)","v":0},null,"Rondes confirmées",0,null,null,20,{"$f":"VLOOKUP(N25,'Numéro licences'!$A$4:$B$32,2)","v":0},{"$f":"SUM(E84)","v":0},{"$f":"SUM(H84)","v":0},0,null,20,{"$f":"VLOOKUP(T25,'Numéro licences'!$A$4:$B$32,2)","v":0},{"$f":"SUM(E80)","v":0},{"$f":"SUM(H80)","v":0},0]
[null,null,null,"Rondes effectuées",{"$f":"SUM('Passagers Nat'!CL27)","v":3},null,"Rondes effectuées",{"$f":"SUM('Passagers Inter'!CM26)","v":0},null,"Rondes effectuées",3,null,null,21,{"$f":"VLOOKUP(N26,'Numéro licences'!$A$4:$B$32,2)","v":0},{"$f":"SUM(E88)","v":0},{"$f":"SUM(H88)","v":0},0,null,21,{"$f":"VLOOKUP(T26,'Numéro licences'!$A$4:$B$32,2)","v":0},{"$f":"SUM(E87)","v":0},{"$f":"SUM(H87)","v":0},0]
[6,{"$f":"VLOOKUP(A27,'Numéro licences'!$A$4:$B$32,2)","v":"GOFFIN Guillaume"},"Aller-Retour","Km  renseignés",{"$f":"SUM('Passagers Nat'!CL28)","v":0},null,"Km  renseignés",{"$f":"SUM('Passagers Inter'!CM27)","v":0},null,"Km  renseignés",0,null,null,22,{"$f":"VLOOKUP(N27,'Numéro licences'!$A$4:$B$32,2)","v":0},{"$f":"SUM(E92)","v":0},{"$f":"SUM(H92)","v":0},0,null,22,{"$f":"VLOOKUP(T27,'Numéro licences'!$A$4:$B$32,2)","v":0},{"$f":"SUM(E91)","v":0},{"$f":"SUM(H91)","v":0},0]
[null,null,"Ronde","Km confirmés",{"$f":"SUM('Passagers Nat'!CL29)","v":0},null,"Km confirmés",{"$f":"SUM('Passagers Inter'!CM28)","v":0},null,"Km confirmés",0,null,null,23,{"$f":"VLOOKUP(N28,'Numéro licences'!$A$4:$B$32,2)","v":0},{"$f":"SUM(E96)","v":0},{"$f":"SUM(H96)","v":0},0,null,23,{"$f":"VLOOKUP(T28,'Numéro licences'!$A$4:$B$32,2)","v":0},{"$f":"SUM(E95)","v":0},{"$f":"SUM(H95)","v":0},0]
[null,null,null,"Rondes confirmées",{"$f":"SUM('Passagers Nat'!CL30)","v":0},null,"Rondes confirmées",{"$f":"SUM('Passagers Inter'!CM29)","v":0},null,"Rondes confirmées",0,null,null,24,{"$f":"VLOOKUP(N29,'Numéro licences'!$A$4:$B$32,2)","v":0},{"$f":"SUM(E100)","v":0},{"$f":"SUM(H100)","v":0},0,null,24,{"$f":"VLOOKUP(T29,'Numéro licences'!$A$4:$B$32,2)","v":0},{"$f":"SUM(E99)","v":0},{"$f":"SUM(H99)","v":0},0]
[null,null,null,"Rondes effectuées",{"$f":"SUM('Passagers Nat'!CL31)","v":0},null,"Rondes effectuées",{"$f":"SUM('Passagers Inter'!CM30)","v":0},null,"Rondes effectuées",0,null,null,25,{"$f":"VLOOKUP(N30,'Numéro licences'!$A$4:$B$32,2)","v":0},{"$f":"SUM(E104)","v":0},{"$f":"SUM(H104)","v":0},0,null,25,{"$f":"VLOOKUP(T30,'Numéro licences'!$A$4:$B$32,2)","v":0},{"$f":"SUM(E103)","v":0},{"$f":"SUM(H103)","v":0},0]
[7,{"$f":"VLOOKUP(A31,'Numéro licences'!$A$4:$B$32,2)","v":"GREGORICS Kathy"},"Aller-Retour","Km  renseignés",{"$f":"SUM('Passagers Nat'!CL32)","v":200},null,"Km  renseignés",{"$f":"SUM('Passagers Inter'!CM31)","v":1462},null,"Km  renseignés",1662,null,null,26,{"$f":"VLOOKUP(N31,'Numéro licences'!$A$4:$B$32,2)","v":0},{"$f":"SUM(E108)","v":0},{"$f":"SUM(H108)","v":0},0,null,26,{"$f":"VLOOKUP(T31,'Numéro licences'!$A$4:$B$32,2)","v":0},{"$f":"SUM(E107)","v":0},{"$f":"SUM(H107)","v":0},0]
[null,null,"Ronde","Km confirmés",{"$f":"SUM('Passagers Nat'!CL33)","v":0},null,"Km confirmés",{"$f":"SUM('Passagers Inter'!CM32)","v":1462},null,"Km confirmés",1462,null,null,27,{"$f":"VLOOKUP(N32,'Numéro licences'!$A$4:$B$32,2)","v":0},{"$f":"SUM(E112)","v":0},{"$f":"SUM(H112)","v":0},0,null,27,{"$f":"VLOOKUP(T32,'Numéro licences'!$A$4:$B$32,2)","v":0},{"$f":"SUM(E111)","v":0},{"$f":"SUM(H111)","v":0},0]
[null,null,null,"Rondes confirmées",{"$f":"SUM('Passagers Nat'!CL34)","v":0},null,"Rondes confirmées",{"$f":"SUM('Passagers Inter'!CM33)","v":1},null,"Rondes confirmées",1,null,null,28,{"$f":"VLOOKUP(N33,'Numéro licences'!$A$4:$B$32,2)","v":0},{"$f":"SUM(E116)","v":0},{"$f":"SUM(H116)","v":0},0,null,28,{"$f":"VLOOKUP(T33,'Numéro licences'!$A$4:$B$32,2)","v":0},{"$f":"SUM(E115)","v":0},{"$f":"SUM(H115)","v":0},0]
[null,null,null,"Rondes effectuées",{"$f":"SUM('Passagers Nat'!CL35)","v":0},null,"Rondes effectuées",{"$f":"SUM('Passagers Inter'!CM34)","v":1},null,"Rondes effectuées",1,null,null,29,{"$f":"VLOOKUP(N34,'Numéro licences'!$A$4:$B$32,2)","v":0},{"$f":"SUM(E120)","v":0},{"$f":"SUM(H120)","v":0},0,null,29,{"$f":"VLOOKUP(T34,'Numéro licences'!$A$4:$B$32,2)","v":0},{"$f":"SUM(E119)","v":0},{"$f":"SUM(H119)","v":0},0]
[8,{"$f":"VLOOKUP(A35,'Numéro licences'!$A$4:$B$32,2)","v":"GRIGNET Audrey"},"Aller-Retour","Km  renseignés",{"$f":"SUM('Passagers Nat'!CL36)","v":0},null,"Km  renseignés",{"$f":"SUM('Passagers Inter'!CM35)","v":0},null,"Km  renseignés",0,null,null,null,null,{"$f":"SUM(R6:R34)","v":11891},{"$f":"SUM(Q6:Q34)","v":3373},{"$f":"SUM(P35:Q35)","v":15264}]
[null,null,"Ronde","Km confirmés",{"$f":"SUM('Passagers Nat'!CL37)","v":0},null,"Km confirmés",{"$f":"SUM('Passagers Inter'!CM36)","v":0},null,"Km confirmés",0,null,null,null,null,{"$f":"SUM(P35/R35)","v":0.779022536687631},{"$f":"SUM(Q35/R35)","v":0.22097746331236898}]
[null,null,null,"Rondes confirmées",{"$f":"SUM('Passagers Nat'!CL38)","v":0},null,"Rondes confirmées",{"$f":"SUM('Passagers Inter'!CM37)","v":0},null,"Rondes confirmées",0]
[null,null,null,"Rondes effectuées",{"$f":"SUM('Passagers Nat'!CL39)","v":0},null,"Rondes effectuées",{"$f":"SUM('Passagers Inter'!CM38)","v":0},null,"Rondes effectuées",0,null,null,null,null,null,null,null,null,null,null,{"$f":"SUM(V6:V37)","v":10593},{"$f":"SUM(W6:W37)","v":3373},{"$f":"SUM(V38:W38)","v":13966}]
[9,{"$f":"VLOOKUP(A39,'Numéro licences'!$A$4:$B$32,2)","v":"LAMBILLON Anne"},"Aller-Retour","Km  renseignés",{"$f":"SUM('Passagers Nat'!CL40)","v":200},null,"Km  renseignés",{"$f":"SUM('Passagers Inter'!CM39)","v":0},null,"Km  renseignés",200,null,null,null,null,null,null,null,null,null,null,{"$f":"SUM(V38/X38)","v":0.75848489188028068},{"$f":"SUM(W38/X38)","v":0.24151510811971932}]
[null,null,"Ronde","Km confirmés",{"$f":"SUM('Passagers Nat'!CL41)","v":0},null,"Km confirmés",{"$f":"SUM('Passagers Inter'!CM40)","v":0},null,"Km confirmés",0,null,null,null,null,null,null,null,null,null,null,"NAT","INT"]
[null,null,null,"Rondes confirmées",{"$f":"SUM('Passagers Nat'!CL42)","v":0},null,"Rondes confirmées",{"$f":"SUM('Passagers Inter'!CM41)","v":0},null,"Rondes confirmées",0]
[null,null,null,"Rondes effectuées",{"$f":"SUM('Passagers Nat'!CL43)","v":0},null,"Rondes effectuées",{"$f":"SUM('Passagers Inter'!CM42)","v":0},null,"Rondes effectuées",0]
[10,{"$f":"VLOOKUP(A43,'Numéro licences'!$A$4:$B$32,2)","v":"LAMIROY Anne"},"Aller-Retour","Km  renseignés",{"$f":"SUM('Passagers Nat'!CL44)","v":0},null,"Km  renseignés",{"$f":"SUM('Passagers Inter'!CM43)","v":532},null,"Km  renseignés",532]
[null,null,"Ronde","Km confirmés",{"$f":"SUM('Passagers Nat'!CL45)","v":0},null,"Km confirmés",{"$f":"SUM('Passagers Inter'!CM44)","v":532},null,"Km confirmés",532]
[null,null,null,"Rondes confirmées",{"$f":"SUM('Passagers Nat'!CL46)","v":0},null,"Rondes confirmées",{"$f":"SUM('Passagers Inter'!CM45)","v":1},null,"Rondes confirmées",1]
[null,null,null,"Rondes effectuées",{"$f":"SUM('Passagers Nat'!CL47)","v":0},null,"Rondes effectuées",{"$f":"SUM('Passagers Inter'!CM46)","v":1},null,"Rondes effectuées",1]
[11,{"$f":"VLOOKUP(A47,'Numéro licences'!$A$4:$B$32,2)","v":"LEROY Laure"},"Aller-Retour","Km  renseignés",{"$f":"SUM('Passagers Nat'!CL48)","v":112},null,"Km  renseignés",{"$f":"SUM('Passagers Inter'!CM47)","v":0},null,"Km  renseignés",112]
[null,null,"Ronde","Km confirmés",{"$f":"SUM('Passagers Nat'!CL49)","v":0},null,"Km confirmés",{"$f":"SUM('Passagers Inter'!CM48)","v":0},null,"Km confirmés",0]
[null,null,null,"Rondes confirmées",{"$f":"SUM('Passagers Nat'!CL50)","v":0},null,"Rondes confirmées",{"$f":"SUM('Passagers Inter'!CM49)","v":0},null,"Rondes confirmées",0]
[null,null,null,"Rondes effectuées",{"$f":"SUM('Passagers Nat'!CL51)","v":2},null,"Rondes effectuées",{"$f":"SUM('Passagers Inter'!CM50)","v":0},null,"Rondes effectuées",2]
[12,{"$f":"VLOOKUP(A51,'Numéro licences'!$A$4:$B$32,2)","v":"NICLOUX Christine"},"Aller-Retour","Km  renseignés",{"$f":"SUM('Passagers Nat'!CL52)","v":0},null,"Km  renseignés",{"$f":"SUM('Passagers Inter'!CM51)","v":0},null,"Km  renseignés",0]
[null,null,"Ronde","Km confirmés",{"$f":"SUM('Passagers Nat'!CL53)","v":0},null,"Km confirmés",{"$f":"SUM('Passagers Inter'!CM52)","v":0},null,"Km confirmés",0]
[null,null,null,"Rondes confirmées",{"$f":"SUM('Passagers Nat'!CL54)","v":0},null,"Rondes confirmées",{"$f":"SUM('Passagers Inter'!CM53)","v":0},null,"Rondes confirmées",0]
[null,null,null,"Rondes effectuées",{"$f":"SUM('Passagers Nat'!CL55)","v":0},null,"Rondes effectuées",{"$f":"SUM('Passagers Inter'!CM54)","v":0},null,"Rondes effectuées",0]
[13,{"$f":"VLOOKUP(A55,'Numéro licences'!$A$4:$B$32,2)","v":"PONT Patricia"},"Aller-Retour","Km  renseignés",{"$f":"SUM('Passagers Nat'!CL56)","v":8518},null,"Km  renseignés",{"$f":"SUM('Passagers Inter'!CM55)","v":0},null,"Km  renseignés",8518]
[null,null,"Ronde","Km confirmés",{"$f":"SUM('Passagers Nat'!CL57)","v":8518},null,"Km confirmés",{"$f":"SUM('Passagers Inter'!CM56)","v":0},null,"Km confirmés",8518]
[null,null,null,"Rondes confirmées",{"$f":"SUM('Passagers Nat'!CL58)","v":26},null,"Rondes confirmées",{"$f":"SUM('Passagers Inter'!CM57)","v":0},null,"Rondes confirmées",26]
[null,null,null,"Rondes effectuées",{"$f":"SUM('Passagers Nat'!CL59)","v":24},null,"Rondes effectuées",{"$f":"SUM('Passagers Inter'!CM58)","v":0},null,"Rondes effectuées",24]
[14,{"$f":"VLOOKUP(A59,'Numéro licences'!$A$4:$B$32,2)","v":"THOMAS Isabelle"},"Aller-Retour","Km  renseignés",{"$f":"SUM('Passagers Nat'!CL60)","v":0},null,"Km  renseignés",{"$f":"SUM('Passagers Inter'!CM59)","v":0},null,"Km  renseignés",0]
[null,null,"Ronde","Km confirmés",{"$f":"SUM('Passagers Nat'!CL61)","v":0},null,"Km confirmés",{"$f":"SUM('Passagers Inter'!CM60)","v":0},null,"Km confirmés",0]
[null,null,null,"Rondes confirmées",{"$f":"SUM('Passagers Nat'!CL62)","v":0},null,"Rondes confirmées",{"$f":"SUM('Passagers Inter'!CM61)","v":0},null,"Rondes confirmées",0]
[null,null,null,"Rondes effectuées",{"$f":"SUM('Passagers Nat'!CL63)","v":0},null,"Rondes effectuées",{"$f":"SUM('Passagers Inter'!CM62)","v":0},null,"Rondes effectuées",0]
[15,{"$f":"VLOOKUP(A63,'Numéro licences'!$A$4:$B$32,2)","v":0},"Aller-Retour","Km  renseignés",{"$f":"SUM('Passagers Nat'!CL64)","v":0},null,"Km  renseignés",{"$f":"SUM('Passagers Inter'!CM63)","v":0},null,"Km  renseignés",0]
[null,null,"Ronde","Km confirmés",{"$f":"SUM('Passagers Nat'!CL65)","v":0},null,"Km confirmés",{"$f":"SUM('Passagers Inter'!CM64)","v":0},null,"Km confirmés",0]
[null,null,null,"Rondes confirmées",{"$f":"SUM('Passagers Nat'!CL66)","v":0},null,"Rondes confirmées",{"$f":"SUM('Passagers Inter'!CM65)","v":0},null,"Rondes confirmées",0]
[null,null,null,"Rondes effectuées",{"$f":"SUM('Passagers Nat'!CL67)","v":0},null,"Rondes effectuées",{"$f":"SUM('Passagers Inter'!CM66)","v":0},null,"Rondes effectuées",0]
[16,{"$f":"VLOOKUP(A67,'Numéro licences'!$A$4:$B$32,2)","v":0},"Aller-Retour","Km  renseignés",{"$f":"SUM('Passagers Nat'!CL68)","v":0},null,"Km  renseignés",{"$f":"SUM('Passagers Inter'!CM67)","v":0},null,"Km  renseignés",0]
[null,null,"Ronde","Km confirmés",{"$f":"SUM('Passagers Nat'!CL69)","v":0},null,"Km confirmés",{"$f":"SUM('Passagers Inter'!CM68)","v":0},null,"Km confirmés",0]
[null,null,null,"Rondes confirmées",{"$f":"SUM('Passagers Nat'!CL70)","v":0},null,"Rondes confirmées",{"$f":"SUM('Passagers Inter'!CM69)","v":0},null,"Rondes confirmées",0]
[null,null,null,"Rondes effectuées",{"$f":"SUM('Passagers Nat'!CL71)","v":0},null,"Rondes effectuées",{"$f":"SUM('Passagers Inter'!CM70)","v":0},null,"Rondes effectuées",0]
[17,{"$f":"VLOOKUP(A71,'Numéro licences'!$A$4:$B$32,2)","v":0},"Aller-Retour","Km  renseignés",{"$f":"SUM('Passagers Nat'!CL72)","v":0},null,"Km  renseignés",{"$f":"SUM('Passagers Inter'!CM71)","v":0},null,"Km  renseignés",0]
[null,null,"Ronde","Km confirmés",{"$f":"SUM('Passagers Nat'!CL73)","v":0},null,"Km confirmés",{"$f":"SUM('Passagers Inter'!CM72)","v":0},null,"Km confirmés",{"$f":"SUM(E72+H72)","v":0}]
[null,null,null,"Rondes confirmées",{"$f":"SUM('Passagers Nat'!CL74)","v":0},null,"Rondes confirmées",{"$f":"SUM('Passagers Inter'!CM73)","v":0},null,"Rondes confirmées",0]
[null,null,null,"Rondes effectuées",{"$f":"SUM('Passagers Nat'!CL75)","v":0},null,"Rondes effectuées",{"$f":"SUM('Passagers Inter'!CM74)","v":0},null,"Rondes effectuées",0]
[18,{"$f":"VLOOKUP(A75,'Numéro licences'!$A$4:$B$32,2)","v":0},"Aller-Retour","Km  renseignés",{"$f":"SUM('Passagers Nat'!CL76)","v":0},null,"Km  renseignés",{"$f":"SUM('Passagers Inter'!CM75)","v":0},null,"Km  renseignés",0]
[null,null,"Ronde","Km confirmés",{"$f":"SUM('Passagers Nat'!CL77)","v":0},null,"Km confirmés",{"$f":"SUM('Passagers Inter'!CM76)","v":0},null,"Km confirmés",0]
[null,null,null,"Rondes confirmées",{"$f":"SUM('Passagers Nat'!CL78)","v":0},null,"Rondes confirmées",{"$f":"SUM('Passagers Inter'!CM77)","v":0},null,"Rondes confirmées",0]
[null,null,null,"Rondes effectuées",{"$f":"SUM('Passagers Nat'!CL79)","v":0},null,"Rondes effectuées",{"$f":"SUM('Passagers Inter'!CM78)","v":0},null,"Rondes effectuées",0]
[19,{"$f":"VLOOKUP(A79,'Numéro licences'!$A$4:$B$32,2)","v":0},"Aller-Retour","Km  renseignés",{"$f":"SUM('Passagers Nat'!CL80)","v":0},null,"Km  renseignés",{"$f":"SUM('Passagers Inter'!CM79)","v":0},null,"Km  renseignés",0]
[null,null,"Ronde","Km confirmés",{"$f":"SUM('Passagers Nat'!CL81)","v":0},null,"Km confirmés",{"$f":"SUM('Passagers Inter'!CM80)","v":0},null,"Km confirmés",0]
[null,null,null,"Rondes confirmées",{"$f":"SUM('Passagers Nat'!CL82)","v":0},null,"Rondes confirmées",{"$f":"SUM('Passagers Inter'!CM81)","v":0},null,"Rondes confirmées",0]
[null,null,null,"Rondes effectuées",{"$f":"SUM('Passagers Nat'!CL83)","v":0},null,"Rondes effectuées",{"$f":"SUM('Passagers Inter'!CM82)","v":0},null,"Rondes effectuées",0]
[20,{"$f":"VLOOKUP(A83,'Numéro licences'!$A$4:$B$32,2)","v":0},"Aller-Retour","Km  renseignés",{"$f":"SUM('Passagers Nat'!CL84)","v":0},null,"Km  renseignés",{"$f":"SUM('Passagers Inter'!CM83)","v":0},null,"Km  renseignés",0]
[null,null,"Ronde","Km confirmés",{"$f":"SUM('Passagers Nat'!CL85)","v":0},null,"Km confirmés",{"$f":"SUM('Passagers Inter'!CM84)","v":0},null,"Km confirmés",0]
[null,null,null,"Rondes confirmées",{"$f":"SUM('Passagers Nat'!CL86)","v":0},null,"Rondes confirmées",{"$f":"SUM('Passagers Inter'!CM85)","v":0},null,"Rondes confirmées",0]
[null,null,null,"Rondes effectuées",{"$f":"SUM('Passagers Nat'!CL87)","v":0},null,"Rondes effectuées",{"$f":"SUM('Passagers Inter'!CM86)","v":0},null,"Rondes effectuées",0]
[21,{"$f":"VLOOKUP(A87,'Numéro licences'!$A$4:$B$32,2)","v":0},"Aller-Retour","Km  renseignés",{"$f":"SUM('Passagers Nat'!CL88)","v":0},null,"Km  renseignés",{"$f":"SUM('Passagers Inter'!CM87)","v":0},null,"Km  renseignés",0]
[null,null,"Ronde","Km confirmés",{"$f":"SUM('Passagers Nat'!CL89)","v":0},null,"Km confirmés",{"$f":"SUM('Passagers Inter'!CM88)","v":0},null,"Km confirmés",0]
[null,null,null,"Rondes confirmées",{"$f":"SUM('Passagers Nat'!CL90)","v":0},null,"Rondes confirmées",{"$f":"SUM('Passagers Inter'!CM89)","v":0},null,"Rondes confirmées",0]
[null,null,null,"Rondes effectuées",{"$f":"SUM('Passagers Nat'!CL91)","v":0},null,"Rondes effectuées",{"$f":"SUM('Passagers Inter'!CM90)","v":0},null,"Rondes effectuées",0]
[22,{"$f":"VLOOKUP(A91,'Numéro licences'!$A$4:$B$32,2)","v":0},"Aller-Retour","Km  renseignés",{"$f":"SUM('Passagers Nat'!CL92)","v":0},null,"Km  renseignés",{"$f":"SUM('Passagers Inter'!CM91)","v":0},null,"Km  renseignés",0]
[null,null,"Ronde","Km confirmés",{"$f":"SUM('Passagers Nat'!CL93)","v":0},null,"Km confirmés",{"$f":"SUM('Passagers Inter'!CM92)","v":0},null,"Km confirmés",0]
[null,null,null,"Rondes confirmées",{"$f":"SUM('Passagers Nat'!CL94)","v":0},null,"Rondes confirmées",{"$f":"SUM('Passagers Inter'!CM93)","v":0},null,"Rondes confirmées",0]
[null,null,null,"Rondes effectuées",{"$f":"SUM('Passagers Nat'!CL95)","v":0},null,"Rondes effectuées",{"$f":"SUM('Passagers Inter'!CM94)","v":0},null,"Rondes effectuées",0]
[23,{"$f":"VLOOKUP(A95,'Numéro licences'!$A$4:$B$32,2)","v":0},"Aller-Retour","Km  renseignés",{"$f":"SUM('Passagers Nat'!CL96)","v":0},null,"Km  renseignés",{"$f":"SUM('Passagers Inter'!CM95)","v":0},null,"Km  renseignés",0]
[null,null,"Ronde","Km confirmés",{"$f":"SUM('Passagers Nat'!CL97)","v":0},null,"Km confirmés",{"$f":"SUM('Passagers Inter'!CM96)","v":0},null,"Km confirmés",0]
[null,null,null,"Rondes confirmées",{"$f":"SUM('Passagers Nat'!CL98)","v":0},null,"Rondes confirmées",{"$f":"SUM('Passagers Inter'!CM97)","v":0},null,"Rondes confirmées",0]
[null,null,null,"Rondes effectuées",{"$f":"SUM('Passagers Nat'!CL99)","v":0},null,"Rondes effectuées",{"$f":"SUM('Passagers Inter'!CM98)","v":0},null,"Rondes effectuées",0]
[24,{"$f":"VLOOKUP(A99,'Numéro licences'!$A$4:$B$32,2)","v":0},"Aller-Retour","Km  renseignés",{"$f":"SUM('Passagers Nat'!CL100)","v":0},null,"Km  renseignés",{"$f":"SUM('Passagers Inter'!CM99)","v":0},null,"Km  renseignés",0]
[null,null,"Ronde","Km confirmés",{"$f":"SUM('Passagers Nat'!CL101)","v":0},null,"Km confirmés",{"$f":"SUM('Passagers Inter'!CM100)","v":0},null,"Km confirmés",0]
[null,null,null,"Rondes confirmées",{"$f":"SUM('Passagers Nat'!CL102)","v":0},null,"Rondes confirmées",{"$f":"SUM('Passagers Inter'!CM101)","v":0},null,"Rondes confirmées",0]
[null,null,null,"Rondes effectuées",{"$f":"SUM('Passagers Nat'!CL103)","v":0},null,"Rondes effectuées",{"$f":"SUM('Passagers Inter'!CM102)","v":0},null,"Rondes effectuées",0]
[25,{"$f":"VLOOKUP(A103,'Numéro licences'!$A$4:$B$32,2)","v":0},"Aller-Retour","Km  renseignés",{"$f":"SUM('Passagers Nat'!CL104)","v":0},null,"Km  renseignés",{"$f":"SUM('Passagers Inter'!CM103)","v":0},null,"Km  renseignés",0]
[null,null,"Ronde","Km confirmés",{"$f":"SUM('Passagers Nat'!CL105)","v":0},null,"Km confirmés",{"$f":"SUM('Passagers Inter'!CM104)","v":0},null,"Km confirmés",0]
[null,null,null,"Rondes confirmées",{"$f":"SUM('Passagers Nat'!CL106)","v":0},null,"Rondes confirmées",{"$f":"SUM('Passagers Inter'!CM105)","v":0},null,"Rondes confirmées",0]
[null,null,null,"Rondes effectuées",{"$f":"SUM('Passagers Nat'!CL107)","v":0},null,"Rondes effectuées",{"$f":"SUM('Passagers Inter'!CM106)","v":0},null,"Rondes effectuées",0]
[26,{"$f":"VLOOKUP(A107,'Numéro licences'!$A$4:$B$32,2)","v":0},"Aller-Retour","Km  renseignés",{"$f":"SUM('Passagers Nat'!CL108)","v":0},null,"Km  renseignés",{"$f":"SUM('Passagers Inter'!CM107)","v":0},null,"Km  renseignés",0]
[null,null,"Ronde","Km confirmés",{"$f":"SUM('Passagers Nat'!CL109)","v":0},null,"Km confirmés",{"$f":"SUM('Passagers Inter'!CM108)","v":0},null,"Km confirmés",0]
[null,null,null,"Rondes confirmées",{"$f":"SUM('Passagers Nat'!CL110)","v":0},null,"Rondes confirmées",{"$f":"SUM('Passagers Inter'!CM109)","v":0},null,"Rondes confirmées",0]
[null,null,null,"Rondes effectuées",{"$f":"SUM('Passagers Nat'!CL111)","v":0},null,"Rondes effectuées",{"$f":"SUM('Passagers Inter'!CM110)","v":0},null,"Rondes effectuées",0]
[27,{"$f":"VLOOKUP(A111,'Numéro licences'!$A$4:$B$32,2)","v":0},"Aller-Retour","Km  renseignés",{"$f":"SUM('Passagers Nat'!CL112)","v":0},null,"Km  renseignés",{"$f":"SUM('Passagers Inter'!CM111)","v":0},null,"Km  renseignés",0]
[null,null,"Ronde","Km confirmés",{"$f":"SUM('Passagers Nat'!CL113)","v":0},null,"Km confirmés",{"$f":"SUM('Passagers Inter'!CM112)","v":0},null,"Km confirmés",0]
[null,null,null,"Rondes confirmées",{"$f":"SUM('Passagers Nat'!CL114)","v":0},null,"Rondes confirmées",{"$f":"SUM('Passagers Inter'!CM113)","v":0},null,"Rondes confirmées",0]
[null,null,null,"Rondes effectuées",{"$f":"SUM('Passagers Nat'!CL115)","v":0},null,"Rondes effectuées",{"$f":"SUM('Passagers Inter'!CM114)","v":0},null,"Rondes effectuées",0]
[28,{"$f":"VLOOKUP(A115,'Numéro licences'!$A$4:$B$32,2)","v":0},"Aller-Retour","Km  renseignés",{"$f":"SUM('Passagers Nat'!CL116)","v":0},null,"Km  renseignés",{"$f":"SUM('Passagers Inter'!CM115)","v":0},null,"Km  renseignés",0]
[null,null,"Ronde","Km confirmés",{"$f":"SUM('Passagers Nat'!CL117)","v":0},null,"Km confirmés",{"$f":"SUM('Passagers Inter'!CM116)","v":0},null,"Km confirmés",0]
[null,null,null,"Rondes confirmées",{"$f":"SUM('Passagers Nat'!CL118)","v":0},null,"Rondes confirmées",{"$f":"SUM('Passagers Inter'!CM117)","v":0},null,"Rondes confirmées",0]
[null,null,null,"Rondes effectuées",{"$f":"SUM('Passagers Nat'!CL119)","v":0},null,"Rondes effectuées",{"$f":"SUM('Passagers Inter'!CM118)","v":0},null,"Rondes effectuées",0]
[29,{"$f":"VLOOKUP(A119,'Numéro licences'!$A$4:$B$32,2)","v":0},"Aller-Retour","Km  renseignés",{"$f":"SUM('Passagers Nat'!CL120)","v":0},null,"Km  renseignés",{"$f":"SUM('Passagers Inter'!CM119)","v":0},null,"Km  renseignés",0]
[null,null,"Ronde","Km confirmés",{"$f":"SUM('Passagers Nat'!CL121)","v":0},null,"Km confirmés",{"$f":"SUM('Passagers Inter'!CM120)","v":0},null,"Km confirmés",0]
[null,null,null,"Rondes confirmées",{"$f":"SUM('Passagers Nat'!CL122)","v":0},null,"Rondes confirmées",{"$f":"SUM('Passagers Inter'!CM121)","v":0},null,"Rondes confirmées",0]
[null,null,null,"Rondes effectuées",{"$f":"SUM('Passagers Nat'!CL123)","v":0},null,"Rondes effectuées",{"$f":"SUM('Passagers Inter'!CM122)","v":0},null,"Rondes effectuées",0]
[]
[]
[null,null,null,"Rondes confirmées",{"$f":"SUM(E9+E13+E17+E21+E25+E29+E33+E37+E41+E45+E49+E53+E57+E61+E65+E69+E73+E77+E81+E85+E89+E93+E97+E101+E105+E109+E113+E117+E121)","v":26},null,"Rondes confirmées",{"$f":"SUM(H9+H13+H17+H21+H25+H29+H33+H37+H41+H45+H49+H53+H57+H61+H65+H69+H73+H77+H81+H85+H89+H93+H97+H101+H105+H109+H113+H117+H121)","v":3},null,"Rondes confirmées",{"$f":"SUM(K9+K13+K17+K21+K25+K29+K33+K37+K41+K45+K49+K53+K57+K61+K65+K69+K73+K77+K81+K85+K89+K93+K97+K101+K105+K109+K113+K117+K121)","v":29}]
[null,null,null,"Rondes effectuées",{"$f":"SUM(E10+E14+E18+E22+E26+E30+E34+E38+E42+E46+E50+E54+E58+E62+E66+E70+E74+E78+E82+E86+E90+E94+E98+E102+E106+E110+E114+E118+E122)","v":31},null,"Rondes effectuées",{"$f":"SUM(H10+H14+H18+H22+H26+H30+H34+H38+H42+H46+H50+H54+H58+H62+H66+H70+H74+H78+H82+H86+H90+H94+H98+H102+H106+H110+H114+H118+H122)","v":3},null,"Rondes effectuées",{"$f":"SUM(K10+K14+K18+K22+K26+K30+K34+K38+K42+K46+K50+K54+K58+K62+K66+K70+K74+K78+K82+K86+K90+K94+K98+K102+K106+K110+K114+K118+K122)","v":34}]
[]
[]
[]
[]
[]
[null,"Colonne1"]
[1,"ALAIMO Rosa"]
[{"$f":"SUM(A133+1)","v":2},"BRIDOUX Jacqueline"]
[{"$f":"SUM(A134+1)","v":3},"COSYNS Carine"]
[4,"DEHAUT Stéphane"]
[5,"GREGORICS Kathy"]
[6,"INGELS Chantal"]
[7,"LAMBILLON Anne"]
[8,"LAMIROY Anne"]
[9,"LEQUEUX Anne"]
[10,"LEROY Laure"]
[11,"PIROTTE Daisy"]
[12,"THOMAS Isabelle"]
[13]
[14]
[15]
[16]
[17]
[18]
[19]
[20]
[21]
[22]
[23]
[24]
[25]
[26]
[27]
[28]
[29]
[30]
[31]
[32]
[33]
[34]
[35]
[36]
[37]
[38]
[39]
[40]
[41]
[42]
[43]
[{"$f":"SUM(A175+1)","v":44}]
[45]
[46]

{"sheet":"Pilotes Nat","index":4,"n_rows":247,"n_cols":96,"rows_kept":247,"cut":false,"hidden":false,"merged":[[183,1,186,1],[187,1,190,1],[163,1,166,1],[167,1,170,1],[171,1,174,1],[175,1,178,1],[179,1,182,1],[143,1,146,1],[147,1,150,1],[151,1,154,1],[155,1,158,1],[159,1,162,1],[123,1,126,1],[127,1,130,1],[131,1,134,1],[135,1,138,1],[139,1,142,1],[103,1,106,1],[107,1,110,1],[111,1,114,1],[115,1,118,1],[119,1,122,1],[83,1,86,1],[87,1,90,1],[91,1,94,1],[95,1,98,1],[99,1,102,1],[63,1,66,1],[67,1,70,1],[71,1,74,1],[75,1,78,1],[79,1,82,1],[0,69,0,87],[99,93,99,95],[7,1,10,1],[11,1,14,1],[15,1,18,1],[19,1,22,1],[23,1,26,1],[27,1,30,1],[31,1,34,1],[35,1,38,1],[39,1,42,1],[43,1,46,1],[47,1,50,1],[51,1,54,1],[55,1,58,1],[59,1,62,1]]}
[null,null,null,1,{"$f":"SUM(D1+1)","v":2},{"$f":"SUM(E1+1)","v":3},4,5,6,7,8,9,10,11,12,13,14,15,16,17,18,19,20,21,22,23,24,25,26,27,28,29,30,31,32,33,34,35,36,37,38,39,40,41,42,43,44,45,46,47,48,49,50,51,52,53,54,55,56,57,58,{"$f":"SUM(BI1+1)","v":59},{"$f":"SUM(BJ1+1)","v":60},{"$f":"SUM(BK1+1)","v":61},62,null,null,null,null,"Hors FMB"]
[null,null,null,902,531,516,103,206,904,713,912,721,730,726,426,716,533,549,806,126,427,729,721,729,419,0,312,508,713,137,705,516,703,531,903,427,710,921,614,810,103,818,920,922,406,902,138,730,426,703,908,705,136,729,907,137,531,126,910,422,427,332,508,332,710]
[null,null,null,"2021-02-14","2021-02-28","2021-03-07","2021-03-14","2021-03-14","2021-03-20","2021-03-21","2021-03-28","2021-04-04","2021-04-05","2021-04-10","2021-04-11","2021-04-18","2021-04-25","2021-05-01","2021-05-01","2021-05-02","2021-05-09","2021-05-16","2021-05-23","2021-05-24","2021-05-29","2021-06-05","2021-06-12","2021-06-20","2021-06-26","2021-06-27","2021-06-27","2021-07-03","2021-07-04","2021-07-10","2021-07-17","2021-07-18","2021-07-21","2021-07-24","2021-07-31","2021-08-01","2021-08-08","2021-08-14","2021-08-14","2021-08-21","2021-08-22","2021-08-28","2021-08-28","2021-08-29","2021-09-04","2021-09-05","2021-09-11","2021-09-12","2021-09-18","2021-09-19","2021-09-19","2021-09-25","2021-09-26","2021-10-02","2021-10-03","2021-10-10","2021-10-17","2021-10-31","2021-11-01","2021-11-07","2021-11-11",null,null,null,"2021-05-09","2021-06-06","2021-06-27","2021-10-17"]
[null,null,null,{"$f":"VLOOKUP(D2,'Kilomètre AR'!$A$1:$B$58,2)","v":"AMC GIJVERINKHOVE"},{"$f":"VLOOKUP(E2,'Kilomètre AR'!$A$1:$B$58,2)","v":"MC HOESELT"},{"$f":"VLOOKUP(F2,'Kilomètre AR'!$A$1:$B$58,2)","v":"MC LOTUS  Bilzen"},{"$f":"VLOOKUP(G2,'Kilomètre AR'!$A$1:$B$58,2)","v":"KAMC HERENTALS"},{"$f":"VLOOKUP(H2,'Kilomètre AR'!$A$1:$B$58,2)","v":"MC L'EQUIPE  Bruxelles"},{"$f":"VLOOKUP(I2,'Kilomètre AR'!$A$1:$B$58,2)","v":"KAMC MENEN"},{"$f":"VLOOKUP(J2,'Kilomètre AR'!$A$1:$B$58,2)","v":"MC ST SERVAIS"},{"$f":"VLOOKUP(K2,'Kilomètre AR'!$A$1:$B$58,2)","v":"MTC ZEDELGEM"},{"$f":"VLOOKUP(L2,'Kilomètre AR'!$A$1:$B$58,2)","v":"MC LES PETITS GRIS   Warisoulx"},{"$f":"VLOOKUP(M2,'Kilomètre AR'!$A$1:$B$58,2)","v":"MC LES 4 & CO  Assesse"},{"$f":"VLOOKUP(N2,'Kilomètre AR'!$A$1:$B$58,2)","v":"MC BIKE AND TRIKE BELGIUM  Dhuy"},{"$f":"VLOOKUP(O2,'Kilomètre AR'!$A$1:$B$58,2)","v":"MTC WELKENRAEDT"},{"$f":"VLOOKUP(P2,'Kilomètre AR'!$A$1:$B$58,2)","v":"AMC FLOREFFE"},{"$f":"VLOOKUP(Q2,'Kilomètre AR'!$A$1:$B$58,2)","v":"MTC 13  Leopoldsburg"},{"$f":"VLOOKUP(R2,'Kilomètre AR'!$A$1:$B$58,2)","v":"MTC WELLEN   Wellen"},{"$f":"VLOOKUP(S2,'Kilomètre AR'!$A$1:$B$58,2)","v":"MC SCHELDELAND  Wichelen"},{"$f":"VLOOKUP(T2,'Kilomètre AR'!$A$1:$B$58,2)","v":"MTC TOERVRIENDEN  Brasschaat"},{"$f":"VLOOKUP(U2,'Kilomètre AR'!$A$1:$B$58,2)","v":"MC ZEBUS  Flémalle"},{"$f":"VLOOKUP(V2,'Kilomètre AR'!$A$1:$B$58,2)","v":"VIROINVAL MOTOR SPORT Dourbes"},{"$f":"VLOOKUP(W2,'Kilomètre AR'!$A$1:$B$58,2)","v":"MC LES PETITS GRIS   Warisoulx"},{"$f":"VLOOKUP(X2,'Kilomètre AR'!$A$1:$B$58,2)","v":"VIROINVAL MOTOR SPORT Dourbes"},{"$f":"VLOOKUP(Y2,'Kilomètre AR'!$A$1:$B$58,2)","v":"AMC ST VITH"},{"$f":"VLOOKUP(Z2,'Kilomètre AR'!$A$1:$B$58,2)","v":"RONDE FMB"},{"$f":"VLOOKUP(AA2,'Kilomètre AR'!$A$1:$B$58,2)","v":"MC RESSAIX"},{"$f":"VLOOKUP(AB2,'Kilomètre AR'!$A$1:$B$58,2)","v":"AMC KOERSEL"},{"$f":"VLOOKUP(AC2,'Kilomètre AR'!$A$1:$B$58,2)","v":"MC ST SERVAIS"},{"$f":"VLOOKUP(AD2,'Kilomètre AR'!$A$1:$B$58,2)","v":"MTC YELLS ARMY   Berchem"},{"$f":"VLOOKUP(AE2,'Kilomètre AR'!$A$1:$B$58,2)","v":"MC DINANT"},{"$f":"VLOOKUP(AF2,'Kilomètre AR'!$A$1:$B$58,2)","v":"MC LOTUS  Bilzen"},{"$f":"VLOOKUP(AG2,'Kilomètre AR'!$A$1:$B$58,2)","v":"R CINEY MC"},{"$f":"VLOOKUP(AH2,'Kilomètre AR'!$A$1:$B$58,2)","v":"MC HOESELT"},{"$f":"VLOOKUP(AI2,'Kilomètre AR'!$A$1:$B$58,2)","v":"AMSC LEIELAND  Wervik"},{"$f":"VLOOKUP(AJ2,'Kilomètre AR'!$A$1:$B$58,2)","v":"MC ZEBUS  Flémalle"},{"$f":"VLOOKUP(AK2,'Kilomètre AR'!$A$1:$B$58,2)","v":"MC MOLIGNARD  Warnant"},{"$f":"VLOOKUP(AL2,'Kilomètre AR'!$A$1:$B$58,2)","v":"MTC VRIJBOS   Houthulst"},{"$f":"VLOOKUP(AM2,'Kilomètre AR'!$A$1:$B$58,2)","v":"MC CHEVY RACING   Libramont-Chevigny"},{"$f":"VLOOKUP(AN2,'Kilomètre AR'!$A$1:$B$58,2)","v":"BMW MC VLAANDEREN  Lede"},{"$f":"VLOOKUP(AO2,'Kilomètre AR'!$A$1:$B$58,2)","v":"KAMC HERENTALS"},{"$f":"VLOOKUP(AP2,'Kilomètre AR'!$A$1:$B$58,2)","v":"MTC VLAANDEREN   Aalst"},{"$f":"VLOOKUP(AQ2,'Kilomètre AR'!$A$1:$B$58,2)","v":"WESTHOEK BIKERS  Houtem"},{"$f":"VLOOKUP(AR2,'Kilomètre AR'!$A$1:$B$58,2)","v":"MTC REDBONE  Wevezele"},{"$f":"VLOOKUP(AS2,'Kilomètre AR'!$A$1:$B$58,2)","v":"RAMC EUPEN"},{"$f":"VLOOKUP(AT2,'Kilomètre AR'!$A$1:$B$58,2)","v":"AMC GIJVERINKHOVE"},{"$f":"VLOOKUP(AU2,'Kilomètre AR'!$A$1:$B$58,2)","v":"MC TIGRIS PANTERA  Brasschaat"},{"$f":"VLOOKUP(AV2,'Kilomètre AR'!$A$1:$B$58,2)","v":"MC LES 4 & CO  Assesse"},{"$f":"VLOOKUP(AW2,'Kilomètre AR'!$A$1:$B$58,2)","v":"MTC WELKENRAEDT"},{"$f":"VLOOKUP(AX2,'Kilomètre AR'!$A$1:$B$58,2)","v":"R CINEY MC"},{"$f":"VLOOKUP(AY2,'Kilomètre AR'!$A$1:$B$58,2)","v":"AMC POPERINGE"},{"$f":"VLOOKUP(AZ2,'Kilomètre AR'!$A$1:$B$58,2)","v":"MC DINANT"},{"$f":"VLOOKUP(BA2,'Kilomètre AR'!$A$1:$B$58,2)","v":"MTC AMIGO'S   Schoten"},{"$f":"VLOOKUP(BB2,'Kilomètre AR'!$A$1:$B$58,2)","v":"VIROINVAL MOTOR SPORT Dourbes"},{"$f":"VLOOKUP(BC2,'Kilomètre AR'!$A$1:$B$58,2)","v":"KV OSTEND MS"},{"$f":"VLOOKUP(BD2,'Kilomètre AR'!$A$1:$B$58,2)","v":"MTC YELLS ARMY   Berchem"},{"$f":"VLOOKUP(BE2,'Kilomètre AR'!$A$1:$B$58,2)","v":"MC HOESELT"},{"$f":"VLOOKUP(BF2,'Kilomètre AR'!$A$1:$B$58,2)","v":"MTC TOERVRIENDEN  Brasschaat"},{"$f":"VLOOKUP(BG2,'Kilomètre AR'!$A$1:$B$58,2)","v":"AMC EENDRACHT TORHOUT"},{"$f":"VLOOKUP(BH2,'Kilomètre AR'!$A$1:$B$58,2)","v":"MC THEUX-FRANCHIMONT"},{"$f":"VLOOKUP(BI2,'Kilomètre AR'!$A$1:$B$58,2)","v":"MC ZEBUS  Flémalle"},{"$f":"VLOOKUP(BJ2,'Kilomètre AR'!$A$1:$B$58,2)","v":"MC BUTZ BIKERS 95   Ecaussinnes"},{"$f":"VLOOKUP(BK2,'Kilomètre AR'!$A$1:$B$58,2)","v":"AMC KOERSEL"},{"$f":"VLOOKUP(BL2,'Kilomètre AR'!$A$1:$B$58,2)","v":"MC BUTZ BIKERS 95   Ecaussinnes"},{"$f":"VLOOKUP(BM2,'Kilomètre AR'!$A$1:$B$58,2)","v":"MC MOLIGNARD  Warnant"},null,null,null,"MC Theux","MCSS","MCSS - DINANT","Moto Retro Flemalle"]
[null,"Aller-Retour",null,{"$f":"VLOOKUP(D2,'Kilomètre AR'!$A$1:$D$58,4)","v":380},{"$f":"VLOOKUP(E2,'Kilomètre AR'!$A$1:$D$58,4)","v":140},{"$f":"VLOOKUP(F2,'Kilomètre AR'!$A$1:$D$58,4)","v":148},{"$f":"VLOOKUP(G2,'Kilomètre AR'!$A$1:$D$58,4)","v":190},{"$f":"VLOOKUP(H2,'Kilomètre AR'!$A$1:$D$58,4)","v":116},{"$f":"VLOOKUP(I2,'Kilomètre AR'!$A$1:$D$58,4)","v":296},{"$f":"VLOOKUP(J2,'Kilomètre AR'!$A$1:$D$58,4)","v":0},{"$f":"VLOOKUP(K2,'Kilomètre AR'!$A$1:$D$58,4)","v":312},{"$f":"VLOOKUP(L2,'Kilomètre AR'!$A$1:$D$58,4)","v":20},{"$f":"VLOOKUP(M2,'Kilomètre AR'!$A$1:$D$58,4)","v":38},{"$f":"VLOOKUP(N2,'Kilomètre AR'!$A$1:$D$58,4)","v":34},{"$f":"VLOOKUP(O2,'Kilomètre AR'!$A$1:$D$58,4)","v":186},{"$f":"VLOOKUP(P2,'Kilomètre AR'!$A$1:$D$58,4)","v":20},{"$f":"VLOOKUP(Q2,'Kilomètre AR'!$A$1:$D$58,4)","v":184},{"$f":"VLOOKUP(R2,'Kilomètre AR'!$A$1:$D$58,4)","v":130},{"$f":"VLOOKUP(S2,'Kilomètre AR'!$A$1:$D$58,4)","v":194},{"$f":"VLOOKUP(T2,'Kilomètre AR'!$A$1:$D$58,4)","v":218},{"$f":"VLOOKUP(U2,'Kilomètre AR'!$A$1:$D$58,4)","v":104},{"$f":"VLOOKUP(V2,'Kilomètre AR'!$A$1:$D$58,4)","v":124},{"$f":"VLOOKUP(W2,'Kilomètre AR'!$A$1:$D$58,4)","v":20},{"$f":"VLOOKUP(X2,'Kilomètre AR'!$A$1:$D$58,4)","v":124},{"$f":"VLOOKUP(Y2,'Kilomètre AR'!$A$1:$D$58,4)","v":262},38,{"$f":"VLOOKUP(AA2,'Kilomètre AR'!$A$1:$D$58,4)","v":104},{"$f":"VLOOKUP(AB2,'Kilomètre AR'!$A$1:$D$58,4)","v":176},{"$f":"VLOOKUP(AC2,'Kilomètre AR'!$A$1:$D$58,4)","v":0},{"$f":"VLOOKUP(AD2,'Kilomètre AR'!$A$1:$D$58,4)","v":192},{"$f":"VLOOKUP(AE2,'Kilomètre AR'!$A$1:$D$58,4)","v":60},{"$f":"VLOOKUP(AF2,'Kilomètre AR'!$A$1:$D$58,4)","v":148},{"$f":"VLOOKUP(AG2,'Kilomètre AR'!$A$1:$D$58,4)","v":60},{"$f":"VLOOKUP(AH2,'Kilomètre AR'!$A$1:$D$58,4)","v":140},{"$f":"VLOOKUP(AI2,'Kilomètre AR'!$A$1:$D$58,4)","v":296},{"$f":"VLOOKUP(AJ2,'Kilomètre AR'!$A$1:$D$58,4)","v":104},{"$f":"VLOOKUP(AK2,'Kilomètre AR'!$A$1:$D$58,4)","v":52},{"$f":"VLOOKUP(AL2,'Kilomètre AR'!$A$1:$D$58,4)","v":344},{"$f":"VLOOKUP(AM2,'Kilomètre AR'!$A$1:$D$58,4)","v":162},{"$f":"VLOOKUP(AN2,'Kilomètre AR'!$A$1:$D$58,4)","v":184},{"$f":"VLOOKUP(AO2,'Kilomètre AR'!$A$1:$D$58,4)","v":190},{"$f":"VLOOKUP(AP2,'Kilomètre AR'!$A$1:$D$58,4)","v":176},{"$f":"VLOOKUP(AQ2,'Kilomètre AR'!$A$1:$D$58,4)","v":386},{"$f":"VLOOKUP(AR2,'Kilomètre AR'!$A$1:$D$58,4)","v":292},{"$f":"VLOOKUP(AS2,'Kilomètre AR'!$A$1:$D$58,4)","v":194},{"$f":"VLOOKUP(AT2,'Kilomètre AR'!$A$1:$D$58,4)","v":380},{"$f":"VLOOKUP(AU2,'Kilomètre AR'!$A$1:$D$58,4)","v":218},{"$f":"VLOOKUP(AV2,'Kilomètre AR'!$A$1:$D$58,4)","v":38},{"$f":"VLOOKUP(AW2,'Kilomètre AR'!$A$1:$D$58,4)","v":186},{"$f":"VLOOKUP(AX2,'Kilomètre AR'!$A$1:$D$58,4)","v":60},{"$f":"VLOOKUP(AY2,'Kilomètre AR'!$A$1:$D$58,4)","v":356},{"$f":"VLOOKUP(AZ2,'Kilomètre AR'!$A$1:$D$58,4)","v":60},{"$f":"VLOOKUP(BA2,'Kilomètre AR'!$A$1:$D$58,4)","v":208},{"$f":"VLOOKUP(BB2,'Kilomètre AR'!$A$1:$D$58,4)","v":124},{"$f":"VLOOKUP(BC2,'Kilomètre AR'!$A$1:$D$58,4)","v":344},{"$f":"VLOOKUP(BD2,'Kilomètre AR'!$A$1:$D$58,4)","v":192},{"$f":"VLOOKUP(BE2,'Kilomètre AR'!$A$1:$D$58,4)","v":140},{"$f":"VLOOKUP(BF2,'Kilomètre AR'!$A$1:$D$58,4)","v":218},{"$f":"VLOOKUP(BG2,'Kilomètre AR'!$A$1:$D$58,4)","v":324},{"$f":"VLOOKUP(BH2,'Kilomètre AR'!$A$1:$D$58,4)","v":166},{"$f":"VLOOKUP(BI2,'Kilomètre AR'!$A$1:$D$58,4)","v":104},{"$f":"VLOOKUP(BJ2,'Kilomètre AR'!$A$1:$D$58,4)","v":108},{"$f":"VLOOKUP(BK2,'Kilomètre AR'!$A$1:$D$58,4)","v":176},{"$f":"VLOOKUP(BL2,'Kilomètre AR'!$A$1:$D$58,4)","v":108},{"$f":"VLOOKUP(BM2,'Kilomètre AR'!$A$1:$D$58,4)","v":52},null,null,null,166,0,79,36,null,null,-1,-1,-1,-1,-1,-1,-1,-1,-1,-1,-1]
[null,"Ronde",null,null,null,null,null,null,null,null,null,null,null,null,null,null,null,null,null,null,null,215,null,195,null,513,null,null,200,null,null,200,210,180,null,null,200,300,220,null,null,250,null,null,null,220,null,220,166,220,165,194,180,180,165,150,165,170,160,220,null,165,140,150,130,null,null,null,216,200,186,120,null,null,-1,-1,-1,-1,-1,-1,-1,-1,-1,-1,-1]
[null,null,null,"ANNULEE\nCOVID-19","ANNULEE\nCOVID-19","ANNULEE\nCOVID-19","ANNULEE\nCOVID-19","ANNULEE\nCOVID-19","ANNULEE\nCOVID-19","ANNULEE\nCOVID-19","ANNULEE\nCOVID-19","ANNULEE\nCOVID-19","ANNULEE\nCOVID-19","ANNULEE\nCOVID-19","ANNULEE\nCOVID-19","ANNULEE\nCOVID-19","ANNULEE\nCOVID-19","ANNULEE\nCOVID-19","ANNULEE\nCOVID-19","ANNULEE\nCOVID-19","ANNULEE\nCOVID-19",null,"ANNULEE\nCOVID-19",null,"ANNULEE\nCOVID-19",null,"ANNULEE\nCOVID-19",null,null,"ANNULEE\nCOVID-19","ANNULEE\nCOVID-19",null,null,null,"ANNULEE\nCOVID-19","ANNULEE\nCOVID-19",null,null,null,"Hors\nChampionnat","ANNULEE\nCOVID-19",null,"ANNULEE\nCOVID-19","ANNULEE\nCOVID-19","ANNULEE\nCOVID-19","Inter","ANNULEE\nCOVID-19",null,"Inter",null,null,null,null,null,null,null,null,null,null,"Hors Championnat","Annulée","174 Km A/R !!\nAdresse Salle déportée",null,null,null,"Sous-Total\nFMB",null,"Total FMB",null,null,null,null,null,null,null,null,null,null,null,null,null,null,null,null,null,"Sous-Totaux\nPirates",null,"Total Pirates",null,"TOTAL",null,null,null,"FMB","Hors FMB","Total"]
[1,{"$f":"VLOOKUP(A8,'Numéro licences'!$H$4:$I$47,2)","v":"BALFROID Pierre"},"Aller-Retour",null,null,null,null,null,null,null,null,null,null,null,null,null,null,null,null,null,null,null,null,null,null,null,null,null,null,null,null,null,null,null,null,null,null,null,null,null,null,null,null,null,null,null,null,null,null,null,null,null,null,null,null,null,null,null,null,null,null,null,null,null,null,{"$f":"SUM(D8:BM8)","v":0},"Km  renseignés",{"$f":"SUM(BN8+BN9)","v":0},null,null,null,null,null,null,null,null,null,null,null,null,null,null,null,null,null,{"$f":"SUM(BQ8:CG8)","v":0},"Km  renseignés",{"$f":"SUM(CH8+CH9)","v":0},"Km  renseignés",{"$f":"SUM(BP8+CJ8)","v":0},null,1,{"$f":"VLOOKUP(CN8,A8:B188,2)","v":"BALFROID Pierre"},{"$f":"SUM(BP8)","v":0},{"$f":"SUM(CJ8)","v":0},{"$f":"SUM(CP8+CQ8)","v":0}]
[null,null,"Ronde",null,null,null,null,null,null,null,null,null,null,null,null,null,null,null,null,null,null,null,null,null,null,null,null,null,null,null,null,null,null,null,null,null,null,null,null,null,null,null,null,null,null,null,null,null,null,null,null,null,null,null,null,null,null,null,null,null,null,null,null,null,null,{"$f":"SUM(D9:BM9)","v":0},"Km confirmés",{"$f":"SUM(D11:BM11)","v":0},null,null,null,null,null,null,null,null,null,null,null,null,null,null,null,null,null,{"$f":"SUM(BQ9:CG9)","v":0},"Km confirmés",{"$f":"SUM(BQ11:CG11)","v":0},"Km confirmés",{"$f":"SUM(CJ9+BP9)","v":0},null,2,{"$f":"VLOOKUP(CN9,A8:B188,2)","v":"BALLION Pierre"},{"$f":"SUM(BP12)","v":200},{"$f":"SUM(CJ12)","v":0},{"$f":"SUM(CP9+CQ9)","v":200}]
[null,null,null,0,0,0,0,0,0,0,0,0,0,0,0,0,0,0,0,0,0,0,0,0,0,0,0,0,0,0,0,0,0,0,0,0,0,0,0,0,0,0,0,0,0,0,0,0,0,0,0,0,0,0,0,0,0,0,0,0,0,0,0,0,0,null,"Rondes confirmées",{"$f":"SUM(C10:BM10)","v":0},0,0,0,0,0,0,0,0,0,0,0,0,0,0,0,0,0,null,"Rondes confirmées",{"$f":"SUM(BQ10:CH10)","v":0},"Rondes confirmées",{"$f":"SUM(CJ10+BP10)","v":0},null,3,{"$f":"VLOOKUP(CN10,A8:B188,2)","v":"BERDOYES Bruno"},{"$f":"SUM(BP16)","v":0},{"$f":"SUM(CJ16)","v":0},{"$f":"SUM(CP10+CQ10)","v":0}]
[null,null,null,{"$f":"SUM((D8+D9)*D10)","v":0},0,0,0,0,0,0,0,0,0,0,0,0,0,0,0,0,0,0,0,0,0,0,0,0,0,0,0,0,0,0,0,0,0,0,0,0,0,0,0,0,0,0,0,0,0,0,0,0,0,0,0,0,0,0,0,0,0,{"$f":"SUM((BJ8+BJ9)*BJ10)","v":0},{"$f":"SUM((BK8+BK9)*BK10)","v":0},{"$f":"SUM((BL8+BL9)*BL10)","v":0},0,null,"Rondes effectuées",{"$f":"COUNTIF(D8:BM8,\">0\")","v":0},{"$f":"SUM((BQ8+BQ9)*BQ10)","v":0},0,0,0,0,0,0,0,0,0,0,0,0,0,0,0,0,null,"Rondes Effectuées",{"$f":"COUNTIF(BQ8:CG8,\">0\")","v":0},"Rondes effectuées",{"$f":"SUM(CJ11+BP11)","v":0},null,4,{"$f":"VLOOKUP(CN11,A8:B188,2)","v":"BERDOYES Yannick"},{"$f":"SUM(BP20)","v":0},{"$f":"SUM(CJ20)","v":200},200]
[2,{"$f":"VLOOKUP(A12,'Numéro licences'!$H$4:$I$47,2)","v":"BALLION Pierre"},"Aller-Retour",null,null,null,null,null,null,null,null,null,null,null,null,null,null,null,null,null,null,null,null,null,null,null,null,null,0,null,null,null,null,null,null,null,null,null,null,null,null,null,null,null,null,null,null,null,null,null,null,null,null,null,null,null,null,null,null,null,null,null,null,null,null,{"$f":"SUM(D12:BM12)","v":0},"Km  renseignés",{"$f":"SUM(BN12+BN13)","v":200},null,null,null,null,null,null,null,null,null,null,null,null,null,null,null,null,null,{"$f":"SUM(BQ12:CG12)","v":0},"Km  renseignés",{"$f":"SUM(CH12+CH13)","v":0},"Km  renseignés",{"$f":"SUM(BP12+CJ12)","v":200},null,5,{"$f":"VLOOKUP(CN12,A8:B188,2)","v":"BRUNEAU Denis-Claude"},{"$f":"SUM(BP24)","v":200},{"$f":"SUM(CJ24)","v":0},200]
[null,null,"Ronde",null,null,null,null,null,null,null,null,null,null,null,null,null,null,null,null,null,null,null,null,null,null,null,null,null,200,null,null,null,null,null,null,null,null,null,null,null,null,null,null,null,null,null,null,null,null,null,null,null,null,null,null,null,null,null,null,null,null,null,null,null,null,{"$f":"SUM(D13:BM13)","v":200},"Km confirmés",{"$f":"SUM(D15:BM15)","v":0},null,null,null,null,null,null,null,null,null,null,null,null,null,null,null,null,null,{"$f":"SUM(BQ13:CG13)","v":0},"Km confirmés",{"$f":"SUM(BQ15:CG15)","v":0},"Km confirmés",{"$f":"SUM(CJ13+BP13)","v":0},null,6,{"$f":"VLOOKUP(CN13,A8:B188,2)","v":"DAVIN Philippe"},{"$f":"SUM(BP28)","v":3835},{"$f":"SUM(CJ28)","v":465},4300]
[null,null,null,0,0,0,0,0,0,0,0,0,0,0,0,0,0,0,0,0,0,0,0,0,0,0,0,0,0,0,0,0,0,0,0,0,0,0,0,0,0,0,0,0,0,0,0,0,0,0,0,0,0,0,0,0,0,0,0,0,0,0,0,0,0,null,"Rondes confirmées",0,0,0,0,0,0,0,0,0,0,0,0,0,0,0,0,0,0,null,"Rondes confirmées",{"$f":"SUM(BQ14:CH14)","v":0},"Rondes confirmées",{"$f":"SUM(CJ14+BP14)","v":0},null,7,{"$f":"VLOOKUP(CN14,A8:B188,2)","v":"DE SCHEPPERS Jean-Claude"},{"$f":"SUM(BP32)","v":0},{"$f":"SUM(CJ32)","v":0},0]
[null,null,null,{"$f":"SUM((D12+D13)*D14)","v":0},0,0,0,0,0,0,0,0,0,0,0,0,0,0,0,0,0,0,0,0,0,0,0,0,0,0,0,0,0,0,0,0,0,0,0,0,0,0,0,0,0,0,0,0,0,0,0,0,0,0,0,0,0,0,0,0,0,{"$f":"SUM((BJ12+BJ13)*BJ14)","v":0},{"$f":"SUM((BK12+BK13)*BK14)","v":0},{"$f":"SUM((BL12+BL13)*BL14)","v":0},0,null,"Rondes effectuées",{"$f":"COUNTIF(D12:BM12,\">0\")","v":0},{"$f":"SUM((BQ12+BQ13)*BQ14)","v":0},0,0,0,0,0,0,0,0,0,0,0,0,0,0,0,0,null,"Rondes Effectuées",{"$f":"COUNTIF(BQ12:CG12,\">0\")","v":0},"Rondes effectuées",{"$f":"SUM(CJ15+BP15)","v":0},null,8,{"$f":"VLOOKUP(CN15,A8:B188,2)","v":"DECUYPER Frédéric"},{"$f":"SUM(BP36)","v":0},{"$f":"SUM(CJ36)","v":0},0]
[3,{"$f":"VLOOKUP(A16,'Numéro licences'!$H$4:$I$47,2)","v":"BERDOYES Bruno"},"Aller-Retour",null,null,null,null,null,null,null,null,null,null,null,null,null,null,null,null,null,null,null,null,null,null,null,null,null,null,null,null,null,null,null,null,null,null,null,null,null,null,null,null,null,null,null,null,null,null,null,null,null,null,null,null,null,null,null,null,null,null,null,null,null,null,{"$f":"SUM(D16:BM16)","v":0},"Km  renseignés",{"$f":"SUM(BN16+BN17)","v":0},null,null,null,null,null,null,null,null,null,null,null,null,null,null,null,null,null,{"$f":"SUM(BQ16:CG16)","v":0},"Km  renseignés",{"$f":"SUM(CH16+CH17)","v":0},"Km  renseignés",{"$f":"SUM(BP16+CJ16)","v":0},null,9,{"$f":"VLOOKUP(CN16,A8:B188,2)","v":"DEWAERSEGHERS Francis"},{"$f":"SUM(BP40)","v":589},{"$f":"SUM(CJ40)","v":0},589]
[null,null,"Ronde",null,null,null,null,null,null,null,null,null,null,null,null,null,null,null,null,null,null,null,null,null,null,null,null,null,null,null,null,null,null,null,null,null,null,null,null,null,null,null,null,null,null,null,null,null,null,null,null,null,null,null,null,null,null,null,null,null,null,null,null,null,null,{"$f":"SUM(D17:BM17)","v":0},"Km confirmés",{"$f":"SUM(D19:BM19)","v":0},null,null,null,null,null,null,null,null,null,null,null,null,null,null,null,null,null,{"$f":"SUM(BQ17:CG17)","v":0},"Km confirmés",{"$f":"SUM(BQ19:CG19)","v":0},"Km confirmés",{"$f":"SUM(CJ17+BP17)","v":0},null,10,{"$f":"VLOOKUP(CN17,A8:B188,2)","v":"DHONDT Jerry"},{"$f":"SUM(BP44)","v":1514},{"$f":"SUM(CJ44)","v":582},2096]
[null,null,null,0,0,0,0,0,0,0,0,0,0,0,0,0,0,0,0,0,0,0,0,0,0,0,0,0,0,0,0,0,0,0,0,0,0,0,0,0,0,0,0,0,0,0,0,0,0,0,0,0,0,0,0,0,0,0,0,0,0,0,0,0,0,null,"Rondes confirmées",0,0,0,0,0,0,0,0,0,0,0,0,0,0,0,0,0,0,null,"Rondes confirmées",{"$f":"SUM(BQ18:CH18)","v":0},"Rondes confirmées",{"$f":"SUM(CJ18+BP18)","v":0},null,11,{"$f":"VLOOKUP(CN18,A8:B188,2)","v":"DONY Marc"},{"$f":"SUM(BP48)","v":1756},{"$f":"SUM(CJ48)","v":582},2338]
[null,null,null,{"$f":"SUM((D16+D17)*D18)","v":0},0,0,0,0,0,0,0,0,0,0,0,0,0,0,0,0,0,0,0,0,0,0,0,0,0,0,0,0,0,0,0,0,0,0,0,0,0,0,0,0,0,0,0,0,0,0,0,0,0,0,0,0,0,0,0,0,0,{"$f":"SUM((BJ16+BJ17)*BJ18)","v":0},{"$f":"SUM((BK16+BK17)*BK18)","v":0},{"$f":"SUM((BL16+BL17)*BL18)","v":0},0,null,"Rondes effectuées",{"$f":"COUNTIF(D16:BM16,\">0\")","v":0},{"$f":"SUM((BQ16+BQ17)*BQ18)","v":0},0,0,0,0,0,0,0,0,0,0,0,0,0,0,0,0,null,"Rondes Effectuées",{"$f":"COUNTIF(BQ16:CG16,\">0\")","v":0},"Rondes effectuées",{"$f":"SUM(CJ19+BP19)","v":0},null,12,{"$f":"VLOOKUP(CN19,A8:B188,2)","v":"DUMONT Christophe"},{"$f":"SUM(BP52)","v":0},{"$f":"SUM(CJ52)","v":0},0]
[4,{"$f":"VLOOKUP(A20,'Numéro licences'!$H$4:$I$47,2)","v":"BERDOYES Yannick"},"Aller-Retour",null,null,null,null,null,null,null,null,null,null,null,null,null,null,null,null,null,null,null,null,null,null,null,null,null,null,null,null,null,null,null,null,null,null,null,null,null,null,null,null,null,null,null,null,null,null,null,null,null,null,null,null,null,null,null,null,null,null,null,null,null,null,{"$f":"SUM(D20:BM20)","v":0},"Km  renseignés",{"$f":"SUM(BN20:BN21)","v":0},null,0,null,null,null,null,null,null,null,null,null,null,null,null,null,null,null,{"$f":"SUM(BQ20:CG20)","v":0},"Km  renseignés",{"$f":"SUM(CH20+CH21)","v":200},"Km  renseignés",{"$f":"SUM(BP20+CJ20)","v":200},null,13,{"$f":"VLOOKUP(CN20,A8:B188,2)","v":"FAVRESSSE René"},{"$f":"SUM(BP56)","v":751},{"$f":"SUM(CJ56)","v":0},751]
[null,null,"Ronde",null,null,null,null,null,null,null,null,null,null,null,null,null,null,null,null,null,null,null,null,null,null,null,null,null,null,null,null,null,null,null,null,null,null,null,null,null,null,null,null,null,null,null,null,null,null,null,null,null,null,null,null,null,null,null,null,null,null,null,null,null,null,{"$f":"SUM(D21:BM21)","v":0},"Km confirmés",{"$f":"SUM(D23:BM23)","v":0},null,200,null,null,null,null,null,null,null,null,null,null,null,null,null,null,null,{"$f":"SUM(BQ21:CG21)","v":200},"Km confirmés",{"$f":"SUM(BQ23:CG23)","v":0},"Km confirmés",{"$f":"SUM(CJ21+BP21)","v":0},null,14,{"$f":"VLOOKUP(CN21,A8:B188,2)","v":"GOFFIN Amaury"},{"$f":"SUM(BP60)","v":0},{"$f":"SUM(CJ60)","v":0},0]
[null,null,null,0,0,0,0,0,0,0,0,0,0,0,0,0,0,0,0,0,0,0,0,0,0,0,0,0,0,0,0,0,0,0,0,0,0,0,0,0,0,0,0,0,0,0,0,0,0,0,0,0,0,0,0,0,0,0,0,0,0,0,0,0,0,null,"Rondes confirmées",0,0,0,0,0,0,0,0,0,0,0,0,0,0,0,0,0,0,null,"Rondes confirmées",{"$f":"SUM(BQ22:CH22)","v":0},"Rondes confirmées",{"$f":"SUM(CJ22+BP22)","v":0},null,15,{"$f":"VLOOKUP(CN22,A8:B188,2)","v":"JAMOTTE Jean"},{"$f":"SUM(BP64)","v":7020},{"$f":"SUM(CJ64)","v":1003},8023]
[null,null,null,{"$f":"SUM((D20+D21)*D22)","v":0},0,0,0,0,0,0,0,0,0,0,0,0,0,0,0,0,0,0,0,0,0,0,0,0,0,0,0,0,0,0,0,0,0,0,0,0,0,0,0,0,0,0,0,0,0,0,0,0,0,0,0,0,0,0,0,0,0,{"$f":"SUM((BJ20+BJ21)*BJ22)","v":0},{"$f":"SUM((BK20+BK21)*BK22)","v":0},{"$f":"SUM((BL20+BL21)*BL22)","v":0},0,null,"Rondes effectuées",{"$f":"COUNTIF(D20:BM20,\">0\")","v":0},{"$f":"SUM((BQ20+BQ21)*BQ22)","v":0},0,0,0,0,0,0,0,0,0,0,0,0,0,0,0,0,null,"Rondes Effectuées",{"$f":"COUNTIF(BQ20:CG20,\">0\")","v":0},"Rondes effectuées",{"$f":"SUM(CJ23+BP23)","v":0},null,16,{"$f":"VLOOKUP(CN23,A8:B188,2)","v":"LAMBOTTE Didier"},{"$f":"SUM(BP68)","v":0},{"$f":"SUM(CJ68)","v":0},0]
[5,{"$f":"VLOOKUP(A24,'Numéro licences'!$H$4:$I$47,2)","v":"BRUNEAU Denis-Claude"},"Aller-Retour",null,null,null,null,null,null,null,null,null,null,null,null,null,null,null,null,null,null,null,null,null,null,null,null,null,0,null,null,null,null,null,null,null,null,null,null,null,null,null,null,null,null,null,null,null,null,null,null,null,null,null,null,null,null,null,null,null,null,null,null,null,null,{"$f":"SUM(D24:BM24)","v":0},"Km  renseignés",{"$f":"SUM(BN24:BN25)","v":200},null,null,null,null,null,null,null,null,null,null,null,null,null,null,null,null,null,{"$f":"SUM(BQ24:CG24)","v":0},"Km  renseignés",{"$f":"SUM(CH24+CH25)","v":0},"Km  renseignés",{"$f":"SUM(BP24+CJ24)","v":200},null,17,{"$f":"VLOOKUP(CN24,A8:B188,2)","v":"LEFEVRE Francis"},{"$f":"SUM(BP72)","v":0},{"$f":"SUM(CJ72)","v":0},0]
[null,null,"Ronde",null,null,null,null,null,null,null,null,null,null,null,null,null,null,null,null,null,null,null,null,null,null,null,null,null,200,null,null,null,null,null,null,null,null,null,null,null,null,null,null,null,null,null,null,null,null,null,null,null,null,null,null,null,null,null,null,null,null,null,null,null,null,{"$f":"SUM(D25:BM25)","v":200},"Km confirmés",{"$f":"SUM(D27:BM27)","v":0},null,null,null,null,null,null,null,null,null,null,null,null,null,null,null,null,null,{"$f":"SUM(BQ25:CG25)","v":0},"Km confirmés",{"$f":"SUM(BQ27:CG27)","v":0},"Km confirmés",{"$f":"SUM(CJ25+BP25)","v":0},null,18,{"$f":"VLOOKUP(CN25,A8:B188,2)","v":"LESCAL Thierry"},{"$f":"SUM(BP76)","v":7515},{"$f":"SUM(CJ76)","v":1003},8518]
[null,null,null,0,0,0,0,0,0,0,0,0,0,0,0,0,0,0,0,0,0,0,0,0,0,0,0,0,0,0,0,0,0,0,0,0,0,0,0,0,0,0,0,0,0,0,0,0,0,0,0,0,0,0,0,0,0,0,0,0,0,0,0,0,0,null,"Rondes confirmées",{"$f":"SUM(C26:BM26)","v":0},0,0,0,0,0,0,0,0,0,0,0,0,0,0,0,0,0,null,"Rondes confirmées",{"$f":"SUM(BQ26:CH26)","v":0},"Rondes confirmées",{"$f":"SUM(CJ26+BP26)","v":0},null,19,{"$f":"VLOOKUP(CN26,A8:B188,2)","v":"MALLIEN Philippe"},{"$f":"SUM(BP80)","v":200},{"$f":"SUM(CJ80)","v":0},200]
[null,null,null,{"$f":"SUM((D24+D25)*D26)","v":0},0,0,0,0,0,0,0,0,0,0,0,0,0,0,0,0,0,0,0,0,0,0,0,0,0,0,0,0,0,0,0,0,0,0,0,0,0,0,0,0,0,0,0,0,0,0,0,0,0,0,0,0,0,0,0,0,0,{"$f":"SUM((BJ24+BJ25)*BJ26)","v":0},{"$f":"SUM((BK24+BK25)*BK26)","v":0},{"$f":"SUM((BL24+BL25)*BL26)","v":0},0,null,"Rondes effectuées",{"$f":"COUNTIF(D24:BM24,\">0\")","v":0},{"$f":"SUM((BQ24+BQ25)*BQ26)","v":0},0,0,0,0,0,0,0,0,0,0,0,0,0,0,0,0,null,"Rondes Effectuées",{"$f":"COUNTIF(BQ24:CG24,\">0\")","v":0},"Rondes effectuées",{"$f":"SUM(CJ27+BP27)","v":0},null,20,{"$f":"VLOOKUP(CN27,A8:B188,2)","v":"MARIEL Didier"},{"$f":"SUM(BP84)","v":452},{"$f":"SUM(CJ84)","v":356},808]
[6,{"$f":"VLOOKUP(A28,'Numéro licences'!$H$4:$I$47,2)","v":"DAVIN Philippe"},"Aller-Retour",null,null,null,null,null,null,null,null,null,null,null,null,null,null,null,null,null,null,124,null,124,null,38,null,null,0,null,null,148,60,null,null,null,52,344,162,null,null,null,null,null,null,null,null,null,null,null,null,60,null,124,null,null,null,null,null,null,null,null,null,null,52,{"$f":"SUM(D28:BM28)","v":1288},"Km  renseignés",{"$f":"SUM(BN28:BN29)","v":3835},null,0,79,null,null,null,null,null,null,null,null,null,null,null,null,null,null,{"$f":"SUM(BQ28:CG28)","v":79},"Km  renseignés",{"$f":"SUM(CH28+CH29)","v":465},"Km  renseignés",{"$f":"SUM(BP28+CJ28)","v":4300},null,21,{"$f":"VLOOKUP(CN28,A8:B188,2)","v":"MILET Benoit"},{"$f":"SUM(BP88)","v":0},{"$f":"SUM(CJ88)","v":0},0]
[null,null,"Ronde",null,null,null,null,null,null,null,null,null,null,null,null,null,null,null,null,null,null,215,null,195,null,513,null,null,200,null,null,200,0,null,null,null,200,300,220,null,null,null,null,null,null,null,null,null,null,null,null,194,null,180,null,null,null,null,null,null,null,null,null,null,130,{"$f":"SUM(D29:BM29)","v":2547},"Km confirmés",{"$f":"SUM(D31:BM31)","v":3835},null,200,186,null,null,null,null,null,null,null,null,null,null,null,null,null,null,{"$f":"SUM(BQ29:CG29)","v":386},"Km confirmés",{"$f":"SUM(BQ31:CG31)","v":465},"Km confirmés",{"$f":"SUM(CJ29+BP29)","v":4300},null,22,{"$f":"VLOOKUP(CN29,A8:B188,2)","v":"NIHOUL Dany"},{"$f":"SUM(BP92)","v":4194},{"$f":"SUM(CJ92)","v":1003},5197]
[null,null,null,0,0,0,0,0,0,0,0,0,0,0,0,0,0,0,0,0,0,1,0,1,0,1,0,0,1,0,0,1,1,0,0,0,1,1,1,0,0,0,0,0,0,0,0,0,0,0,0,1,0,1,0,0,0,0,0,0,0,0,0,0,1,null,"Rondes confirmées",{"$f":"SUM(C30:BM30)","v":12},0,1,1,0,0,0,0,0,0,0,0,0,0,0,0,0,0,null,"Rondes confirmées",{"$f":"SUM(BQ30:CH30)","v":2},"Rondes confirmées",{"$f":"SUM(CJ30+BP30)","v":14},null,23,{"$f":"VLOOKUP(CN30,A8:B188,2)","v":"OVAERE Jimmy"},{"$f":"SUM(BP96)","v":0},{"$f":"SUM(CJ96)","v":0},0]
[null,null,null,{"$f":"SUM((D28+D29)*D30)","v":0},0,0,0,0,0,0,0,0,0,0,0,0,0,0,0,0,0,339,0,319,0,551,0,0,200,0,0,348,60,0,0,0,252,644,382,0,0,0,0,0,0,0,0,0,0,0,0,254,0,304,0,0,0,0,0,0,0,{"$f":"SUM((BJ28+BJ29)*BJ30)","v":0},{"$f":"SUM((BK28+BK29)*BK30)","v":0},{"$f":"SUM((BL28+BL29)*BL30)","v":0},182,null,"Rondes effectuées",{"$f":"COUNTIF(D28:BM28,\">0\")","v":11},{"$f":"SUM((BQ28+BQ29)*BQ30)","v":0},200,265,0,0,0,0,0,0,0,0,0,0,0,0,0,0,null,"Rondes Effectuées",{"$f":"COUNTIF(BQ28:CG28,\">0\")","v":1},"Rondes effectuées",{"$f":"SUM(CJ31+BP31)","v":12},null,24,{"$f":"VLOOKUP(CN31,A8:B188,2)","v":"PARMENTIER Dominique"},{"$f":"SUM(BP100)","v":364},{"$f":"SUM(CJ100)","v":200},564]
[7,{"$f":"VLOOKUP(A32,'Numéro licences'!$H$4:$I$47,2)","v":"DE SCHEPPERS Jean-Claude"},"Aller-Retour",null,null,null,null,null,null,null,null,null,null,null,null,null,null,null,null,null,null,null,null,null,null,null,null,null,null,null,null,null,null,null,null,null,null,null,null,null,null,null,null,null,null,null,null,null,null,null,null,null,null,null,null,null,null,null,null,null,null,null,null,null,null,{"$f":"SUM(D32:BM32)","v":0},"Km  renseignés",{"$f":"SUM(BN32:BN33)","v":0},null,null,null,null,null,null,null,null,null,null,null,null,null,null,null,null,null,{"$f":"SUM(BQ32:CG32)","v":0},"Km  renseignés",{"$f":"SUM(CH32+CH33)","v":0},"Km  renseignés",{"$f":"SUM(BP32+CJ32)","v":0},null,25,{"$f":"VLOOKUP(CN32,A8:B188,2)","v":"POCHET Jean-Dominique"},{"$f":"SUM(BP104)","v":0},{"$f":"SUM(CJ104)","v":0},0]
[null,null,"Ronde",null,null,null,null,null,null,null,null,null,null,null,null,null,null,null,null,null,null,null,null,null,null,null,null,null,null,null,null,null,null,null,null,null,null,null,null,null,null,null,null,null,null,null,null,null,null,null,null,null,null,null,null,null,null,null,null,null,null,null,null,null,null,{"$f":"SUM(D33:BM33)","v":0},"Km confirmés",{"$f":"SUM(D35:BM35)","v":0},null,null,null,null,null,null,null,null,null,null,null,null,null,null,null,null,null,{"$f":"SUM(BQ33:CG33)","v":0},"Km confirmés",{"$f":"SUM(BQ35:CG35)","v":0},"Km confirmés",{"$f":"SUM(CJ33+BP33)","v":0},null,26,{"$f":"VLOOKUP(CN33,A8:B188,2)","v":"POMPIER Philippe"},{"$f":"SUM(BP108)","v":0},{"$f":"SUM(CJ108)","v":0},0]
[null,null,null,0,0,0,0,0,0,0,0,0,0,0,0,0,0,0,0,0,0,0,0,0,0,0,0,0,0,0,0,0,0,0,0,0,0,0,0,0,0,0,0,0,0,0,0,0,0,0,0,0,0,0,0,0,0,0,0,0,0,0,0,0,0,null,"Rondes confirmées",0,0,0,0,0,0,0,0,0,0,0,0,0,0,0,0,0,0,null,"Rondes confirmées",{"$f":"SUM(BQ34:CH34)","v":0},"Rondes confirmées",{"$f":"SUM(CJ34+BP34)","v":0},null,27,{"$f":"VLOOKUP(CN34,A8:B188,2)","v":"RAMEAU Didier"},{"$f":"SUM(BP112)","v":690},{"$f":"SUM(CJ112)","v":621},1311]
[null,null,null,{"$f":"SUM((D32+D33)*D34)","v":0},0,0,0,0,0,0,0,0,0,0,0,0,0,0,0,0,0,0,0,0,0,0,0,0,0,0,0,0,0,0,0,0,0,0,0,0,0,0,0,0,0,0,0,0,0,0,0,0,0,0,0,0,0,0,0,0,0,{"$f":"SUM((BJ32+BJ33)*BJ34)","v":0},{"$f":"SUM((BK32+BK33)*BK34)","v":0},{"$f":"SUM((BL32+BL33)*BL34)","v":0},0,null,"Rondes effectuées",{"$f":"COUNTIF(D32:BM32,\">0\")","v":0},{"$f":"SUM((BQ32+BQ33)*BQ34)","v":0},0,0,0,0,0,0,0,0,0,0,0,0,0,0,0,0,null,"Rondes Effectuées",{"$f":"COUNTIF(BQ32:CG32,\">0\")","v":0},"Rondes effectuées",{"$f":"SUM(CJ35+BP35)","v":0},null,28,{"$f":"VLOOKUP(CN35,A8:B188,2)","v":"SPITAELS Bernard"},{"$f":"SUM(BP116)","v":252},{"$f":"SUM(CJ116)","v":265},517]
[8,{"$f":"VLOOKUP(A36,'Numéro licences'!$H$4:$I$47,2)","v":"DECUYPER Frédéric"},"Aller-Retour",null,null,null,null,null,null,null,null,null,null,null,null,null,null,null,null,null,null,null,null,null,null,null,null,null,null,null,null,null,null,null,null,null,null,null,null,null,null,null,null,null,null,null,null,null,null,null,null,null,null,null,null,null,null,null,null,null,null,null,null,null,null,{"$f":"SUM(D36:BM36)","v":0},"Km  renseignés",{"$f":"SUM(BN36:BN37)","v":0},null,null,null,null,null,null,null,null,null,null,null,null,null,null,null,null,null,{"$f":"SUM(BQ36:CG36)","v":0},"Km  renseignés",{"$f":"SUM(CH36+CH37)","v":0},"Km  renseignés",{"$f":"SUM(BP36+CJ36)","v":0},null,29,{"$f":"VLOOKUP(CN36,A8:B188,2)","v":"TERWAGNE Freddy"},{"$f":"SUM(BP120)","v":0},{"$f":"SUM(CJ120)","v":0},0]
[null,null,"Ronde",null,null,null,null,null,null,null,null,null,null,null,null,null,null,null,null,null,null,null,null,null,null,null,null,null,null,null,null,null,null,null,null,null,null,null,null,null,null,null,null,null,null,null,null,null,null,null,null,null,null,null,null,null,null,null,null,null,null,null,null,null,null,{"$f":"SUM(D37:BM37)","v":0},"Km confirmés",{"$f":"SUM(D39:BM39)","v":0},null,null,null,null,null,null,null,null,null,null,null,null,null,null,null,null,null,{"$f":"SUM(BQ37:CG37)","v":0},"Km confirmés",{"$f":"SUM(BQ39:CG39)","v":0},"Km confirmés",{"$f":"SUM(CJ37+BP37)","v":0},null,30,{"$f":"VLOOKUP(CN37,A8:B188,2)","v":"TERWAGNE Julien"},{"$f":"SUM(BP124)","v":0},{"$f":"SUM(CJ124)","v":0},0]
[null,null,null,0,0,0,0,0,0,0,0,0,0,0,0,0,0,0,0,0,0,0,0,0,0,0,0,0,0,0,0,0,0,0,0,0,0,0,0,0,0,0,0,0,0,0,0,0,0,0,0,0,0,0,0,0,0,0,0,0,0,0,0,0,0,null,"Rondes confirmées",0,0,0,0,0,0,0,0,0,0,0,0,0,0,0,0,0,0,null,"Rondes confirmées",{"$f":"SUM(BQ38:CH38)","v":0},"Rondes confirmées",{"$f":"SUM(CJ38+BP38)","v":0},null,31,{"$f":"VLOOKUP(CN38,A8:B188,2)","v":"THOMAS Isabelle"},{"$f":"SUM(BP128)","v":0},{"$f":"SUM(CJ128)","v":0},0]
[null,null,null,{"$f":"SUM((D36+D37)*D38)","v":0},0,0,0,0,0,0,0,0,0,0,0,0,0,0,0,0,0,0,0,0,0,0,0,0,0,0,0,0,0,0,0,0,0,0,0,0,0,0,0,0,0,0,0,0,0,0,0,0,0,0,0,0,0,0,0,0,0,{"$f":"SUM((BJ36+BJ37)*BJ38)","v":0},{"$f":"SUM((BK36+BK37)*BK38)","v":0},{"$f":"SUM((BL36+BL37)*BL38)","v":0},0,null,"Rondes effectuées",{"$f":"COUNTIF(D36:BM36,\">0\")","v":0},{"$f":"SUM((BQ36+BQ37)*BQ38)","v":0},0,0,0,0,0,0,0,0,0,0,0,0,0,0,0,0,null,"Rondes Effectuées",{"$f":"COUNTIF(BQ36:CG36,\">0\")","v":0},"Rondes effectuées",{"$f":"SUM(CJ39+BP39)","v":0},null,32,{"$f":"VLOOKUP(CN39,A8:B188,2)","v":"URBAIN Philippe"},{"$f":"SUM(BP132)","v":0},{"$f":"SUM(CJ132)","v":156},156]
[9,{"$f":"VLOOKUP(A40,'Numéro licences'!$H$4:$I$47,2)","v":"DEWAERSEGHERS Francis"},"Aller-Retour",null,null,null,null,null,null,null,null,null,null,null,null,null,null,null,null,null,null,null,null,null,null,38,null,null,null,null,null,null,null,null,null,null,null,null,null,null,null,null,null,null,null,null,null,38,null,null,null,null,null,null,null,null,null,null,null,null,null,null,null,null,null,{"$f":"SUM(D40:BM40)","v":76},"Km  renseignés",{"$f":"SUM(BN40:BN41)","v":589},null,null,null,null,null,null,null,null,null,null,null,null,null,null,null,null,null,{"$f":"SUM(BQ40:CG40)","v":0},"Km  renseignés",{"$f":"SUM(CH40+CH41)","v":0},"Km  renseignés",{"$f":"SUM(BP40+CJ40)","v":589},null,33,{"$f":"VLOOKUP(CN40,A8:B188,2)","v":"VANBELLINGEN Jean-Claude"},{"$f":"SUM(BP136)","v":863},{"$f":"SUM(CJ136)","v":0},863]
[null,null,"Ronde",null,null,null,null,null,null,null,null,null,null,null,null,null,null,null,null,null,null,null,null,null,null,513,null,null,null,null,null,null,null,null,null,null,null,null,null,null,null,null,null,null,null,null,null,0,null,null,null,null,null,null,null,null,null,null,null,null,null,null,null,null,null,{"$f":"SUM(D41:BM41)","v":513},"Km confirmés",{"$f":"SUM(D43:BM43)","v":0},null,null,null,null,null,null,null,null,null,null,null,null,null,null,null,null,null,{"$f":"SUM(BQ41:CG41)","v":0},"Km confirmés",{"$f":"SUM(BQ43:CG43)","v":0},"Km confirmés",{"$f":"SUM(CJ41+BP41)","v":0},null,34,{"$f":"VLOOKUP(CN41,A8:B188,2)","v":"VANDEN BOSSCHE Vincent"},{"$f":"SUM(BP140)","v":0},{"$f":"SUM(CJ140)","v":0},0]
[null,null,null,0,0,0,0,0,0,0,0,0,0,0,0,0,0,0,0,0,0,0,0,0,0,0,0,0,0,0,0,0,0,0,0,0,0,0,0,0,0,0,0,0,0,0,0,0,0,0,0,0,0,0,0,0,0,0,0,0,0,0,0,0,0,null,"Rondes confirmées",0,0,0,0,0,0,0,0,0,0,0,0,0,0,0,0,0,0,null,"Rondes confirmées",{"$f":"SUM(BQ42:CH42)","v":0},"Rondes confirmées",{"$f":"SUM(CJ42+BP42)","v":0},null,35,{"$f":"VLOOKUP(CN42,A8:B188,2)","v":"VANDEN WAEYENBERGH Michel"},{"$f":"SUM(BP144)","v":0},{"$f":"SUM(CJ144)","v":0},0]
[null,null,null,{"$f":"SUM((D40+D41)*D42)","v":0},0,0,0,0,0,0,0,0,0,0,0,0,0,0,0,0,0,0,0,0,0,0,0,0,0,0,0,0,0,0,0,0,0,0,0,0,0,0,0,0,0,0,0,0,0,0,0,0,0,0,0,0,0,0,0,0,0,{"$f":"SUM((BJ40+BJ41)*BJ42)","v":0},{"$f":"SUM((BK40+BK41)*BK42)","v":0},{"$f":"SUM((BL40+BL41)*BL42)","v":0},0,null,"Rondes effectuées",{"$f":"COUNTIF(D40:BM40,\">0\")","v":2},{"$f":"SUM((BQ40+BQ41)*BQ42)","v":0},0,0,0,0,0,0,0,0,0,0,0,0,0,0,0,0,null,"Rondes Effectuées",{"$f":"COUNTIF(BQ40:CG40,\">0\")","v":0},"Rondes effectuées",{"$f":"SUM(CJ43+BP43)","v":2},null,36,{"$f":"VLOOKUP(CN43,A8:B188,2)","v":"VANSTEYVOORT André"},{"$f":"SUM(BP148)","v":200},{"$f":"SUM(CJ148)","v":0},200]
[10,{"$f":"VLOOKUP(A44,'Numéro licences'!$H$4:$I$47,2)","v":"DHONDT Jerry"},"Aller-Retour",null,null,null,null,null,null,null,null,null,null,null,null,null,null,null,null,null,null,null,null,null,null,null,null,null,null,null,null,null,null,null,null,null,52,null,null,null,null,null,null,null,null,null,null,38,null,60,null,60,null,124,null,null,null,null,null,166,null,null,null,null,null,{"$f":"SUM(D44:BM44)","v":500},"Km  renseignés",{"$f":"SUM(BN44:BN45)","v":1514},166,0,null,null,null,null,null,null,null,null,null,null,null,null,null,null,null,{"$f":"SUM(BQ44:CG44)","v":166},"Km  renseignés",{"$f":"SUM(CH44+CH45)","v":582},"Km  renseignés",{"$f":"SUM(BP44+CJ44)","v":2096},null,37,{"$f":"VLOOKUP(CN44,A8:B188,2)","v":"WOUTERS Olivier"},{"$f":"SUM(BP152)","v":4099},{"$f":"SUM(CJ152)","v":582},4681]
[null,null,"Ronde",null,null,null,null,null,null,null,null,null,null,null,null,null,null,null,null,null,null,null,null,null,null,null,null,null,null,null,null,null,null,null,null,null,200,null,null,null,null,null,null,null,null,null,null,220,null,0,null,194,null,180,null,null,null,null,null,220,null,null,null,null,null,{"$f":"SUM(D45:BM45)","v":1014},"Km confirmés",{"$f":"SUM(D47:BM47)","v":0},216,200,null,null,null,null,null,null,null,null,null,null,null,null,null,null,null,{"$f":"SUM(BQ45:CG45)","v":416},"Km confirmés",{"$f":"SUM(BQ47:CG47)","v":0},"Km confirmés",{"$f":"SUM(CJ45+BP45)","v":0},null,38,{"$f":"VLOOKUP(CN45,A8:B188,2)","v":"DEMETS Eric"},{"$f":"SUM(BP156)","v":551},{"$f":"SUM(CJ156)","v":200},751]
[null,null,null,0,0,0,0,0,0,0,0,0,0,0,0,0,0,0,0,0,0,0,0,0,0,0,0,0,0,0,0,0,0,0,0,0,0,0,0,0,0,0,0,0,0,0,0,0,0,0,0,0,0,0,0,0,0,0,0,0,0,0,0,0,0,null,"Rondes confirmées",0,0,0,0,0,0,0,0,0,0,0,0,0,0,0,0,0,0,null,"Rondes confirmées",{"$f":"SUM(BQ46:CH46)","v":0},"Rondes confirmées",{"$f":"SUM(CJ46+BP46)","v":0},null,39,{"$f":"VLOOKUP(CN46,A8:B188,2)","v":"DECELLE Hubert"},{"$f":"SUM(BP160)","v":551},{"$f":"SUM(CJ160)","v":200},751]
[null,null,null,{"$f":"SUM((D44+D45)*D46)","v":0},0,0,0,0,0,0,0,0,0,0,0,0,0,0,0,0,0,0,0,0,0,0,0,0,0,0,0,0,0,0,0,0,0,0,0,0,0,0,0,0,0,0,0,0,0,0,0,0,0,0,0,0,0,0,0,0,0,{"$f":"SUM((BJ44+BJ45)*BJ46)","v":0},{"$f":"SUM((BK44+BK45)*BK46)","v":0},{"$f":"SUM((BL44+BL45)*BL46)","v":0},0,null,"Rondes effectuées",{"$f":"COUNTIF(D44:BM44,\">0\")","v":6},{"$f":"SUM((BQ44+BQ45)*BQ46)","v":0},0,0,0,0,0,0,0,0,0,0,0,0,0,0,0,0,null,"Rondes Effectuées",{"$f":"COUNTIF(BQ44:CG44,\">0\")","v":1},"Rondes effectuées",{"$f":"SUM(CJ47+BP47)","v":7},null,40,{"$f":"VLOOKUP(CN47,A8:B188,2)","v":0},{"$f":"SUM(BP164)","v":0},{"$f":"SUM(CJ164)","v":0},0]
[11,{"$f":"VLOOKUP(A48,'Numéro licences'!$H$4:$I$47,2)","v":"DONY Marc"},"Aller-Retour",null,null,null,null,null,null,null,null,null,null,null,null,null,null,null,null,null,null,null,null,null,null,null,null,null,0,null,null,null,null,140,null,null,52,null,null,null,null,176,null,null,null,null,null,null,null,null,null,60,null,124,null,null,null,null,null,null,null,null,null,null,null,{"$f":"SUM(D48:BM48)","v":552},"Km  renseignés",{"$f":"SUM(BN48:BN49)","v":1756},166,0,null,null,null,null,null,null,null,null,null,null,null,null,null,null,null,{"$f":"SUM(BQ48:CG48)","v":166},"Km  renseignés",{"$f":"SUM(CH48+CH49)","v":582},"Km  renseignés",{"$f":"SUM(BP48+CJ48)","v":2338},null,41,{"$f":"VLOOKUP(CN48,A8:B188,2)","v":0},{"$f":"SUM(BP168)","v":0},{"$f":"SUM(CJ168)","v":0},0]
[null,null,"Ronde",null,null,null,null,null,null,null,null,null,null,null,null,null,null,null,null,null,null,null,null,null,null,null,null,null,200,null,null,null,null,180,null,null,200,null,null,null,null,250,null,null,null,null,null,null,null,null,null,194,null,180,null,null,null,null,null,null,null,null,null,null,null,{"$f":"SUM(D49:BM49)","v":1204},"Km confirmés",{"$f":"SUM(D51:BM51)","v":0},216,200,null,null,null,null,null,null,null,null,null,null,null,null,null,null,null,{"$f":"SUM(BQ49:CG49)","v":416},"Km confirmés",{"$f":"SUM(BQ51:CG51)","v":0},"Km confirmés",{"$f":"SUM(CJ49+BP49)","v":0},null,42,{"$f":"VLOOKUP(CN49,A8:B188,2)","v":0},{"$f":"SUM(BP172)","v":0},{"$f":"SUM(CJ172)","v":0},0]
[null,null,null,0,0,0,0,0,0,0,0,0,0,0,0,0,0,0,0,0,0,0,0,0,0,0,0,0,0,0,0,0,0,0,0,0,0,0,0,0,0,0,0,0,0,0,0,0,0,0,0,0,0,0,0,0,0,0,0,0,0,0,0,0,0,null,"Rondes confirmées",0,0,0,0,0,0,0,0,0,0,0,0,0,0,0,0,0,0,null,"Rondes confirmées",{"$f":"SUM(BQ50:CH50)","v":0},"Rondes confirmées",{"$f":"SUM(CJ50+BP50)","v":0},null,43,{"$f":"VLOOKUP(CN50,A8:B188,2)","v":0},{"$f":"SUM(BP176)","v":0},{"$f":"SUM(CJ176)","v":0},0]
[null,null,null,{"$f":"SUM((D48+D49)*D50)","v":0},0,0,0,0,0,0,0,0,0,0,0,0,0,0,0,0,0,0,0,0,0,0,0,0,0,0,0,0,0,0,0,0,0,0,0,0,0,0,0,0,0,0,0,0,0,0,0,0,0,0,0,0,0,0,0,0,0,{"$f":"SUM((BJ48+BJ49)*BJ50)","v":0},{"$f":"SUM((BK48+BK49)*BK50)","v":0},{"$f":"SUM((BL48+BL49)*BL50)","v":0},0,null,"Rondes effectuées",{"$f":"COUNTIF(D48:BM48,\">0\")","v":5},{"$f":"SUM((BQ48+BQ49)*BQ50)","v":0},0,0,0,0,0,0,0,0,0,0,0,0,0,0,0,0,null,"Rondes Effectuées",{"$f":"COUNTIF(BQ48:CG48,\">0\")","v":1},"Rondes effectuées",{"$f":"SUM(CJ51+BP51)","v":6},null,44,{"$f":"VLOOKUP(CN51,A8:B188,2)","v":0},{"$f":"SUM(BP180)","v":0},{"$f":"SUM(CJ180)","v":0},0]
[12,{"$f":"VLOOKUP(A52,'Numéro licences'!$H$4:$I$47,2)","v":"DUMONT Christophe"},"Aller-Retour",null,null,null,null,null,null,null,null,null,null,null,null,null,null,null,null,null,null,null,null,null,null,null,null,null,null,null,null,null,null,null,null,null,null,null,null,null,null,null,null,null,null,null,null,null,null,null,null,null,null,null,null,null,null,null,null,null,null,null,null,null,null,{"$f":"SUM(D52:BM52)","v":0},"Km  renseignés",{"$f":"SUM(BN52:BN53)","v":0},null,null,null,null,null,null,null,null,null,null,null,null,null,null,null,null,null,{"$f":"SUM(BQ52:CG52)","v":0},"Km  renseignés",{"$f":"SUM(CH52+CH53)","v":0},"Km  renseignés",{"$f":"SUM(BP52+CJ52)","v":0},null,45,{"$f":"VLOOKUP(CN52,A8:B188,2)","v":0},{"$f":"SUM(BP184)","v":0},{"$f":"SUM(CJ184)","v":0},0]
[null,null,"Ronde",null,null,null,null,null,null,null,null,null,null,null,null,null,null,null,null,null,null,null,null,null,null,null,null,null,null,null,null,null,null,null,null,null,null,null,null,null,null,null,null,null,null,null,null,null,null,null,null,null,null,null,null,null,null,null,null,null,null,null,null,null,null,{"$f":"SUM(D53:BM53)","v":0},"Km confirmés",{"$f":"SUM(D55:BM55)","v":0},null,null,null,null,null,null,null,null,null,null,null,null,null,null,null,null,null,{"$f":"SUM(BQ53:CG53)","v":0},"Km confirmés",{"$f":"SUM(BQ55:CG55)","v":0},"Km confirmés",{"$f":"SUM(CJ53+BP53)","v":0},null,46,{"$f":"VLOOKUP(CN53,A8:B188,2)","v":0},{"$f":"SUM(BP188)","v":0},{"$f":"SUM(CJ188)","v":0},0]
[null,null,null,0,0,0,0,0,0,0,0,0,0,0,0,0,0,0,0,0,0,0,0,0,0,0,0,0,0,0,0,0,0,0,0,0,0,0,0,0,0,0,0,0,0,0,0,0,0,0,0,0,0,0,0,0,0,0,0,0,0,0,0,0,0,null,"Rondes confirmées",0,0,0,0,0,0,0,0,0,0,0,0,0,0,0,0,0,0,null,"Rondes confirmées",{"$f":"SUM(BQ54:CH54)","v":0},"Rondes confirmées",{"$f":"SUM(CJ54+BP54)","v":0}]
[null,null,null,{"$f":"SUM((D52+D53)*D54)","v":0},0,0,0,0,0,0,0,0,0,0,0,0,0,0,0,0,0,0,0,0,0,0,0,0,0,0,0,0,0,0,0,0,0,0,0,0,0,0,0,0,0,0,0,0,0,0,0,0,0,0,0,0,0,0,0,0,0,{"$f":"SUM((BJ52+BJ53)*BJ54)","v":0},{"$f":"SUM((BK52+BK53)*BK54)","v":0},{"$f":"SUM((BL52+BL53)*BL54)","v":0},0,null,"Rondes effectuées",{"$f":"COUNTIF(D52:BM52,\">0\")","v":0},{"$f":"SUM((BQ52+BQ53)*BQ54)","v":0},0,0,0,0,0,0,0,0,0,0,0,0,0,0,0,0,null,"Rondes Effectuées",{"$f":"COUNTIF(BQ52:CG52,\">0\")","v":0},"Rondes effectuées",{"$f":"SUM(CJ55+BP55)","v":0}]
[13,{"$f":"VLOOKUP(A56,'Numéro licences'!$H$4:$I$47,2)","v":"FAVRESSSE René"},"Aller-Retour",null,null,null,null,null,null,null,null,null,null,null,null,null,null,null,null,null,null,null,null,null,null,38,null,null,0,null,null,null,null,null,null,null,null,null,null,null,null,null,null,null,null,null,null,null,null,null,null,null,null,null,null,null,null,null,null,null,null,null,null,null,null,{"$f":"SUM(D56:BM56)","v":38},"Km  renseignés",{"$f":"SUM(BN56:BN57)","v":751},null,null,null,null,null,null,null,null,null,null,null,null,null,null,null,null,null,{"$f":"SUM(BQ56:CG56)","v":0},"Km  renseignés",{"$f":"SUM(CH56+CH57)","v":0},"Km  renseignés",{"$f":"SUM(BP56+CJ56)","v":751}]
[null,null,"Ronde",null,null,null,null,null,null,null,null,null,null,null,null,null,null,null,null,null,null,null,null,null,null,513,null,null,200,null,null,null,null,null,null,null,null,null,null,null,null,null,null,null,null,null,null,null,null,null,null,null,null,null,null,null,null,null,null,null,null,null,null,null,null,{"$f":"SUM(D57:BM57)","v":713},"Km confirmés",{"$f":"SUM(D59:BM59)","v":0},null,null,null,null,null,null,null,null,null,null,null,null,null,null,null,null,null,{"$f":"SUM(BQ57:CG57)","v":0},"Km confirmés",{"$f":"SUM(BQ59:CG59)","v":0},"Km confirmés",{"$f":"SUM(CJ57+BP57)","v":0}]
[null,null,null,0,0,0,0,0,0,0,0,0,0,0,0,0,0,0,0,0,0,0,0,0,0,0,0,0,0,0,0,0,0,0,0,0,0,0,0,0,0,0,0,0,0,0,0,0,0,0,0,0,0,0,0,0,0,0,0,0,0,0,0,0,0,null,"Rondes confirmées",0,0,0,0,0,0,0,0,0,0,0,0,0,0,0,0,0,0,null,"Rondes confirmées",{"$f":"SUM(BQ58:CH58)","v":0},"Rondes confirmées",{"$f":"SUM(CJ58+BP58)","v":0}]
[null,null,null,{"$f":"SUM((D56+D57)*D58)","v":0},0,0,0,0,0,0,0,0,0,0,0,0,0,0,0,0,0,0,0,0,0,0,0,0,0,0,0,0,0,0,0,0,0,0,0,0,0,0,0,0,0,0,0,0,0,0,0,0,0,0,0,0,0,0,0,0,0,{"$f":"SUM((BJ56+BJ57)*BJ58)","v":0},{"$f":"SUM((BK56+BK57)*BK58)","v":0},{"$f":"SUM((BL56+BL57)*BL58)","v":0},0,null,"Rondes effectuées",{"$f":"COUNTIF(D56:BM56,\">0\")","v":1},{"$f":"SUM((BQ56+BQ57)*BQ58)","v":0},0,0,0,0,0,0,0,0,0,0,0,0,0,0,0,0,null,"Rondes Effectuées",{"$f":"COUNTIF(BQ56:CG56,\">0\")","v":0},"Rondes effectuées",{"$f":"SUM(CJ59+BP59)","v":1},null,null,null,{"$f":"SUM(CP9:CP53)","v":35796},{"$f":"SUM(CQ9:CQ53)","v":7418},{"$f":"SUM(CR8:CR53)","v":43214}]
[14,{"$f":"VLOOKUP(A60,'Numéro licences'!$H$4:$I$47,2)","v":"GOFFIN Amaury"},"Aller-Retour",null,null,null,null,null,null,null,null,null,null,null,null,null,null,null,null,null,null,null,null,null,null,null,null,null,null,null,null,null,null,null,null,null,null,null,null,null,null,null,null,null,null,null,null,null,null,null,null,null,null,null,null,null,null,null,null,null,null,null,null,null,null,{"$f":"SUM(D60:BM60)","v":0},"Km  renseignés",{"$f":"SUM(BN60:BN61)","v":0},null,null,null,null,null,null,null,null,null,null,null,null,null,null,null,null,null,0,"Km  renseignés",{"$f":"SUM(CH60+CH61)","v":0},"Km  renseignés",{"$f":"SUM(BP60+CJ60)","v":0},null,null,null,{"$f":"SUM(CP59/CR59)","v":0.82834266672837509},{"$f":"SUM(CQ59/CR59)","v":0.17165733327162494}]
[null,null,"Ronde",null,null,null,null,null,null,null,null,null,null,null,null,null,null,null,null,null,null,null,null,null,null,null,null,null,null,null,null,null,null,null,null,null,null,null,null,null,null,null,null,null,null,null,null,null,null,null,null,null,null,null,null,null,null,null,null,null,null,null,null,null,null,{"$f":"SUM(D61:BM61)","v":0},"Km confirmés",{"$f":"SUM(D63:BM63)","v":0},null,null,null,null,null,null,null,null,null,null,null,null,null,null,null,null,null,0,"Km confirmés",{"$f":"SUM(BQ63:CG63)","v":0},"Km confirmés",{"$f":"SUM(CJ61+BP61)","v":0},null,null,null,"FMB","Hors FMB"]
[null,null,null,0,0,0,0,0,0,0,0,0,0,0,0,0,0,0,0,0,0,0,0,0,0,0,0,0,0,0,0,0,0,0,0,0,0,0,0,0,0,0,0,0,0,0,0,0,0,0,0,0,0,0,0,0,0,0,0,0,0,0,0,0,0,null,"Rondes confirmées",0,0,0,0,0,0,0,0,0,0,0,0,0,0,0,0,0,0,null,"Rondes confirmées",{"$f":"SUM(BQ62:CH62)","v":0},"Rondes confirmées",{"$f":"SUM(CJ62+BP62)","v":0}]
[null,null,null,{"$f":"SUM((D60+D61)*D62)","v":0},0,0,0,0,0,0,0,0,0,0,0,0,0,0,0,0,0,0,0,0,0,0,0,0,0,0,0,0,0,0,0,0,0,0,0,0,0,0,0,0,0,0,0,0,0,0,0,0,0,0,0,0,0,0,0,0,0,{"$f":"SUM((BJ60+BJ61)*BJ62)","v":0},{"$f":"SUM((BK60+BK61)*BK62)","v":0},{"$f":"SUM((BL60+BL61)*BL62)","v":0},0,null,"Rondes effectuées",{"$f":"COUNTIF(D60:BM60,\">0\")","v":0},{"$f":"SUM((BQ60+BQ61)*BQ62)","v":0},0,0,0,0,0,0,0,0,0,0,0,0,0,0,0,0,null,"Rondes Effectuées",{"$f":"COUNTIF(BQ60:CG60,\">0\")","v":0},"Rondes effectuées",{"$f":"SUM(CJ63+BP63)","v":0}]
[15,{"$f":"VLOOKUP(A64,'Numéro licences'!$H$4:$I$47,2)","v":"JAMOTTE Jean"},"Aller-Retour",null,null,null,null,null,null,null,null,null,null,null,null,null,null,null,null,null,null,124,null,124,null,38,null,null,0,null,null,148,60,140,null,null,52,344,162,null,null,null,null,null,null,380,null,38,null,null,null,60,null,124,null,null,140,218,null,166,null,174,176,108,52,{"$f":"SUM(D64:BM64)","v":2828},"Km  renseignés",{"$f":"SUM(BN64:BN65)","v":7020},166,0,79,36,null,null,null,null,null,null,null,null,null,null,null,null,null,{"$f":"SUM(BQ64:CG64)","v":281},"Km  renseignés",{"$f":"SUM(CH64+CH65)","v":1003},"Km  renseignés",{"$f":"SUM(BP64+CJ64)","v":8023}]
[null,null,"Ronde",null,null,null,null,null,null,null,null,null,null,null,null,null,null,null,null,null,null,215,null,195,null,513,null,null,200,null,null,200,210,180,null,null,200,300,220,null,null,null,null,null,null,220,null,0,null,null,null,194,null,180,null,null,165,170,null,220,null,165,165,150,130,{"$f":"SUM(D65:BM65)","v":4192},"Km confirmés",{"$f":"SUM(D67:BM67)","v":7020},216,200,186,120,null,null,null,null,null,null,null,null,null,null,null,null,null,{"$f":"SUM(BQ65:CG65)","v":722},"Km confirmés",{"$f":"SUM(BQ67:CG67)","v":1003},"Km confirmés",{"$f":"SUM(CJ65+BP65)","v":8023}]
[null,null,null,0,0,0,0,0,0,0,0,0,0,0,0,0,0,0,0,0,0,1,0,1,0,1,0,0,1,0,0,1,1,1,0,0,1,1,1,0,0,0,0,0,0,1,0,1,0,0,0,1,0,1,0,0,1,1,0,1,0,1,1,1,1,null,"Rondes confirmées",{"$f":"SUM(C66:BM66)","v":21},1,1,1,1,0,0,0,0,0,0,0,0,0,0,0,0,0,null,"Rondes confirmées",{"$f":"SUM(BQ66:CH66)","v":4},"Rondes confirmées",{"$f":"SUM(CJ66+BP66)","v":25}]
[null,null,null,{"$f":"SUM((D64+D65)*D66)","v":0},0,0,0,0,0,0,0,0,0,0,0,0,0,0,0,0,0,339,0,319,0,551,0,0,200,0,0,348,270,320,0,0,252,644,382,0,0,0,0,0,0,600,0,38,0,0,0,254,0,304,0,0,305,388,0,386,0,{"$f":"SUM((BJ64+BJ65)*BJ66)","v":339},{"$f":"SUM((BK64+BK65)*BK66)","v":341},{"$f":"SUM((BL64+BL65)*BL66)","v":258},182,null,"Rondes effectuées",{"$f":"COUNTIF(D64:BM64,\">0\")","v":20},{"$f":"SUM((BQ64+BQ65)*BQ66)","v":382},200,265,156,0,0,0,0,0,0,0,0,0,0,0,0,0,null,"Rondes Effectuées",{"$f":"COUNTIF(BQ64:CG64,\">0\")","v":3},"Rondes effectuées",{"$f":"SUM(CJ67+BP67)","v":23}]
[16,{"$f":"VLOOKUP(A68,'Numéro licences'!$H$4:$I$47,2)","v":"LAMBOTTE Didier"},"Aller-Retour",null,null,null,null,null,null,null,null,null,null,null,null,null,null,null,null,null,null,null,null,null,null,null,null,null,null,null,null,null,null,null,null,null,null,null,null,null,null,null,null,null,null,null,null,null,null,null,null,null,null,null,null,null,null,null,null,null,null,null,null,null,null,{"$f":"SUM(D68:BM68)","v":0},"Km  renseignés",{"$f":"SUM(BN68:BN69)","v":0},null,null,null,null,null,null,null,null,null,null,null,null,null,null,null,null,null,{"$f":"SUM(BQ68:CG68)","v":0},"Km  renseignés",{"$f":"SUM(CH68+CH69)","v":0},"Km  renseignés",{"$f":"SUM(BP68+CJ68)","v":0}]
[null,null,"Ronde",null,null,null,null,null,null,null,null,null,null,null,null,null,null,null,null,null,null,null,null,null,null,null,null,null,null,null,null,null,null,null,null,null,null,null,null,null,null,null,null,null,null,null,null,null,null,null,null,null,null,null,null,null,null,null,null,null,null,null,null,null,null,{"$f":"SUM(D69:BM69)","v":0},"Km confirmés",{"$f":"SUM(D71:BM71)","v":0},null,null,null,null,null,null,null,null,null,null,null,null,null,null,null,null,null,{"$f":"SUM(BQ69:CG69)","v":0},"Km confirmés",{"$f":"SUM(BQ71:CG71)","v":0},"Km confirmés",{"$f":"SUM(CJ69+BP69)","v":0}]
[null,null,null,0,0,0,0,0,0,0,0,0,0,0,0,0,0,0,0,0,0,0,0,0,0,0,0,0,0,0,0,0,0,0,0,0,0,0,0,0,0,0,0,0,0,0,0,0,0,0,0,0,0,0,0,0,0,0,0,0,0,0,0,0,0,null,"Rondes confirmées",0,0,0,0,0,0,0,0,0,0,0,0,0,0,0,0,0,0,null,"Rondes confirmées",{"$f":"SUM(BQ70:CH70)","v":0},"Rondes confirmées",{"$f":"SUM(CJ70+BP70)","v":0}]
[null,null,null,{"$f":"SUM((D68+D69)*D70)","v":0},0,0,0,0,0,0,0,0,0,0,0,0,0,0,0,0,0,0,0,0,0,0,0,0,0,0,0,0,0,0,0,0,0,0,0,0,0,0,0,0,0,0,0,0,0,0,0,0,0,0,0,0,0,0,0,0,0,{"$f":"SUM((BJ68+BJ69)*BJ70)","v":0},{"$f":"SUM((BK68+BK69)*BK70)","v":0},{"$f":"SUM((BL68+BL69)*BL70)","v":0},0,null,"Rondes effectuées",{"$f":"COUNTIF(D68:BM68,\">0\")","v":0},{"$f":"SUM((BQ68+BQ69)*BQ70)","v":0},0,0,0,0,0,0,0,0,0,0,0,0,0,0,0,0,null,"Rondes Effectuées",{"$f":"COUNTIF(BQ68:CG68,\">0\")","v":0},"Rondes effectuées",{"$f":"SUM(CJ71+BP71)","v":0}]
[17,{"$f":"VLOOKUP(A72,'Numéro licences'!$H$4:$I$47,2)","v":"LEFEVRE Francis"},"Aller-Retour",null,null,null,null,null,null,null,null,null,null,null,null,null,null,null,null,null,null,null,null,null,null,null,null,null,null,null,null,null,null,null,null,null,null,null,null,null,null,null,null,null,null,null,null,null,null,null,null,null,null,null,null,null,null,null,null,null,null,null,null,null,null,{"$f":"SUM(D72:BM72)","v":0},"Km  renseignés",{"$f":"SUM(BN72:BN73)","v":0},null,null,null,null,null,null,null,null,null,null,null,null,null,null,null,null,null,{"$f":"SUM(BQ72:CG72)","v":0},"Km  renseignés",{"$f":"SUM(CH72+CH73)","v":0},"Km  renseignés",{"$f":"SUM(BP72+CJ72)","v":0}]
[null,null,"Ronde",null,null,null,null,null,null,null,null,null,null,null,null,null,null,null,null,null,null,null,null,null,null,null,null,null,null,null,null,null,null,null,null,null,null,null,null,null,null,null,null,null,null,null,null,null,null,null,null,null,null,null,null,null,null,null,null,null,null,null,null,null,null,{"$f":"SUM(D73:BM73)","v":0},"Km confirmés",{"$f":"SUM(D75:BM75)","v":0},null,null,null,null,null,null,null,null,null,null,null,null,null,null,null,null,null,{"$f":"SUM(BQ73:CG73)","v":0},"Km confirmés",{"$f":"SUM(BQ75:CG75)","v":0},"Km confirmés",{"$f":"SUM(CJ73+BP73)","v":0}]
[null,null,null,0,0,0,0,0,0,0,0,0,0,0,0,0,0,0,0,0,0,0,0,0,0,0,0,0,0,0,0,0,0,0,0,0,0,0,0,0,0,0,0,0,0,0,0,0,0,0,0,0,0,0,0,0,0,0,0,0,0,0,0,0,0,null,"Rondes confirmées",0,0,0,0,0,0,0,0,0,0,0,0,0,0,0,0,0,0,null,"Rondes confirmées",{"$f":"SUM(BQ74:CH74)","v":0},"Rondes confirmées",{"$f":"SUM(CJ74+BP74)","v":0}]
[null,null,null,{"$f":"SUM((D72+D73)*D74)","v":0},0,0,0,0,0,0,0,0,0,0,0,0,0,0,0,0,0,0,0,0,0,0,0,0,0,0,0,0,0,0,0,0,0,0,0,0,0,0,0,0,0,0,0,0,0,0,0,0,0,0,0,0,0,0,0,0,0,{"$f":"SUM((BJ72+BJ73)*BJ74)","v":0},{"$f":"SUM((BK72+BK73)*BK74)","v":0},{"$f":"SUM((BL72+BL73)*BL74)","v":0},0,null,"Rondes effectuées",{"$f":"COUNTIF(D72:BM72,\">0\")","v":0},{"$f":"SUM((BQ72+BQ73)*BQ74)","v":0},0,0,0,0,0,0,0,0,0,0,0,0,0,0,0,0,null,"Rondes Effectuées",{"$f":"COUNTIF(BQ72:CG72,\">0\")","v":0},"Rondes effectuées",{"$f":"SUM(CJ75+BP75)","v":0}]
[18,{"$f":"VLOOKUP(A76,'Numéro licences'!$H$4:$I$47,2)","v":"LESCAL Thierry"},"Aller-Retour",null,null,null,null,null,null,null,null,null,null,null,null,null,null,null,null,null,null,124,null,124,null,38,null,null,0,null,null,148,60,140,null,null,52,344,162,null,null,176,null,null,null,380,null,null,186,null,null,60,null,124,null,null,140,218,null,166,null,174,176,108,52,{"$f":"SUM(D76:BM76)","v":3152},"Km  renseignés",{"$f":"SUM(BN76:BN77)","v":7515},166,0,79,36,null,null,null,null,null,null,null,null,null,null,null,null,null,{"$f":"SUM(BQ76:CG76)","v":281},"Km  renseignés",{"$f":"SUM(CH76+CH77)","v":1003},"Km  renseignés",{"$f":"SUM(BP76+CJ76)","v":8518}]
[null,null,"Ronde",null,null,null,null,null,null,null,null,null,null,null,null,null,null,null,null,null,null,215,null,195,null,513,null,null,200,null,null,200,210,180,null,null,200,300,220,null,null,250,null,null,null,0,null,null,166,null,null,194,null,180,null,null,165,170,null,220,null,165,140,150,130,{"$f":"SUM(D77:BM77)","v":4363},"Km confirmés",{"$f":"SUM(D79:BM79)","v":7515},216,200,186,120,null,null,null,null,null,null,null,null,null,null,null,null,null,{"$f":"SUM(BQ77:CG77)","v":722},"Km confirmés",{"$f":"SUM(BQ79:CG79)","v":1003},"Km confirmés",{"$f":"SUM(CJ77+BP77)","v":8518}]
[null,null,null,0,0,0,0,0,0,0,0,0,0,0,0,0,0,0,0,0,0,1,0,1,0,1,0,0,1,0,0,1,1,1,0,0,1,1,1,0,0,1,0,0,0,1,0,0,1,0,0,1,0,1,0,0,1,1,0,1,0,1,1,1,1,null,"Rondes confirmées",{"$f":"SUM(C78:BM78)","v":22},1,1,1,1,0,0,0,0,0,0,0,0,0,0,0,0,0,null,"Rondes confirmées",{"$f":"SUM(BQ78:CH78)","v":4},"Rondes confirmées",{"$f":"SUM(CJ78+BP78)","v":26}]
[null,null,null,{"$f":"SUM((D76+D77)*D78)","v":0},0,0,0,0,0,0,0,0,0,0,0,0,0,0,0,0,0,339,0,319,0,551,0,0,200,0,0,348,270,320,0,0,252,644,382,0,0,426,0,0,0,380,0,0,352,0,0,254,0,304,0,0,305,388,0,386,0,{"$f":"SUM((BJ76+BJ77)*BJ78)","v":339},{"$f":"SUM((BK76+BK77)*BK78)","v":316},{"$f":"SUM((BL76+BL77)*BL78)","v":258},182,null,"Rondes effectuées",{"$f":"COUNTIF(D76:BM76,\">0\")","v":21},{"$f":"SUM((BQ76+BQ77)*BQ78)","v":382},200,265,156,0,0,0,0,0,0,0,0,0,0,0,0,0,null,"Rondes Effectuées",{"$f":"COUNTIF(BQ76:CG76,\">0\")","v":3},"Rondes effectuées",{"$f":"SUM(CJ79+BP79)","v":24}]
[19,{"$f":"VLOOKUP(A80,'Numéro licences'!$H$4:$I$47,2)","v":"MALLIEN Philippe"},"Aller-Retour",null,null,null,null,null,null,null,null,null,null,null,null,null,null,null,null,null,null,null,null,null,null,null,null,null,0,null,null,null,null,null,null,null,null,null,null,null,null,null,null,null,null,null,null,null,null,null,null,null,null,null,null,null,null,null,null,null,null,null,null,null,null,{"$f":"SUM(D80:BM80)","v":0},"Km  renseignés",{"$f":"SUM(BN80:BN81)","v":200},null,null,null,null,null,null,null,null,null,null,null,null,null,null,null,null,null,{"$f":"SUM(BQ80:CG80)","v":0},"Km  renseignés",{"$f":"SUM(CH80+CH81)","v":0},"Km  renseignés",{"$f":"SUM(BP80+CJ80)","v":200}]
[null,null,"Ronde",null,null,null,null,null,null,null,null,null,null,null,null,null,null,null,null,null,null,null,null,null,null,null,null,null,200,null,null,null,null,null,null,null,null,null,null,null,null,null,null,null,null,null,null,null,null,null,null,null,null,null,null,null,null,null,null,null,null,null,null,null,null,{"$f":"SUM(D81:BM81)","v":200},"Km confirmés",{"$f":"SUM(D83:BM83)","v":200},null,null,null,null,null,null,null,null,null,null,null,null,null,null,null,null,null,{"$f":"SUM(BQ81:CG81)","v":0},"Km confirmés",{"$f":"SUM(BQ83:CG83)","v":0},"Km confirmés",{"$f":"SUM(CJ81+BP81)","v":200}]
[null,null,null,0,0,0,0,0,0,0,0,0,0,0,0,0,0,0,0,0,0,0,0,0,0,0,0,0,1,0,0,0,0,0,0,0,0,0,0,0,0,0,0,0,0,0,0,0,0,0,0,0,0,0,0,0,0,0,0,0,0,0,0,0,0,null,"Rondes confirmées",0,0,0,0,0,0,0,0,0,0,0,0,0,0,0,0,0,0,null,"Rondes confirmées",{"$f":"SUM(BQ82:CH82)","v":0},"Rondes confirmées",{"$f":"SUM(CJ82+BP82)","v":0}]
[null,null,null,{"$f":"SUM((D80+D81)*D82)","v":0},0,0,0,0,0,0,0,0,0,0,0,0,0,0,0,0,0,0,0,0,0,0,0,0,200,0,0,0,0,0,0,0,0,0,0,0,0,0,0,0,0,0,0,0,0,0,0,0,0,0,0,0,0,0,0,0,0,{"$f":"SUM((BJ80+BJ81)*BJ82)","v":0},{"$f":"SUM((BK80+BK81)*BK82)","v":0},{"$f":"SUM((BL80+BL81)*BL82)","v":0},0,null,"Rondes effectuées",{"$f":"COUNTIF(D80:BM80,\">0\")","v":0},{"$f":"SUM((BQ80+BQ81)*BQ82)","v":0},0,0,0,0,0,0,0,0,0,0,0,0,0,0,0,0,null,"Rondes Effectuées",{"$f":"COUNTIF(BQ80:CG80,\">0\")","v":0},"Rondes effectuées",{"$f":"SUM(CJ83+BP83)","v":0}]
[20,{"$f":"VLOOKUP(A84,'Numéro licences'!$H$4:$I$47,2)","v":"MARIEL Didier"},"Aller-Retour",null,null,null,null,null,null,null,null,null,null,null,null,null,null,null,null,null,null,null,null,null,null,null,null,null,null,null,null,null,60,null,null,null,null,null,null,null,null,null,null,null,null,null,null,null,null,null,null,null,null,null,null,null,null,null,null,null,null,null,null,null,52,{"$f":"SUM(D84:BM84)","v":112},"Km  renseignés",{"$f":"SUM(BN84:BN85)","v":452},null,0,null,36,null,null,null,null,null,null,null,null,null,null,null,null,null,{"$f":"SUM(BQ84:CG84)","v":36},"Km  renseignés",{"$f":"SUM(CH84+CH85)","v":356},"Km  renseignés",{"$f":"SUM(BP84+CJ84)","v":808}]
[null,null,"Ronde",null,null,null,null,null,null,null,null,null,null,null,null,null,null,null,null,null,null,null,null,null,null,null,null,null,null,null,null,null,210,null,null,null,null,null,null,null,null,null,null,null,null,null,null,null,null,null,null,null,null,null,null,null,null,null,null,null,null,null,null,null,130,{"$f":"SUM(D85:BM85)","v":340},"Km confirmés",{"$f":"SUM(D87:BM87)","v":0},null,200,null,120,null,null,null,null,null,null,null,null,null,null,null,null,null,{"$f":"SUM(BQ85:CG85)","v":320},"Km confirmés",{"$f":"SUM(BQ87:CG87)","v":0},"Km confirmés",{"$f":"SUM(CJ85+BP85)","v":0}]
[null,null,null,0,0,0,0,0,0,0,0,0,0,0,0,0,0,0,0,0,0,0,0,0,0,0,0,0,0,0,0,0,0,0,0,0,0,0,0,0,0,0,0,0,0,0,0,0,0,0,0,0,0,0,0,0,0,0,0,0,0,0,0,0,0,null,"Rondes confirmées",0,0,0,0,0,0,0,0,0,0,0,0,0,0,0,0,0,0,null,"Rondes confirmées",{"$f":"SUM(BQ86:CH86)","v":0},"Rondes confirmées",{"$f":"SUM(CJ86+BP86)","v":0}]
[null,null,null,{"$f":"SUM((D84+D85)*D86)","v":0},0,0,0,0,0,0,0,0,0,0,0,0,0,0,0,0,0,0,0,0,0,0,0,0,0,0,0,0,0,0,0,0,0,0,0,0,0,0,0,0,0,0,0,0,0,0,0,0,0,0,0,0,0,0,0,0,0,{"$f":"SUM((BJ84+BJ85)*BJ86)","v":0},{"$f":"SUM((BK84+BK85)*BK86)","v":0},{"$f":"SUM((BL84+BL85)*BL86)","v":0},0,null,"Rondes effectuées",{"$f":"COUNTIF(D84:BM84,\">0\")","v":2},{"$f":"SUM((BQ84+BQ85)*BQ86)","v":0},0,0,0,0,0,0,0,0,0,0,0,0,0,0,0,0,null,"Rondes Effectuées",{"$f":"COUNTIF(BQ84:CG84,\">0\")","v":1},"Rondes effectuées",{"$f":"SUM(CJ87+BP87)","v":3}]
[21,{"$f":"VLOOKUP(A88,'Numéro licences'!$H$4:$I$47,2)","v":"MILET Benoit"},"Aller-Retour",null,null,null,null,null,null,null,null,null,null,null,null,null,null,null,null,null,null,null,null,null,null,null,null,null,null,null,null,null,null,null,null,null,null,null,null,null,null,null,null,null,null,null,null,null,null,null,null,null,null,null,null,null,null,null,null,null,null,null,null,null,null,{"$f":"SUM(D88:BM88)","v":0},"Km  renseignés",{"$f":"SUM(BN88:BN89)","v":0},null,null,null,null,null,null,null,null,null,null,null,null,null,null,null,null,null,{"$f":"SUM(BQ88:CG88)","v":0},"Km  renseignés",{"$f":"SUM(CH88+CH89)","v":0},"Km  renseignés",{"$f":"SUM(BP88+CJ88)","v":0}]
[null,null,"Ronde",null,null,null,null,null,null,null,null,null,null,null,null,null,null,null,null,null,null,null,null,null,null,null,null,null,null,null,null,null,null,null,null,null,null,null,null,null,null,null,null,null,null,null,null,null,null,null,null,null,null,null,null,null,null,null,null,null,null,null,null,null,null,{"$f":"SUM(D89:BM89)","v":0},"Km confirmés",{"$f":"SUM(D91:BM91)","v":0},null,null,null,null,null,null,null,null,null,null,null,null,null,null,null,null,null,{"$f":"SUM(BQ89:CG89)","v":0},"Km confirmés",{"$f":"SUM(BQ91:CG91)","v":0},"Km confirmés",{"$f":"SUM(CJ89+BP89)","v":0}]
[null,null,null,0,0,0,0,0,0,0,0,0,0,0,0,0,0,0,0,0,0,0,0,0,0,0,0,0,0,0,0,0,0,0,0,0,0,0,0,0,0,0,0,0,0,0,0,0,0,0,0,0,0,0,0,0,0,0,0,0,0,0,0,0,0,null,"Rondes confirmées",0,0,0,0,0,0,0,0,0,0,0,0,0,0,0,0,0,0,null,"Rondes confirmées",{"$f":"SUM(BQ90:CH90)","v":0},"Rondes confirmées",{"$f":"SUM(CJ90+BP90)","v":0}]
[null,null,null,{"$f":"SUM((D88+D89)*D90)","v":0},0,0,0,0,0,0,0,0,0,0,0,0,0,0,0,0,0,0,0,0,0,0,0,0,0,0,0,0,0,0,0,0,0,0,0,0,0,0,0,0,0,0,0,0,0,0,0,0,0,0,0,0,0,0,0,0,0,{"$f":"SUM((BJ88+BJ89)*BJ90)","v":0},{"$f":"SUM((BK88+BK89)*BK90)","v":0},{"$f":"SUM((BL88+BL89)*BL90)","v":0},0,null,"Rondes effectuées",{"$f":"COUNTIF(D88:BM88,\">0\")","v":0},{"$f":"SUM((BQ88+BQ89)*BQ90)","v":0},0,0,0,0,0,0,0,0,0,0,0,0,0,0,0,0,null,"Rondes Effectuées",{"$f":"COUNTIF(BQ88:CG88,\">0\")","v":0},"Rondes effectuées",{"$f":"SUM(CJ91+BP91)","v":0}]
[22,{"$f":"VLOOKUP(A92,'Numéro licences'!$H$4:$I$47,2)","v":"NIHOUL Dany"},"Aller-Retour",null,null,null,null,null,null,null,null,null,null,null,null,null,null,null,null,null,null,124,null,124,null,38,null,null,0,null,null,148,60,140,null,null,null,null,null,null,null,176,null,null,null,380,null,38,null,null,null,null,null,null,null,null,140,null,null,null,null,null,null,108,null,{"$f":"SUM(D92:BM92)","v":1476},"Km  renseignés",{"$f":"SUM(BN92:BN93)","v":4194},166,0,79,36,null,null,null,null,null,null,null,null,null,null,null,null,null,{"$f":"SUM(BQ92:CG92)","v":281},"Km  renseignés",{"$f":"SUM(CH92+CH93)","v":1003},"Km  renseignés",{"$f":"SUM(BP92+CJ92)","v":5197}]
[null,null,"Ronde",null,null,null,null,null,null,null,null,null,null,null,null,null,null,null,null,null,null,215,null,195,null,513,null,null,200,null,null,200,210,180,null,null,null,null,null,null,null,250,null,null,null,220,null,220,null,null,null,null,null,null,null,null,165,null,null,null,null,null,null,150,null,{"$f":"SUM(D93:BM93)","v":2718},"Km confirmés",{"$f":"SUM(D95:BM95)","v":4194},216,200,186,120,null,null,null,null,null,null,null,null,null,null,null,null,null,{"$f":"SUM(BQ93:CG93)","v":722},"Km confirmés",{"$f":"SUM(BQ95:CG95)","v":1003},"Km confirmés",{"$f":"SUM(CJ93+BP93)","v":5197}]
[null,null,null,0,0,0,0,0,0,0,0,0,0,0,0,0,0,0,0,0,0,1,0,1,0,1,0,0,1,0,0,1,1,1,0,0,0,0,0,0,0,1,0,0,0,1,0,1,0,0,0,0,0,0,0,0,1,0,0,0,0,0,0,1,0,null,"Rondes confirmées",{"$f":"SUM(C94:BM94)","v":12},1,1,1,1,0,0,0,0,0,0,0,0,0,0,0,0,0,null,"Rondes confirmées",{"$f":"SUM(BQ94:CH94)","v":4},"Rondes confirmées",{"$f":"SUM(CJ94+BP94)","v":16}]
[null,null,null,{"$f":"SUM((D92+D93)*D94)","v":0},0,0,0,0,0,0,0,0,0,0,0,0,0,0,0,0,0,339,0,319,0,551,0,0,200,0,0,348,270,320,0,0,0,0,0,0,0,426,0,0,0,600,0,258,0,0,0,0,0,0,0,0,305,0,0,0,0,{"$f":"SUM((BJ92+BJ93)*BJ94)","v":0},{"$f":"SUM((BK92+BK93)*BK94)","v":0},{"$f":"SUM((BL92+BL93)*BL94)","v":258},0,null,"Rondes effectuées",{"$f":"COUNTIF(D92:BM92,\">0\")","v":11},{"$f":"SUM((BQ92+BQ93)*BQ94)","v":382},200,265,156,0,0,0,0,0,0,0,0,0,0,0,0,0,null,"Rondes Effectuées",{"$f":"COUNTIF(BQ92:CG92,\">0\")","v":3},"Rondes effectuées",{"$f":"SUM(CJ95+BP95)","v":14}]
[23,{"$f":"VLOOKUP(A96,'Numéro licences'!$H$4:$I$47,2)","v":"OVAERE Jimmy"},"Aller-Retour",null,null,null,null,null,null,null,null,null,null,null,null,null,null,null,null,null,null,null,null,null,null,null,null,null,null,null,null,null,null,null,null,null,null,null,null,null,null,null,null,null,null,null,null,null,null,null,null,null,null,null,null,null,null,null,null,null,null,null,null,null,null,{"$f":"SUM(D96:BM96)","v":0},"Km  renseignés",{"$f":"SUM(BN96:BN97)","v":0},null,null,null,null,null,null,null,null,null,null,null,null,null,null,null,null,null,{"$f":"SUM(BQ96:CG96)","v":0},"Km  renseignés",{"$f":"SUM(CH96+CH97)","v":0},"Km  renseignés",{"$f":"SUM(BP96+CJ96)","v":0}]
[null,null,"Ronde",null,null,null,null,null,null,null,null,null,null,null,null,null,null,null,null,null,null,null,null,null,null,null,null,null,null,null,null,null,null,null,null,null,null,null,null,null,null,null,null,null,null,null,null,null,null,null,null,null,null,null,null,null,null,null,null,null,null,null,null,null,null,{"$f":"SUM(D97:BM97)","v":0},"Km confirmés",{"$f":"SUM(D99:BM99)","v":0},null,null,null,null,null,null,null,null,null,null,null,null,null,null,null,null,null,{"$f":"SUM(BQ97:CG97)","v":0},"Km confirmés",{"$f":"SUM(BQ99:CG99)","v":0},"Km confirmés",{"$f":"SUM(CJ97+BP97)","v":0}]
[null,null,null,0,0,0,0,0,0,0,0,0,0,0,0,0,0,0,0,0,0,0,0,0,0,0,0,0,0,0,0,0,0,0,0,0,0,0,0,0,0,0,0,0,0,0,0,0,0,0,0,0,0,0,0,0,0,0,0,0,0,0,0,0,0,null,"Rondes confirmées",0,0,0,0,0,0,0,0,0,0,0,0,0,0,0,0,0,0,null,"Rondes confirmées",{"$f":"SUM(BQ98:CH98)","v":0},"Rondes confirmées",{"$f":"SUM(CJ98+BP98)","v":0}]
[null,null,null,{"$f":"SUM((D96+D97)*D98)","v":0},0,0,0,0,0,0,0,0,0,0,0,0,0,0,0,0,0,0,0,0,0,0,0,0,0,0,0,0,0,0,0,0,0,0,0,0,0,0,0,0,0,0,0,0,0,0,0,0,0,0,0,0,0,0,0,0,0,{"$f":"SUM((BJ96+BJ97)*BJ98)","v":0},{"$f":"SUM((BK96+BK97)*BK98)","v":0},{"$f":"SUM((BL96+BL97)*BL98)","v":0},0,null,"Rondes effectuées",{"$f":"COUNTIF(D96:BM96,\">0\")","v":0},{"$f":"SUM((BQ96+BQ97)*BQ98)","v":0},0,0,0,0,0,0,0,0,0,0,0,0,0,0,0,0,null,"Rondes Effectuées",{"$f":"COUNTIF(BQ96:CG96,\">0\")","v":0},"Rondes effectuées",{"$f":"SUM(CJ99+BP99)","v":0}]
[24,{"$f":"VLOOKUP(A100,'Numéro licences'!$H$4:$I$47,2)","v":"PARMENTIER Dominique"},"Aller-Retour",null,null,null,null,null,null,null,null,null,null,null,null,null,null,null,null,null,null,null,null,null,null,null,null,null,0,null,null,null,null,null,null,null,52,null,null,null,null,null,null,null,null,null,null,null,null,null,null,60,null,null,null,null,null,null,null,null,null,null,null,null,52,{"$f":"SUM(D100:BM100)","v":164},"Km  renseignés",{"$f":"SUM(BN100:BN101)","v":364},null,0,null,null,null,null,null,null,null,null,null,null,null,null,null,null,null,{"$f":"SUM(BQ100:CG100)","v":0},"Km  renseignés",{"$f":"SUM(CH100+CH101)","v":200},"Km  renseignés",{"$f":"SUM(BP100+CJ100)","v":564}]
[null,null,"Ronde",null,null,null,null,null,null,null,null,null,null,null,null,null,null,null,null,null,null,null,null,null,null,null,null,null,200,null,null,null,null,null,null,null,0,null,null,null,null,null,null,null,null,null,null,null,null,null,null,0,null,null,null,null,null,null,null,null,null,null,null,null,0,{"$f":"SUM(D101:BM101)","v":200},"Km confirmés",{"$f":"SUM(D103:BM103)","v":364},null,200,null,null,null,null,null,null,null,null,null,null,null,null,null,null,null,{"$f":"SUM(BQ101:CG101)","v":200},"Km confirmés",{"$f":"SUM(BQ103:CG103)","v":200},"Km confirmés",{"$f":"SUM(CJ101+BP101)","v":564}]
[null,null,null,0,0,0,0,0,0,0,0,0,0,0,0,0,0,0,0,0,0,0,0,0,0,0,0,0,1,0,0,0,0,0,0,0,1,0,0,0,0,0,0,0,0,0,0,0,0,0,0,1,0,0,0,0,0,0,0,0,0,0,0,0,1,null,"Rondes confirmées",0,0,1,0,0,0,0,0,0,0,0,0,0,0,0,0,0,0,null,"Rondes confirmées",{"$f":"SUM(BQ102:CH102)","v":1},"Rondes confirmées",{"$f":"SUM(CJ102+BP102)","v":1}]
[null,null,null,{"$f":"SUM((D100+D101)*D102)","v":0},0,0,0,0,0,0,0,0,0,0,0,0,0,0,0,0,0,0,0,0,0,0,0,0,200,0,0,0,0,0,0,0,52,0,0,0,0,0,0,0,0,0,0,0,0,0,0,60,0,0,0,0,0,0,0,0,0,{"$f":"SUM((BJ100+BJ101)*BJ102)","v":0},{"$f":"SUM((BK100+BK101)*BK102)","v":0},{"$f":"SUM((BL100+BL101)*BL102)","v":0},52,null,"Rondes effectuées",{"$f":"COUNTIF(D100:BM100,\">0\")","v":3},{"$f":"SUM((BQ100+BQ101)*BQ102)","v":0},200,0,0,0,0,0,0,0,0,0,0,0,0,0,0,0,null,"Rondes Effectuées",{"$f":"COUNTIF(BQ100:CG100,\">0\")","v":0},"Rondes effectuées",{"$f":"SUM(CJ103+BP103)","v":3}]
[25,{"$f":"VLOOKUP(A104,'Numéro licences'!$H$4:$I$47,2)","v":"POCHET Jean-Dominique"},"Aller-Retour",null,null,null,null,null,null,null,null,null,null,null,null,null,null,null,null,null,null,null,null,null,null,null,null,null,null,null,null,null,null,null,null,null,null,null,null,null,null,null,null,null,null,null,null,null,null,null,null,null,null,null,null,null,null,null,null,null,null,null,null,null,null,{"$f":"SUM(D104:BM104)","v":0},"Km  renseignés",{"$f":"SUM(BN104:BN105)","v":0},null,null,null,null,null,null,null,null,null,null,null,null,null,null,null,null,null,{"$f":"SUM(BQ104:CG104)","v":0},"Km  renseignés",{"$f":"SUM(CH104+CH105)","v":0},"Km  renseignés",{"$f":"SUM(BP104+CJ104)","v":0}]
[null,null,"Ronde",null,null,null,null,null,null,null,null,null,null,null,null,null,null,null,null,null,null,null,null,null,null,null,null,null,null,null,null,null,null,null,null,null,null,null,null,null,null,null,null,null,null,null,null,null,null,null,null,null,null,null,null,null,null,null,null,null,null,null,null,null,null,{"$f":"SUM(D105:BM105)","v":0},"Km confirmés",{"$f":"SUM(D107:BM107)","v":0},null,null,null,null,null,null,null,null,null,null,null,null,null,null,null,null,null,{"$f":"SUM(BQ105:CG105)","v":0},"Km confirmés",{"$f":"SUM(BQ107:CG107)","v":0},"Km confirmés",{"$f":"SUM(CJ105+BP105)","v":0}]
[null,null,null,0,0,0,0,0,0,0,0,0,0,0,0,0,0,0,0,0,0,0,0,0,0,0,0,0,0,0,0,0,0,0,0,0,0,0,0,0,0,0,0,0,0,0,0,0,0,0,0,0,0,0,0,0,0,0,0,0,0,0,0,0,0,null,"Rondes confirmées",0,0,0,0,0,0,0,0,0,0,0,0,0,0,0,0,0,0,null,"Rondes confirmées",{"$f":"SUM(BQ106:CH106)","v":0},"Rondes confirmées",{"$f":"SUM(CJ106+BP106)","v":0}]
[null,null,null,{"$f":"SUM((D104+D105)*D106)","v":0},0,0,0,0,0,0,0,0,0,0,0,0,0,0,0,0,0,0,0,0,0,0,0,0,0,0,0,0,0,0,0,0,0,0,0,0,0,0,0,0,0,0,0,0,0,0,0,0,0,0,0,0,0,0,0,0,0,{"$f":"SUM((BJ104+BJ105)*BJ106)","v":0},{"$f":"SUM((BK104+BK105)*BK106)","v":0},{"$f":"SUM((BL104+BL105)*BL106)","v":0},0,null,"Rondes effectuées",{"$f":"COUNTIF(D104:BM104,\">0\")","v":0},{"$f":"SUM((BQ104+BQ105)*BQ106)","v":0},0,0,0,0,0,0,0,0,0,0,0,0,0,0,0,0,null,"Rondes Effectuées",{"$f":"COUNTIF(BQ104:CG104,\">0\")","v":0},"Rondes effectuées",{"$f":"SUM(CJ107+BP107)","v":0}]
[26,{"$f":"VLOOKUP(A108,'Numéro licences'!$H$4:$I$47,2)","v":"POMPIER Philippe"},"Aller-Retour",null,null,null,null,null,null,null,null,null,null,null,null,null,null,null,null,null,null,null,null,null,null,null,null,null,null,null,null,null,null,null,null,null,null,null,null,null,null,null,null,null,null,null,null,null,null,null,null,null,null,null,null,null,null,null,null,null,null,null,null,null,null,{"$f":"SUM(D108:BM108)","v":0},"Km  renseignés",{"$f":"SUM(BN108:BN109)","v":0},null,null,null,null,null,null,null,null,null,null,null,null,null,null,null,null,null,{"$f":"SUM(BQ108:CG108)","v":0},"Km  renseignés",{"$f":"SUM(CH108+CH109)","v":0},"Km  renseignés",{"$f":"SUM(BP108+CJ108)","v":0}]
[null,null,"Ronde",null,null,null,null,null,null,null,null,null,null,null,null,null,null,null,null,null,null,null,null,null,null,null,null,null,null,null,null,null,null,null,null,null,null,null,null,null,null,null,null,null,null,null,null,null,null,null,null,null,null,null,null,null,null,null,null,null,null,null,null,null,null,{"$f":"SUM(D109:BM109)","v":0},"Km confirmés",{"$f":"SUM(D111:BM111)","v":0},null,null,null,null,null,null,null,null,null,null,null,null,null,null,null,null,null,{"$f":"SUM(BQ109:CG109)","v":0},"Km confirmés",{"$f":"SUM(BQ111:CG111)","v":0},"Km confirmés",{"$f":"SUM(CJ109+BP109)","v":0}]
[null,null,null,0,0,0,0,0,0,0,0,0,0,0,0,0,0,0,0,0,0,0,0,0,0,0,0,0,0,0,0,0,0,0,0,0,0,0,0,0,0,0,0,0,0,0,0,0,0,0,0,0,0,0,0,0,0,0,0,0,0,0,0,0,0,null,"Rondes confirmées",0,0,0,0,0,0,0,0,0,0,0,0,0,0,0,0,0,0,null,"Rondes confirmées",{"$f":"SUM(BQ110:CH110)","v":0},"Rondes confirmées",{"$f":"SUM(CJ110+BP110)","v":0}]
[null,null,null,{"$f":"SUM((D108+D109)*D110)","v":0},0,0,0,0,0,0,0,0,0,0,0,0,0,0,0,0,0,0,0,0,0,0,0,0,0,0,0,0,0,0,0,0,0,0,0,0,0,0,0,0,0,0,0,0,0,0,0,0,0,0,0,0,0,0,0,0,0,{"$f":"SUM((BJ108+BJ109)*BJ110)","v":0},{"$f":"SUM((BK108+BK109)*BK110)","v":0},{"$f":"SUM((BL108+BL109)*BL110)","v":0},0,null,"Rondes effectuées",{"$f":"COUNTIF(D108:BM108,\">0\")","v":0},{"$f":"SUM((BQ108+BQ109)*BQ110)","v":0},0,0,0,0,0,0,0,0,0,0,0,0,0,0,0,0,null,"Rondes Effectuées",{"$f":"COUNTIF(BQ108:CG108,\">0\")","v":0},"Rondes effectuées",{"$f":"SUM(CJ111+BP111)","v":0}]
[27,{"$f":"VLOOKUP(A112,'Numéro licences'!$H$4:$I$47,2)","v":"RAMEAU Didier"},"Aller-Retour",null,null,null,null,null,null,null,null,null,null,null,null,null,null,null,null,null,null,null,null,null,null,null,null,null,null,null,null,null,null,null,null,null,null,null,null,null,null,null,null,null,null,null,null,null,null,null,null,null,null,124,null,null,null,null,null,166,null,null,null,null,null,{"$f":"SUM(D112:BM112)","v":290},"Km  renseignés",{"$f":"SUM(BN112:BN113)","v":690},null,0,79,36,null,null,null,null,null,null,null,null,null,null,null,null,null,{"$f":"SUM(BQ112:CG112)","v":115},"Km  renseignés",{"$f":"SUM(CH112+CH113)","v":621},"Km  renseignés",{"$f":"SUM(BP112+CJ112)","v":1311}]
[null,null,"Ronde",null,null,null,null,null,null,null,null,null,null,null,null,null,null,null,null,null,null,null,null,null,null,null,null,null,null,null,null,null,null,null,null,null,null,null,null,null,null,null,null,null,null,null,null,null,null,null,null,null,null,180,null,null,null,null,null,220,null,null,null,null,null,{"$f":"SUM(D113:BM113)","v":400},"Km confirmés",{"$f":"SUM(D115:BM115)","v":0},null,200,186,120,null,null,null,null,null,null,null,null,null,null,null,null,null,{"$f":"SUM(BQ113:CG113)","v":506},"Km confirmés",{"$f":"SUM(BQ115:CG115)","v":0},"Km confirmés",{"$f":"SUM(CJ113+BP113)","v":0}]
[null,null,null,0,0,0,0,0,0,0,0,0,0,0,0,0,0,0,0,0,0,0,0,0,0,0,0,0,0,0,0,0,0,0,0,0,0,0,0,0,0,0,0,0,0,0,0,0,0,0,0,0,0,0,0,0,0,0,0,0,0,0,0,0,0,null,"Rondes confirmées",0,0,0,0,0,0,0,0,0,0,0,0,0,0,0,0,0,0,null,"Rondes confirmées",{"$f":"SUM(BQ114:CH114)","v":0},"Rondes confirmées",{"$f":"SUM(CJ114+BP114)","v":0}]
[null,null,null,{"$f":"SUM((D112+D113)*D114)","v":0},0,0,0,0,0,0,0,0,0,0,0,0,0,0,0,0,0,0,0,0,0,0,0,0,0,0,0,0,0,0,0,0,0,0,0,0,0,0,0,0,0,0,0,0,0,0,0,0,0,0,0,0,0,0,0,0,0,{"$f":"SUM((BJ112+BJ113)*BJ114)","v":0},{"$f":"SUM((BK112+BK113)*BK114)","v":0},{"$f":"SUM((BL112+BL113)*BL114)","v":0},0,null,"Rondes effectuées",{"$f":"COUNTIF(D112:BM112,\">0\")","v":2},{"$f":"SUM((BQ112+BQ113)*BQ114)","v":0},0,0,0,0,0,0,0,0,0,0,0,0,0,0,0,0,null,"Rondes Effectuées",{"$f":"COUNTIF(BQ112:CG112,\">0\")","v":2},"Rondes effectuées",{"$f":"SUM(CJ115+BP115)","v":4}]
[28,{"$f":"VLOOKUP(A116,'Numéro licences'!$H$4:$I$47,2)","v":"SPITAELS Bernard"},"Aller-Retour",null,null,null,null,null,null,null,null,null,null,null,null,null,null,null,null,null,null,null,null,null,null,null,null,null,null,null,null,null,null,null,null,null,52,null,null,null,null,null,null,null,null,null,null,null,null,null,null,null,null,null,null,null,null,null,null,null,null,null,null,null,null,{"$f":"SUM(D116:BM116)","v":52},"Km  renseignés",{"$f":"SUM(BN116:BN117)","v":252},null,null,79,null,null,null,null,null,null,null,null,null,null,null,null,null,null,{"$f":"SUM(BQ116:CG116)","v":79},"Km  renseignés",{"$f":"SUM(CH116+CH117)","v":265},"Km  renseignés",{"$f":"SUM(BP116+CJ116)","v":517}]
[null,null,"Ronde",null,null,null,null,null,null,null,null,null,null,null,null,null,null,null,null,null,null,null,null,null,null,null,null,null,null,null,null,null,null,null,null,null,200,null,null,null,null,null,null,null,null,null,null,null,null,null,null,null,null,null,null,null,null,null,null,null,null,null,null,null,null,{"$f":"SUM(D117:BM117)","v":200},"Km confirmés",{"$f":"SUM(D119:BM119)","v":0},null,null,186,null,null,null,null,null,null,null,null,null,null,null,null,null,null,{"$f":"SUM(BQ117:CG117)","v":186},"Km confirmés",{"$f":"SUM(BQ119:CG119)","v":0},"Km confirmés",{"$f":"SUM(CJ117+BP117)","v":0}]
[null,null,null,0,0,0,0,0,0,0,0,0,0,0,0,0,0,0,0,0,0,0,0,0,0,0,0,0,0,0,0,0,0,0,0,0,0,0,0,0,0,0,0,0,0,0,0,0,0,0,0,0,0,0,0,0,0,0,0,0,0,0,0,0,0,null,"Rondes confirmées",0,0,0,0,0,0,0,0,0,0,0,0,0,0,0,0,0,0,null,"Rondes confirmées",{"$f":"SUM(BQ118:CH118)","v":0},"Rondes confirmées",{"$f":"SUM(CJ118+BP118)","v":0}]
[null,null,null,{"$f":"SUM((D116+D117)*D118)","v":0},0,0,0,0,0,0,0,0,0,0,0,0,0,0,0,0,0,0,0,0,0,0,0,0,0,0,0,0,0,0,0,0,0,0,0,0,0,0,0,0,0,0,0,0,0,0,0,0,0,0,0,0,0,0,0,0,0,{"$f":"SUM((BJ116+BJ117)*BJ118)","v":0},{"$f":"SUM((BK116+BK117)*BK118)","v":0},{"$f":"SUM((BL116+BL117)*BL118)","v":0},0,null,"Rondes effectuées",{"$f":"COUNTIF(D116:BM116,\">0\")","v":1},{"$f":"SUM((BQ116+BQ117)*BQ118)","v":0},0,0,0,0,0,0,0,0,0,0,0,0,0,0,0,0,null,"Rondes Effectuées",{"$f":"COUNTIF(BQ116:CG116,\">0\")","v":1},"Rondes effectuées",{"$f":"SUM(CJ119+BP119)","v":2}]
[29,{"$f":"VLOOKUP(A120,'Numéro licences'!$H$4:$I$47,2)","v":"TERWAGNE Freddy"},"Aller-Retour",null,null,null,null,null,null,null,null,null,null,null,null,null,null,null,null,null,null,null,null,null,null,null,null,null,null,null,null,null,null,null,null,null,null,null,null,null,null,null,null,null,null,null,null,null,null,null,null,null,null,null,null,null,null,null,null,null,null,null,null,null,null,{"$f":"SUM(D120:BM120)","v":0},"Km  renseignés",{"$f":"SUM(BN120:BN121)","v":0},null,null,null,null,null,null,null,null,null,null,null,null,null,null,null,null,null,{"$f":"SUM(BQ120:CG120)","v":0},"Km  renseignés",{"$f":"SUM(CH120+CH121)","v":0},"Km  renseignés",{"$f":"SUM(BP120+CJ120)","v":0}]
[null,null,"Ronde",null,null,null,null,null,null,null,null,null,null,null,null,null,null,null,null,null,null,null,null,null,null,null,null,null,null,null,null,null,null,null,null,null,null,null,null,null,null,null,null,null,null,null,null,null,null,null,null,null,null,null,null,null,null,null,null,null,null,null,null,null,null,{"$f":"SUM(D121:BM121)","v":0},"Km confirmés",{"$f":"SUM(D123:BM123)","v":0},null,null,null,null,null,null,null,null,null,null,null,null,null,null,null,null,null,{"$f":"SUM(BQ121:CG121)","v":0},"Km confirmés",{"$f":"SUM(BQ123:CG123)","v":0},"Km confirmés",{"$f":"SUM(CJ121+BP121)","v":0}]
[null,null,null,0,0,0,0,0,0,0,0,0,0,0,0,0,0,0,0,0,0,0,0,0,0,0,0,0,0,0,0,0,0,0,0,0,0,0,0,0,0,0,0,0,0,0,0,0,0,0,0,0,0,0,0,0,0,0,0,0,0,0,0,0,0,null,"Rondes confirmées",0,0,0,0,0,0,0,0,0,0,0,0,0,0,0,0,0,0,null,"Rondes confirmées",{"$f":"SUM(BQ122:CH122)","v":0},"Rondes confirmées",{"$f":"SUM(CJ122+BP122)","v":0}]
[null,null,null,{"$f":"SUM((D120+D121)*D122)","v":0},0,0,0,0,0,0,0,0,0,0,0,0,0,0,0,0,0,0,0,0,0,0,0,0,0,0,0,0,0,0,0,0,0,0,0,0,0,0,0,0,0,0,0,0,0,0,0,0,0,0,0,0,0,0,0,0,0,{"$f":"SUM((BJ120+BJ121)*BJ122)","v":0},{"$f":"SUM((BK120+BK121)*BK122)","v":0},0,0,null,"Rondes effectuées",{"$f":"COUNTIF(D120:BM120,\">0\")","v":0},{"$f":"SUM((BQ120+BQ121)*BQ122)","v":0},0,0,0,0,0,0,0,0,0,0,0,0,0,0,0,0,null,"Rondes Effectuées",{"$f":"COUNTIF(BQ120:CG120,\">0\")","v":0},"Rondes effectuées",{"$f":"SUM(CJ123+BP123)","v":0}]
[30,{"$f":"VLOOKUP(A124,'Numéro licences'!$H$4:$I$47,2)","v":"TERWAGNE Julien"},"Aller-Retour",null,null,null,null,null,null,null,null,null,null,null,null,null,null,null,null,null,null,null,null,null,null,null,null,null,null,null,null,null,null,null,null,null,null,null,null,null,null,null,null,null,null,null,null,null,null,null,null,null,null,null,null,null,null,null,null,null,null,null,null,null,null,{"$f":"SUM(D124:BM124)","v":0},"Km  renseignés",{"$f":"SUM(BN124:BN125)","v":0},null,null,null,null,null,null,null,null,null,null,null,null,null,null,null,null,null,{"$f":"SUM(BQ124:CG124)","v":0},"Km  renseignés",{"$f":"SUM(CH124+CH125)","v":0},"Km  renseignés",{"$f":"SUM(BP124+CJ124)","v":0}]
[null,null,"Ronde",null,null,null,null,null,null,null,null,null,null,null,null,null,null,null,null,null,null,null,null,null,null,null,null,null,null,null,null,null,null,null,null,null,null,null,null,null,null,null,null,null,null,null,null,null,null,null,null,null,null,null,null,null,null,null,null,null,null,null,null,null,null,{"$f":"SUM(D125:BM125)","v":0},"Km confirmés",{"$f":"SUM(D127:BM127)","v":0},null,null,null,null,null,null,null,null,null,null,null,null,null,null,null,null,null,{"$f":"SUM(BQ125:CG125)","v":0},"Km confirmés",{"$f":"SUM(BQ127:CG127)","v":0},"Km confirmés",{"$f":"SUM(CJ125+BP125)","v":0}]
[null,null,null,0,0,0,0,0,0,0,0,0,0,0,0,0,0,0,0,0,0,0,0,0,0,0,0,0,0,0,0,0,0,0,0,0,0,0,0,0,0,0,0,0,0,0,0,0,0,0,0,0,0,0,0,0,0,0,0,0,0,0,0,0,0,null,"Rondes confirmées",0,0,0,0,0,0,0,0,0,0,0,0,0,0,0,0,0,0,null,"Rondes confirmées",{"$f":"SUM(BQ126:CH126)","v":0},"Rondes confirmées",{"$f":"SUM(CJ126+BP126)","v":0}]
[null,null,null,{"$f":"SUM((D124+D125)*D126)","v":0},0,0,0,0,0,0,0,0,0,0,0,0,0,0,0,0,0,0,0,0,0,0,0,0,0,0,0,0,0,0,0,0,0,0,0,0,0,0,0,0,0,0,0,0,0,0,0,0,0,0,0,0,0,0,0,0,0,{"$f":"SUM((BJ124+BJ125)*BJ126)","v":0},{"$f":"SUM((BK124+BK125)*BK126)","v":0},{"$f":"SUM((BL124+BL125)*BL126)","v":0},0,null,"Rondes effectuées",{"$f":"COUNTIF(D124:BM124,\">0\")","v":0},{"$f":"SUM((BQ124+BQ125)*BQ126)","v":0},0,0,0,0,0,0,0,0,0,0,0,0,0,0,0,0,null,"Rondes Effectuées",{"$f":"COUNTIF(BQ124:CG124,\">0\")","v":0},"Rondes effectuées",{"$f":"SUM(CJ127+BP127)","v":0}]
[31,{"$f":"VLOOKUP(A128,'Numéro licences'!$H$4:$I$47,2)","v":"THOMAS Isabelle"},"Aller-Retour",null,null,null,null,null,null,null,null,null,null,null,null,null,null,null,null,null,null,null,null,null,null,null,null,null,null,null,null,null,null,null,null,null,null,null,null,null,null,null,null,null,null,null,null,null,null,null,null,null,null,null,null,null,null,null,null,null,null,null,null,null,null,{"$f":"SUM(D128:BM128)","v":0},"Km  renseignés",{"$f":"SUM(BN128:BN129)","v":0},null,null,null,null,null,null,null,null,null,null,null,null,null,null,null,null,null,{"$f":"SUM(BQ128:CG128)","v":0},"Km  renseignés",{"$f":"SUM(CH128+CH129)","v":0},"Km  renseignés",{"$f":"SUM(BP128+CJ128)","v":0}]
[null,null,"Ronde",null,null,null,null,null,null,null,null,null,null,null,null,null,null,null,null,null,null,null,null,null,null,null,null,null,null,null,null,null,null,null,null,null,null,null,null,null,null,null,null,null,null,null,null,null,null,null,null,null,null,null,null,null,null,null,null,null,null,null,null,null,null,{"$f":"SUM(D129:BM129)","v":0},"Km confirmés",{"$f":"SUM(D131:BM131)","v":0},null,null,null,null,null,null,null,null,null,null,null,null,null,null,null,null,null,{"$f":"SUM(BQ129:CG129)","v":0},"Km confirmés",{"$f":"SUM(BQ131:CG131)","v":0},"Km confirmés",{"$f":"SUM(CJ129+BP129)","v":0}]
[null,null,null,0,0,0,0,0,0,0,0,0,0,0,0,0,0,0,0,0,0,0,0,0,0,0,0,0,0,0,0,0,0,0,0,0,0,0,0,0,0,0,0,0,0,0,0,0,0,0,0,0,0,0,0,0,0,0,0,0,0,0,0,0,0,null,"Rondes confirmées",0,0,0,0,0,0,0,0,0,0,0,0,0,0,0,0,0,0,null,"Rondes confirmées",{"$f":"SUM(BQ130:CH130)","v":0},"Rondes confirmées",{"$f":"SUM(CJ130+BP130)","v":0}]
[null,null,null,{"$f":"SUM((D128+D129)*D130)","v":0},0,0,0,0,0,0,0,0,0,0,0,0,0,0,0,0,0,0,0,0,0,0,0,0,0,0,0,0,0,0,0,0,0,0,0,0,0,0,0,0,0,0,0,0,0,0,0,0,0,0,0,0,0,0,0,0,0,{"$f":"SUM((BJ128+BJ129)*BJ130)","v":0},{"$f":"SUM((BK128+BK129)*BK130)","v":0},{"$f":"SUM((BL128+BL129)*BL130)","v":0},0,null,"Rondes effectuées",{"$f":"COUNTIF(D128:BM128,\">0\")","v":0},{"$f":"SUM((BQ128+BQ129)*BQ130)","v":0},0,0,0,0,0,0,0,0,0,0,0,0,0,0,0,0,null,"Rondes Effectuées",{"$f":"COUNTIF(BQ128:CG128,\">0\")","v":0},"Rondes effectuées",{"$f":"SUM(CJ131+BP131)","v":0}]
[32,{"$f":"VLOOKUP(A132,'Numéro licences'!$H$4:$I$47,2)","v":"URBAIN Philippe"},"Aller-Retour",null,null,null,null,null,null,null,null,null,null,null,null,null,null,null,null,null,null,null,null,null,null,null,null,null,null,null,null,null,null,null,null,null,null,null,null,null,null,null,null,null,null,null,null,null,null,null,null,null,null,null,null,null,null,null,null,null,null,null,null,null,null,{"$f":"SUM(D132:BM132)","v":0},"Km  renseignés",{"$f":"SUM(BN132:BN133)","v":0},null,null,null,36,null,null,null,null,null,null,null,null,null,null,null,null,null,{"$f":"SUM(BQ132:CG132)","v":36},"Km  renseignés",{"$f":"SUM(CH132+CH133)","v":156},"Km  renseignés",{"$f":"SUM(BP132+CJ132)","v":156}]
[null,null,"Ronde",null,null,null,null,null,null,null,null,null,null,null,null,null,null,null,null,null,null,null,null,null,null,null,null,null,null,null,null,null,null,null,null,null,null,null,null,null,null,null,null,null,null,null,null,null,null,null,null,null,null,null,null,null,null,null,null,null,null,null,null,null,null,{"$f":"SUM(D133:BM133)","v":0},"Km confirmés",{"$f":"SUM(D135:BM135)","v":0},null,null,null,120,null,null,null,null,null,null,null,null,null,null,null,null,null,{"$f":"SUM(BQ133:CG133)","v":120},"Km confirmés",{"$f":"SUM(BQ135:CG135)","v":0},"Km confirmés",{"$f":"SUM(CJ133+BP133)","v":0}]
[null,null,null,0,0,0,0,0,0,0,0,0,0,0,0,0,0,0,0,0,0,0,0,0,0,0,0,0,0,0,0,0,0,0,0,0,0,0,0,0,0,0,0,0,0,0,0,0,0,0,0,0,0,0,0,0,0,0,0,0,0,0,0,0,0,null,"Rondes confirmées",0,0,0,0,0,0,0,0,0,0,0,0,0,0,0,0,0,0,null,"Rondes confirmées",{"$f":"SUM(BQ134:CH134)","v":0},"Rondes confirmées",{"$f":"SUM(CJ134+BP134)","v":0}]
[null,null,null,{"$f":"SUM((D132+D133)*D134)","v":0},0,0,0,0,0,0,0,0,0,0,0,0,0,0,0,0,0,0,0,0,0,0,0,0,0,0,0,0,0,0,0,0,0,0,0,0,0,0,0,0,0,0,0,0,0,0,0,0,0,0,0,0,0,0,0,0,0,{"$f":"SUM((BJ132+BJ133)*BJ134)","v":0},{"$f":"SUM((BK132+BK133)*BK134)","v":0},{"$f":"SUM((BL132+BL133)*BL134)","v":0},0,null,"Rondes effectuées",{"$f":"COUNTIF(D132:BM132,\">0\")","v":0},{"$f":"SUM((BQ132+BQ133)*BQ134)","v":0},0,0,0,0,0,0,0,0,0,0,0,0,0,0,0,0,null,"Rondes Effectuées",{"$f":"COUNTIF(BQ132:CG132,\">0\")","v":1},"Rondes effectuées",{"$f":"SUM(CJ135+BP135)","v":1}]
[33,{"$f":"VLOOKUP(A136,'Numéro licences'!$H$4:$I$47,2)","v":"VANBELLINGEN Jean-Claude"},"Aller-Retour",null,null,null,null,null,null,null,null,null,null,null,null,null,null,null,null,null,null,null,null,null,null,38,null,null,0,null,null,null,60,null,null,null,52,null,null,null,null,null,null,null,null,null,null,null,null,null,null,null,null,null,null,null,null,null,null,null,null,null,null,null,null,{"$f":"SUM(D136:BM136)","v":150},"Km  renseignés",{"$f":"SUM(BN136:BN137)","v":863},null,null,null,null,null,null,null,null,null,null,null,null,null,null,null,null,null,{"$f":"SUM(BQ136:CG136)","v":0},"Km  renseignés",{"$f":"SUM(CH136+CH137)","v":0},"Km  renseignés",{"$f":"SUM(BP136+CJ136)","v":863}]
[null,null,"Ronde",null,null,null,null,null,null,null,null,null,null,null,null,null,null,null,null,null,null,null,null,null,null,513,null,null,200,null,null,null,0,null,null,null,0,null,null,null,null,null,null,null,null,null,null,null,null,null,null,null,null,null,null,null,null,null,null,null,null,null,null,null,null,{"$f":"SUM(D137:BM137)","v":713},"Km confirmés",{"$f":"SUM(D139:BM139)","v":0},null,null,null,null,null,null,null,null,null,null,null,null,null,null,null,null,null,{"$f":"SUM(BQ137:CG137)","v":0},"Km confirmés",{"$f":"SUM(BQ139:CG139)","v":0},"Km confirmés",{"$f":"SUM(CJ137+BP137)","v":0}]
[null,null,null,0,0,0,0,0,0,0,0,0,0,0,0,0,0,0,0,0,0,0,0,0,0,0,0,0,0,0,0,0,0,0,0,0,0,0,0,0,0,0,0,0,0,0,0,0,0,0,0,0,0,0,0,0,0,0,0,0,0,0,0,0,0,null,"Rondes confirmées",0,0,0,0,0,0,0,0,0,0,0,0,0,0,0,0,0,0,null,"Rondes confirmées",{"$f":"SUM(BQ138:CH138)","v":0},"Rondes confirmées",{"$f":"SUM(CJ138+BP138)","v":0}]
[null,null,null,{"$f":"SUM((D136+D137)*D138)","v":0},0,0,0,0,0,0,0,0,0,0,0,0,0,0,0,0,0,0,0,0,0,0,0,0,0,0,0,0,0,0,0,0,0,0,0,0,0,0,0,0,0,0,0,0,0,0,0,0,0,0,0,0,0,0,0,0,0,{"$f":"SUM((BJ136+BJ137)*BJ138)","v":0},{"$f":"SUM((BK136+BK137)*BK138)","v":0},0,0,null,"Rondes effectuées",{"$f":"COUNTIF(D136:BM136,\">0\")","v":3},{"$f":"SUM((BQ136+BQ137)*BQ138)","v":0},0,0,0,0,0,0,0,0,0,0,0,0,0,0,0,0,null,"Rondes Effectuées",{"$f":"COUNTIF(BQ136:CG136,\">0\")","v":0},"Rondes effectuées",{"$f":"SUM(CJ139+BP139)","v":3}]
[34,{"$f":"VLOOKUP(A140,'Numéro licences'!$H$4:$I$47,2)","v":"VANDEN BOSSCHE Vincent"},"Aller-Retour",null,null,null,null,null,null,null,null,null,null,null,null,null,null,null,null,null,null,null,null,null,null,null,null,null,null,null,null,null,null,null,null,null,null,null,null,null,null,null,null,null,null,null,null,null,null,null,null,null,null,null,null,null,null,null,null,null,null,null,null,null,null,{"$f":"SUM(D140:BM140)","v":0},"Km  renseignés",{"$f":"SUM(BN140:BN141)","v":0},null,null,null,null,null,null,null,null,null,null,null,null,null,null,null,null,null,{"$f":"SUM(BQ140:CG140)","v":0},"Km  renseignés",{"$f":"SUM(CH140+CH141)","v":0},"Km  renseignés",{"$f":"SUM(BP140+CJ140)","v":0}]
[null,null,"Ronde",null,null,null,null,null,null,null,null,null,null,null,null,null,null,null,null,null,null,null,null,null,null,null,null,null,null,null,null,null,null,null,null,null,null,0,null,null,null,null,null,null,null,null,null,null,null,null,null,null,null,null,null,null,null,null,null,null,null,null,null,null,null,{"$f":"SUM(D141:BM141)","v":0},"Km confirmés",{"$f":"SUM(D143:BM143)","v":0},null,null,null,null,null,null,null,null,null,null,null,null,null,null,null,null,null,{"$f":"SUM(BQ141:CG141)","v":0},"Km confirmés",{"$f":"SUM(BQ143:CG143)","v":0},"Km confirmés",{"$f":"SUM(CJ141+BP141)","v":0}]
[null,null,null,0,0,0,0,0,0,0,0,0,0,0,0,0,0,0,0,0,0,0,0,0,0,0,0,0,0,0,0,0,0,0,0,0,0,0,0,0,0,0,0,0,0,0,0,0,0,0,0,0,0,0,0,0,0,0,0,0,0,0,0,0,0,null,"Rondes confirmées",{"$f":"SUM(C142:BM142)","v":0},0,0,0,0,0,0,0,0,0,0,0,0,0,0,0,0,0,null,"Rondes confirmées",{"$f":"SUM(BQ142:CH142)","v":0},"Rondes confirmées",{"$f":"SUM(CJ142+BP142)","v":0}]
[null,null,null,{"$f":"SUM((D140+D141)*D142)","v":0},0,0,0,0,0,0,0,0,0,0,0,0,0,0,0,0,0,0,0,0,0,0,0,0,0,0,0,0,0,0,0,0,0,0,0,0,0,0,0,0,0,0,0,0,0,0,0,0,0,0,0,0,0,0,0,0,0,{"$f":"SUM((BJ140+BJ141)*BJ142)","v":0},{"$f":"SUM((BK140+BK141)*BK142)","v":0},0,0,null,"Rondes effectuées",{"$f":"COUNTIF(D140:BM140,\">0\")","v":0},{"$f":"SUM((BQ140+BQ141)*BQ142)","v":0},0,0,0,0,0,0,0,0,0,0,0,0,0,0,0,0,null,"Rondes Effectuées",{"$f":"COUNTIF(BQ140:CG140,\">0\")","v":0},"Rondes effectuées",{"$f":"SUM(CJ143+BP143)","v":0}]
[35,{"$f":"VLOOKUP(A144,'Numéro licences'!$H$4:$I$47,2)","v":"VANDEN WAEYENBERGH Michel"},"Aller-Retour",null,null,null,null,null,null,null,null,null,null,null,null,null,null,null,null,null,null,null,null,null,null,null,null,null,null,null,null,null,null,null,null,null,null,null,null,null,null,null,null,null,null,null,null,null,null,null,null,null,null,null,null,null,null,null,null,null,null,null,null,null,null,{"$f":"SUM(D144:BM144)","v":0},"Km  renseignés",{"$f":"SUM(BN144+BN145)","v":0},null,null,null,null,null,null,null,null,null,null,null,null,null,null,null,null,null,{"$f":"SUM(BQ144:CG144)","v":0},"Km  renseignés",{"$f":"SUM(CH144+CH145)","v":0},"Km  renseignés",{"$f":"SUM(BP144+CJ144)","v":0}]
[null,null,"Ronde",null,null,null,null,null,null,null,null,null,null,null,null,null,null,null,null,null,null,null,null,null,null,null,null,null,null,null,null,null,null,null,null,null,null,null,null,null,null,null,null,null,null,null,null,null,null,null,null,null,null,null,null,null,null,null,null,null,null,null,null,null,null,{"$f":"SUM(D145:BM145)","v":0},"Km confirmés",{"$f":"SUM(D147:BM147)","v":0},null,null,null,null,null,null,null,null,null,null,null,null,null,null,null,null,null,{"$f":"SUM(BQ145:CG145)","v":0},"Km confirmés",{"$f":"SUM(BQ147:CG147)","v":0},"Km confirmés",{"$f":"SUM(CJ145+BP145)","v":0}]
[null,null,null,0,0,0,0,0,0,0,0,0,0,0,0,0,0,0,0,0,0,0,0,0,0,0,0,0,0,0,0,0,0,0,0,0,0,0,0,0,0,0,0,0,0,0,0,0,0,0,0,0,0,0,0,0,0,0,0,0,0,0,0,0,0,null,"Rondes confirmées",{"$f":"SUM(C146:BM146)","v":0},0,0,0,0,0,0,0,0,0,0,0,0,0,0,0,0,0,null,"Rondes confirmées",{"$f":"SUM(BQ146:CH146)","v":0},"Rondes confirmées",{"$f":"SUM(CJ146+BP146)","v":0}]
[null,null,null,{"$f":"SUM((D144+D145)*D146)","v":0},0,0,0,0,0,0,0,0,0,0,0,0,0,0,0,0,0,0,0,0,0,0,0,0,0,0,0,0,0,0,0,0,0,0,0,0,0,0,0,0,0,0,0,0,0,0,0,0,0,0,0,0,0,0,0,0,0,{"$f":"SUM((BJ144+BJ145)*BJ146)","v":0},{"$f":"SUM((BK144+BK145)*BK146)","v":0},0,0,null,"Rondes effectuées",{"$f":"COUNTIF(D144:BM144,\">0\")","v":0},{"$f":"SUM((BQ144+BQ145)*BQ146)","v":0},0,0,0,0,0,0,0,0,0,0,0,0,0,0,0,0,null,"Rondes Effectuées",{"$f":"COUNTIF(BQ144:CG144,\">0\")","v":0},"Rondes effectuées",{"$f":"SUM(CJ147+BP147)","v":0}]
[36,{"$f":"VLOOKUP(A148,'Numéro licences'!$H$4:$I$47,2)","v":"VANSTEYVOORT André"},"Aller-Retour",null,null,null,null,null,null,null,null,null,null,null,null,null,null,null,null,null,null,null,null,null,null,null,null,null,0,null,null,null,null,null,null,null,null,null,null,null,null,null,null,null,null,null,null,null,null,null,null,null,null,null,null,null,null,null,null,null,null,null,null,null,null,{"$f":"SUM(D148:BM148)","v":0},"Km  renseignés",{"$f":"SUM(BN148+BN149)","v":200},null,null,null,null,null,null,null,null,null,null,null,null,null,null,null,null,null,{"$f":"SUM(BQ148:CG148)","v":0},"Km  renseignés",{"$f":"SUM(CH148+CH149)","v":0},"Km  renseignés",{"$f":"SUM(BP148+CJ148)","v":200}]
[null,null,"Ronde",null,null,null,null,null,null,null,null,null,null,null,null,null,null,null,null,null,null,null,null,null,null,null,null,null,200,null,null,null,null,null,null,null,null,null,null,null,null,null,null,null,null,null,null,null,null,null,null,null,null,null,null,null,null,null,null,null,null,null,null,null,null,{"$f":"SUM(D149:BM149)","v":200},"Km confirmés",{"$f":"SUM(D151:BM151)","v":0},null,null,null,null,null,null,null,null,null,null,null,null,null,null,null,null,null,{"$f":"SUM(BQ149:CG149)","v":0},"Km confirmés",{"$f":"SUM(BQ151:CG151)","v":0},"Km confirmés",{"$f":"SUM(CJ149+BP149)","v":0}]
[null,null,null,0,0,0,0,0,0,0,0,0,0,0,0,0,0,0,0,0,0,0,0,0,0,0,0,0,0,0,0,0,0,0,0,0,0,0,0,0,0,0,0,0,0,0,0,0,0,0,0,0,0,0,0,0,0,0,0,0,0,0,0,0,0,null,"Rondes confirmées",{"$f":"SUM(C150:BM150)","v":0},0,0,0,0,0,0,0,0,0,0,0,0,0,0,0,0,0,null,"Rondes confirmées",{"$f":"SUM(BQ150:CH150)","v":0},"Rondes confirmées",{"$f":"SUM(CJ150+BP150)","v":0}]
[null,null,null,{"$f":"SUM((D148+D149)*D150)","v":0},0,0,0,0,0,0,0,0,0,0,0,0,0,0,0,0,0,0,0,0,0,0,0,0,0,0,0,0,0,0,0,0,0,0,0,0,0,0,0,0,0,0,0,0,0,0,0,0,0,0,0,0,0,0,0,0,0,{"$f":"SUM((BJ148+BJ149)*BJ150)","v":0},{"$f":"SUM((BK148+BK149)*BK150)","v":0},0,0,null,"Rondes effectuées",{"$f":"COUNTIF(D148:BM148,\">0\")","v":0},{"$f":"SUM((BQ148+BQ149)*BQ150)","v":0},0,0,0,0,0,0,0,0,0,0,0,0,0,0,0,0,null,"Rondes Effectuées",{"$f":"COUNTIF(BQ148:CG148,\">0\")","v":0},"Rondes effectuées",{"$f":"SUM(CJ151+BP151)","v":0}]
[37,{"$f":"VLOOKUP(A152,'Numéro licences'!$H$4:$I$47,2)","v":"WOUTERS Olivier"},"Aller-Retour",null,null,null,null,null,null,null,null,null,null,null,null,null,null,null,null,null,null,124,null,null,null,38,null,null,null,null,null,148,148,null,null,null,null,null,null,null,null,null,null,null,null,380,null,null,null,60,null,60,null,124,null,null,null,null,null,null,null,174,176,108,52,{"$f":"SUM(D152:BM152)","v":1592},"Km  renseignés",{"$f":"SUM(BN152+BN153)","v":4099},166,0,null,null,null,null,null,null,null,null,null,null,null,null,null,null,null,{"$f":"SUM(BQ152:CG152)","v":166},"Km  renseignés",{"$f":"SUM(CH152+CH153)","v":582},"Km  renseignés",{"$f":"SUM(BP152+CJ152)","v":4681}]
[null,null,"Ronde",null,null,null,null,null,null,null,null,null,null,null,null,null,null,null,null,null,null,215,null,null,null,513,null,null,null,null,null,200,200,null,null,null,null,null,null,null,null,null,null,null,null,220,null,null,null,200,null,194,null,180,null,null,null,null,null,null,null,165,140,150,130,{"$f":"SUM(D153:BM153)","v":2507},"Km confirmés",{"$f":"SUM(D155:BM155)","v":4099},216,200,null,null,null,null,null,null,null,null,null,null,null,null,null,null,null,{"$f":"SUM(BQ153:CG153)","v":416},"Km confirmés",{"$f":"SUM(BQ155:CG155)","v":582},"Km confirmés",{"$f":"SUM(CJ153+BP153)","v":4681}]
[null,null,null,0,0,0,0,0,0,0,0,0,0,0,0,0,0,0,0,0,0,1,0,0,0,1,0,0,0,0,0,1,1,0,0,0,0,0,0,0,0,0,0,0,0,1,0,0,0,1,0,1,0,1,0,0,0,0,0,0,0,1,1,1,1,null,"Rondes confirmées",{"$f":"SUM(C154:BM154)","v":12},1,1,0,0,0,0,0,0,0,0,0,0,0,0,0,0,0,null,"Rondes confirmées",{"$f":"SUM(BQ154:CH154)","v":2},"Rondes confirmées",{"$f":"SUM(CJ154+BP154)","v":14}]
[null,null,null,{"$f":"SUM((D152+D153)*D154)","v":0},0,0,0,0,0,0,0,0,0,0,0,0,0,0,0,0,0,339,0,0,0,551,0,0,0,0,0,348,348,0,0,0,0,0,0,0,0,0,0,0,0,600,0,0,0,260,0,254,0,304,0,0,0,0,0,0,0,{"$f":"SUM((BJ152+BJ153)*BJ154)","v":339},{"$f":"SUM((BK152+BK153)*BK154)","v":316},258,182,null,"Rondes effectuées",{"$f":"COUNTIF(D152:BM152,\">0\")","v":12},{"$f":"SUM((BQ152+BQ153)*BQ154)","v":382},200,0,0,0,0,0,0,0,0,0,0,0,0,0,0,0,null,"Rondes Effectuées",{"$f":"COUNTIF(BQ152:CG152,\">0\")","v":1},"Rondes effectuées",{"$f":"SUM(CJ155+BP155)","v":13}]
[38,{"$f":"VLOOKUP(A156,'Numéro licences'!$H$4:$I$47,2)","v":"DEMETS Eric"},"Aller-Retour",null,null,null,null,null,null,null,null,null,null,null,null,null,null,null,null,null,null,null,null,null,null,38,null,null,null,null,null,null,null,null,null,null,null,null,null,null,null,null,null,null,null,null,null,null,null,null,null,null,null,null,null,null,null,null,null,null,null,null,null,null,null,{"$f":"SUM(D156:BM156)","v":38},"Km  renseignés",{"$f":"SUM(BN156+BN157)","v":551},null,0,null,null,null,null,null,null,null,null,null,null,null,null,null,null,null,{"$f":"SUM(BQ156:CG156)","v":0},"Km  renseignés",{"$f":"SUM(CH156+CH157)","v":200},"Km  renseignés",{"$f":"SUM(BP156+CJ156)","v":751}]
[null,null,"Ronde",null,null,null,null,null,null,0,null,null,null,null,null,null,null,null,null,null,null,null,null,null,null,513,null,null,null,null,null,null,null,null,null,null,null,null,null,null,null,null,null,null,null,null,null,null,null,null,null,null,null,null,null,null,null,null,null,null,null,null,null,null,null,{"$f":"SUM(D157:BM157)","v":513},"Km confirmés",{"$f":"SUM(D159:BM159)","v":0},null,200,null,null,null,null,null,null,null,null,null,null,null,null,null,null,null,{"$f":"SUM(BQ157:CG157)","v":200},"Km confirmés",{"$f":"SUM(BQ159:CG159)","v":0},"Km confirmés",{"$f":"SUM(CJ157+BP157)","v":0}]
[null,null,null,0,0,0,0,0,0,0,0,0,0,0,0,0,0,0,0,0,0,0,0,0,0,0,0,0,0,0,0,0,0,0,0,0,0,0,0,0,0,0,0,0,0,0,0,0,0,0,0,0,0,0,0,0,0,0,0,0,0,0,0,0,0,null,"Rondes confirmées",{"$f":"SUM(C158:BM158)","v":0},0,0,0,0,0,0,0,0,0,0,0,0,0,0,0,0,0,null,"Rondes confirmées",{"$f":"SUM(BQ158:CH158)","v":0},"Rondes confirmées",{"$f":"SUM(CJ158+BP158)","v":0}]
[null,null,null,{"$f":"SUM((D156+D157)*D158)","v":0},0,0,0,0,0,0,0,0,0,0,0,0,0,0,0,0,0,0,0,0,0,0,0,0,0,0,0,0,0,0,0,0,0,0,0,0,0,0,0,0,0,0,0,0,0,0,0,0,0,0,0,0,0,0,0,0,0,{"$f":"SUM((BJ156+BJ157)*BJ158)","v":0},{"$f":"SUM((BK156+BK157)*BK158)","v":0},0,0,null,"Rondes effectuées",{"$f":"COUNTIF(D156:BM156,\">0\")","v":1},{"$f":"SUM((BQ156+BQ157)*BQ158)","v":0},0,0,0,0,0,0,0,0,0,0,0,0,0,0,0,0,null,"Rondes Effectuées",{"$f":"COUNTIF(BQ156:CG156,\">0\")","v":0},"Rondes effectuées",{"$f":"SUM(CJ159+BP159)","v":1}]
[39,{"$f":"VLOOKUP(A160,'Numéro licences'!$H$4:$I$47,2)","v":"DECELLE Hubert"},"Aller-Retour",null,null,null,null,null,null,null,null,null,null,null,null,null,null,null,null,null,null,null,null,null,null,38,null,null,null,null,null,null,null,null,null,null,null,null,null,null,null,null,null,null,null,null,null,null,null,null,null,null,null,null,null,null,null,null,null,null,null,null,null,null,null,{"$f":"SUM(D160:BM160)","v":38},"Km  renseignés",{"$f":"SUM(BN160+BN161)","v":551},null,0,null,null,null,null,null,null,null,null,null,null,null,null,null,null,null,{"$f":"SUM(BQ160:CG160)","v":0},"Km  renseignés",{"$f":"SUM(CH160+CH161)","v":200},"Km  renseignés",{"$f":"SUM(BP160+CJ160)","v":751}]
[null,null,"Ronde",null,null,null,null,null,null,null,null,null,null,null,null,null,null,null,null,null,null,null,null,null,null,513,null,null,null,null,null,null,null,null,null,null,null,null,null,null,null,null,null,null,null,null,null,null,null,null,null,null,null,null,null,null,null,null,null,null,null,null,null,null,null,{"$f":"SUM(D161:BM161)","v":513},"Km confirmés",{"$f":"SUM(D163:BM163)","v":0},null,200,null,null,null,null,null,null,null,null,null,null,null,null,null,null,null,{"$f":"SUM(BQ161:CG161)","v":200},"Km confirmés",{"$f":"SUM(BQ163:CG163)","v":0},"Km confirmés",{"$f":"SUM(CJ161+BP161)","v":0}]
[null,null,null,0,0,0,0,0,0,0,0,0,0,0,0,0,0,0,0,0,0,0,0,0,0,0,0,0,0,0,0,0,0,0,0,0,0,0,0,0,0,0,0,0,0,0,0,0,0,0,0,0,0,0,0,0,0,0,0,0,0,0,0,0,0,null,"Rondes confirmées",{"$f":"SUM(C162:BM162)","v":0},0,0,0,0,0,0,0,0,0,0,0,0,0,0,0,0,0,null,"Rondes confirmées",{"$f":"SUM(BQ162:CH162)","v":0},"Rondes confirmées",{"$f":"SUM(CJ162+BP162)","v":0}]
[null,null,null,{"$f":"SUM((D160+D161)*D162)","v":0},0,0,0,0,0,0,0,0,0,0,0,0,0,0,0,0,0,0,0,0,0,0,0,0,0,0,0,0,0,0,0,0,0,0,0,0,0,0,0,0,0,0,0,0,0,0,0,0,0,0,0,0,0,0,0,0,0,{"$f":"SUM((BJ160+BJ161)*BJ162)","v":0},{"$f":"SUM((BK160+BK161)*BK162)","v":0},0,0,null,"Rondes effectuées",{"$f":"COUNTIF(D160:BM160,\">0\")","v":1},{"$f":"SUM((BQ160+BQ161)*BQ162)","v":0},0,0,0,0,0,0,0,0,0,0,0,0,0,0,0,0,null,"Rondes Effectuées",{"$f":"COUNTIF(BQ160:CG160,\">0\")","v":0},"Rondes effectuées",{"$f":"SUM(CJ163+BP163)","v":1}]
[40,{"$f":"VLOOKUP(A164,'Numéro licences'!$H$4:$I$47,2)","v":0},"Aller-Retour",null,null,null,null,null,null,null,null,null,null,null,null,null,null,null,null,null,null,null,null,null,null,null,null,null,null,null,null,null,null,null,null,null,null,null,null,null,null,null,null,null,null,null,null,null,null,null,null,null,null,null,null,null,null,null,null,null,null,null,null,null,null,{"$f":"SUM(D164:BM164)","v":0},"Km  renseignés",{"$f":"SUM(BN164+BN165)","v":0},null,null,null,null,null,null,null,null,null,null,null,null,null,null,null,null,null,{"$f":"SUM(BQ164:CG164)","v":0},"Km  renseignés",{"$f":"SUM(CH164+CH165)","v":0},"Km  renseignés",{"$f":"SUM(BP164+CJ164)","v":0}]
[null,null,"Ronde",null,null,null,null,null,null,null,null,null,null,null,null,null,null,null,null,null,null,null,null,null,null,null,null,null,null,null,null,null,null,null,null,null,null,null,null,null,null,null,null,null,null,null,null,null,null,null,null,null,null,null,null,null,null,null,null,null,null,null,null,null,null,{"$f":"SUM(D165:BM165)","v":0},"Km confirmés",{"$f":"SUM(D167:BM167)","v":0},null,null,null,null,null,null,null,null,null,null,null,null,null,null,null,null,null,{"$f":"SUM(BQ165:CG165)","v":0},"Km confirmés",{"$f":"SUM(BQ167:CG167)","v":0},"Km confirmés",{"$f":"SUM(CJ165+BP165)","v":0}]
[null,null,null,0,0,0,0,0,0,0,0,0,0,0,0,0,0,0,0,0,0,0,0,0,0,0,0,0,0,0,0,0,0,0,0,0,0,0,0,0,0,0,0,0,0,0,0,0,0,0,0,0,0,0,0,0,0,0,0,0,0,0,0,0,0,null,"Rondes confirmées",{"$f":"SUM(C166:BM166)","v":0},0,0,0,0,0,0,0,0,0,0,0,0,0,0,0,0,0,null,"Rondes confirmées",{"$f":"SUM(BQ166:CH166)","v":0},"Rondes confirmées",{"$f":"SUM(CJ166+BP166)","v":0}]
[null,null,null,{"$f":"SUM((D164+D165)*D166)","v":0},0,0,0,0,0,0,0,0,0,0,0,0,0,0,0,0,0,0,0,0,0,0,0,0,0,0,0,0,0,0,0,0,0,0,0,0,0,0,0,0,0,0,0,0,0,0,0,0,0,0,0,0,0,0,0,0,0,0,{"$f":"SUM((BK164+BK165)*BK166)","v":0},0,0,null,"Rondes effectuées",{"$f":"COUNTIF(D164:BM164,\">0\")","v":0},{"$f":"SUM((BQ164+BQ165)*BQ166)","v":0},0,0,0,0,0,0,0,0,0,0,0,0,0,0,0,0,null,"Rondes Effectuées",{"$f":"COUNTIF(BQ164:CG164,\">0\")","v":0},"Rondes effectuées",{"$f":"SUM(CJ167+BP167)","v":0}]
[41,{"$f":"VLOOKUP(A168,'Numéro licences'!$H$4:$I$47,2)","v":0},"Aller-Retour",null,null,null,null,null,null,null,null,null,null,null,null,null,null,null,null,null,null,null,null,null,null,null,null,null,null,null,null,null,null,null,null,null,null,null,null,null,null,null,null,null,null,null,null,null,null,null,null,null,null,null,null,null,null,null,null,null,null,null,null,null,null,{"$f":"SUM(D168:BM168)","v":0},"Km  renseignés",{"$f":"SUM(BN168+BN169)","v":0},null,null,null,null,null,null,null,null,null,null,null,null,null,null,null,null,null,{"$f":"SUM(BQ168:CG168)","v":0},"Km  renseignés",{"$f":"SUM(CH168+CH169)","v":0},"Km  renseignés",{"$f":"SUM(BP168+CJ168)","v":0}]
[null,null,"Ronde",null,null,null,null,null,null,null,null,null,null,null,null,null,null,null,null,null,null,null,null,null,null,null,null,null,null,null,null,null,null,null,null,null,null,null,null,null,null,null,null,null,null,null,null,null,null,null,null,null,null,null,null,null,null,null,null,null,null,null,null,null,null,{"$f":"SUM(D169:BM169)","v":0},"Km confirmés",{"$f":"SUM(D171:BM171)","v":0},null,null,null,null,null,null,null,null,null,null,null,null,null,null,null,null,null,{"$f":"SUM(BQ169:CG169)","v":0},"Km confirmés",{"$f":"SUM(BQ171:CG171)","v":0},"Km confirmés",{"$f":"SUM(CJ169+BP169)","v":0}]
[null,null,null,0,0,0,0,0,0,0,0,0,0,0,0,0,0,0,0,0,0,0,0,0,0,0,0,0,0,0,0,0,0,0,0,0,0,0,0,0,0,0,0,0,0,0,0,0,0,0,0,0,0,0,0,0,0,0,0,0,0,0,0,0,0,null,"Rondes confirmées",{"$f":"SUM(C170:BM170)","v":0},0,0,0,0,0,0,0,0,0,0,0,0,0,0,0,0,0,null,"Rondes confirmées",{"$f":"SUM(BQ170:CH170)","v":0},"Rondes confirmées",{"$f":"SUM(CJ170+BP170)","v":0}]
[null,null,null,{"$f":"SUM((D168+D169)*D170)","v":0},0,0,0,0,0,0,0,0,0,0,0,0,0,0,0,0,0,0,0,0,0,0,0,0,0,0,0,0,0,0,0,0,0,0,0,0,0,0,0,0,0,0,0,0,0,0,0,0,0,0,0,0,0,0,0,0,0,{"$f":"SUM((BJ168+BJ169)*BJ170)","v":0},{"$f":"SUM((BK168+BK169)*BK170)","v":0},0,0,null,"Rondes effectuées",{"$f":"COUNTIF(D168:BM168,\">0\")","v":0},{"$f":"SUM((BQ168+BQ169)*BQ170)","v":0},0,0,0,0,0,0,0,0,0,0,0,0,0,0,0,0,null,"Rondes Effectuées",{"$f":"COUNTIF(BQ168:CG168,\">0\")","v":0},"Rondes effectuées",{"$f":"SUM(CJ171+BP171)","v":0}]
[42,{"$f":"VLOOKUP(A172,'Numéro licences'!$H$4:$I$47,2)","v":0},"Aller-Retour",null,null,null,null,null,null,null,null,null,null,null,null,null,null,null,null,null,null,null,null,null,null,null,null,null,null,null,null,null,null,null,null,null,null,null,null,null,null,null,null,null,null,null,null,null,null,null,null,null,null,null,null,null,null,null,null,null,null,null,null,null,null,{"$f":"SUM(D172:BM172)","v":0},"Km  renseignés",{"$f":"SUM(BN172+BN173)","v":0},null,null,null,null,null,null,null,null,null,null,null,null,null,null,null,null,null,{"$f":"SUM(BQ172:CG172)","v":0},"Km  renseignés",{"$f":"SUM(CH172+CH173)","v":0},"Km  renseignés",{"$f":"SUM(BP172+CJ172)","v":0}]
[null,null,"Ronde",null,null,null,null,null,null,null,null,null,null,null,null,null,null,null,null,null,null,null,null,null,null,null,null,null,null,null,null,null,null,null,null,null,null,null,null,null,null,null,null,null,null,null,null,null,null,null,null,null,null,null,null,null,null,null,null,null,null,null,null,null,null,{"$f":"SUM(D173:BM173)","v":0},"Km confirmés",{"$f":"SUM(D175:BM175)","v":0},null,null,null,null,null,null,null,null,null,null,null,null,null,null,null,null,null,{"$f":"SUM(BQ173:CG173)","v":0},"Km confirmés",{"$f":"SUM(BQ175:CG175)","v":0},"Km confirmés",{"$f":"SUM(CJ173+BP173)","v":0}]
[null,null,null,0,0,0,0,0,0,0,0,0,0,0,0,0,0,0,0,0,0,0,0,0,0,0,0,0,0,0,0,0,0,0,0,0,0,0,0,0,0,0,0,0,0,0,0,0,0,0,0,0,0,0,0,0,0,0,0,0,0,0,0,0,0,null,"Rondes confirmées",{"$f":"SUM(C174:BM174)","v":0},0,0,0,0,0,0,0,0,0,0,0,0,0,0,0,0,0,null,"Rondes confirmées",{"$f":"SUM(BQ174:CH174)","v":0},"Rondes confirmées",{"$f":"SUM(CJ174+BP174)","v":0}]
[null,null,null,{"$f":"SUM((D172+D173)*D174)","v":0},0,0,0,0,0,0,0,0,0,0,0,0,0,0,0,0,0,0,0,0,0,0,0,0,0,0,0,0,0,0,0,0,0,0,0,0,0,0,0,0,0,0,0,0,0,0,0,0,0,0,0,0,0,0,0,0,0,{"$f":"SUM((BJ172+BJ173)*BJ174)","v":0},{"$f":"SUM((BK172+BK173)*BK174)","v":0},0,0,null,"Rondes effectuées",{"$f":"COUNTIF(D172:BM172,\">0\")","v":0},{"$f":"SUM((BQ172+BQ173)*BQ174)","v":0},0,0,0,0,0,0,0,0,0,0,0,0,0,0,0,0,null,"Rondes Effectuées",{"$f":"COUNTIF(BQ172:CG172,\">0\")","v":0},"Rondes effectuées",{"$f":"SUM(CJ175+BP175)","v":0}]
[43,{"$f":"VLOOKUP(A176,'Numéro licences'!$H$4:$I$47,2)","v":0},"Aller-Retour",null,null,null,null,null,null,null,null,null,null,null,null,null,null,null,null,null,null,null,null,null,null,null,null,null,null,null,null,null,null,null,null,null,null,null,null,null,null,null,null,null,null,null,null,null,null,null,null,null,null,null,null,null,null,null,null,null,null,null,null,null,null,{"$f":"SUM(D176:BM176)","v":0},"Km  renseignés",{"$f":"SUM(BN176+BN177)","v":0},null,null,null,null,null,null,null,null,null,null,null,null,null,null,null,null,null,{"$f":"SUM(BQ176:CG176)","v":0},"Km  renseignés",{"$f":"SUM(CH176+CH177)","v":0},"Km  renseignés",{"$f":"SUM(BP176+CJ176)","v":0}]
[null,null,"Ronde",null,null,null,null,null,null,null,null,null,null,null,null,null,null,null,null,null,null,null,null,null,null,null,null,null,null,null,null,null,null,null,null,null,null,null,null,null,null,null,null,null,null,null,null,null,null,null,null,null,null,null,null,null,null,null,null,null,null,null,null,null,null,{"$f":"SUM(D177:BM177)","v":0},"Km confirmés",{"$f":"SUM(D179:BM179)","v":0},null,null,null,null,null,null,null,null,null,null,null,null,null,null,null,null,null,{"$f":"SUM(BQ177:CG177)","v":0},"Km confirmés",{"$f":"SUM(BQ179:CG179)","v":0},"Km confirmés",{"$f":"SUM(CJ177+BP177)","v":0}]
[null,null,null,0,0,0,0,0,0,0,0,0,0,0,0,0,0,0,0,0,0,0,0,0,0,0,0,0,0,0,0,0,0,0,0,0,0,0,0,0,0,0,0,0,0,0,0,0,0,0,0,0,0,0,0,0,0,0,0,0,0,0,0,0,0,null,"Rondes confirmées",{"$f":"SUM(C178:BM178)","v":0},0,0,0,0,0,0,0,0,0,0,0,0,0,0,0,0,0,null,"Rondes confirmées",{"$f":"SUM(BQ178:CH178)","v":0},"Rondes confirmées",{"$f":"SUM(CJ178+BP178)","v":0}]
[null,null,null,{"$f":"SUM((D176+D177)*D178)","v":0},0,0,0,0,0,0,0,0,0,0,0,0,0,0,0,0,0,0,0,0,0,0,0,0,0,0,0,0,0,0,0,0,0,0,0,0,0,0,0,0,0,0,0,0,0,0,0,0,0,0,0,0,0,0,0,0,0,{"$f":"SUM((BJ176+BJ177)*BJ178)","v":0},{"$f":"SUM((BK176+BK177)*BK178)","v":0},0,0,null,"Rondes effectuées",{"$f":"COUNTIF(D176:BM176,\">0\")","v":0},{"$f":"SUM((BQ176+BQ177)*BQ178)","v":0},0,0,0,0,0,0,0,0,0,0,0,0,0,0,0,0,null,"Rondes Effectuées",{"$f":"COUNTIF(BQ176:CG176,\">0\")","v":0},"Rondes effectuées",{"$f":"SUM(CJ179+BP179)","v":0}]
[44,{"$f":"VLOOKUP(A180,'Numéro licences'!$H$4:$I$47,2)","v":0},"Aller-Retour",null,null,null,null,null,null,null,null,null,null,null,null,null,null,null,null,null,null,null,null,null,null,null,null,null,null,null,null,null,null,null,null,null,null,null,null,null,null,null,null,null,null,null,null,null,null,null,null,null,null,null,null,null,null,null,null,null,null,null,null,null,null,{"$f":"SUM(D180:BM180)","v":0},"Km  renseignés",{"$f":"SUM(BN180+BN181)","v":0},null,null,null,null,null,null,null,null,null,null,null,null,null,null,null,null,null,{"$f":"SUM(BQ180:CG180)","v":0},"Km  renseignés",{"$f":"SUM(CH180+CH181)","v":0},"Km  renseignés",{"$f":"SUM(BP180+CJ180)","v":0}]
[null,null,"Ronde",null,null,null,null,null,null,null,null,null,null,null,null,null,null,null,null,null,null,null,null,null,null,null,null,null,null,null,null,null,null,null,null,null,null,null,null,null,null,null,null,null,null,null,null,null,null,null,null,null,null,null,null,null,null,null,null,null,null,null,null,null,null,{"$f":"SUM(D181:BM181)","v":0},"Km confirmés",{"$f":"SUM(D183:BM183)","v":0},null,null,null,null,null,null,null,null,null,null,null,null,null,null,null,null,null,{"$f":"SUM(BQ181:CG181)","v":0},"Km confirmés",{"$f":"SUM(BQ183:CG183)","v":0},"Km confirmés",{"$f":"SUM(CJ181+BP181)","v":0}]
[null,null,null,0,0,0,0,0,0,0,0,0,0,0,0,0,0,0,0,0,0,0,0,0,0,0,0,0,0,0,0,0,0,0,0,0,0,0,0,0,0,0,0,0,0,0,0,0,0,0,0,0,0,0,0,0,0,0,0,0,0,0,0,0,0,null,"Rondes confirmées",{"$f":"SUM(C182:BM182)","v":0},0,0,0,0,0,0,0,0,0,0,0,0,0,0,0,0,0,null,"Rondes confirmées",{"$f":"SUM(BQ182:CH182)","v":0},"Rondes confirmées",{"$f":"SUM(CJ182+BP182)","v":0}]
[null,null,null,{"$f":"SUM((D180+D181)*D182)","v":0},0,0,0,0,0,0,0,0,0,0,0,0,0,0,0,0,0,0,0,0,0,0,0,0,0,0,0,0,0,0,0,0,0,0,0,0,0,0,0,0,0,0,0,0,0,0,0,0,0,0,0,0,0,0,0,0,0,{"$f":"SUM((BJ180+BJ181)*BJ182)","v":0},{"$f":"SUM((BK180+BK181)*BK182)","v":0},0,0,null,"Rondes effectuées",{"$f":"COUNTIF(D180:BM180,\">0\")","v":0},{"$f":"SUM((BQ180+BQ181)*BQ182)","v":0},0,0,0,0,0,0,0,0,0,0,0,0,0,0,0,0,null,"Rondes Effectuées",{"$f":"COUNTIF(BQ180:CG180,\">0\")","v":0},"Rondes effectuées",{"$f":"SUM(CJ183+BP183)","v":0}]
[45,{"$f":"VLOOKUP(A184,'Numéro licences'!$H$4:$I$47,2)","v":0},"Aller-Retour",null,null,null,null,null,null,null,null,null,null,null,null,null,null,null,null,null,null,null,null,null,null,null,null,null,null,null,null,null,null,null,null,null,null,null,null,null,null,null,null,null,null,null,null,null,null,null,null,null,null,null,null,null,null,null,null,null,null,null,null,null,null,{"$f":"SUM(D184:BM184)","v":0},"Km  renseignés",{"$f":"SUM(BN184+BN185)","v":0},null,null,null,null,null,null,null,null,null,null,null,null,null,null,null,null,null,{"$f":"SUM(BQ184:CG184)","v":0},"Km  renseignés",{"$f":"SUM(CH184+CH185)","v":0},"Km  renseignés",{"$f":"SUM(BP184+CJ184)","v":0}]
[null,null,"Ronde",null,null,null,null,null,null,null,null,null,null,null,null,null,null,null,null,null,null,null,null,null,null,null,null,null,null,null,null,null,null,null,null,null,null,null,null,null,null,null,null,null,null,null,null,null,null,null,null,null,null,null,null,null,null,null,null,null,null,null,null,null,null,{"$f":"SUM(D185:BM185)","v":0},"Km confirmés",{"$f":"SUM(D187:BM187)","v":0},null,null,null,null,null,null,null,null,null,null,null,null,null,null,null,null,null,{"$f":"SUM(BQ185:CG185)","v":0},"Km confirmés",{"$f":"SUM(BQ187:CG187)","v":0},"Km confirmés",{"$f":"SUM(CJ185+BP185)","v":0}]
[null,null,null,0,0,0,0,0,0,0,0,0,0,0,0,0,0,0,0,0,0,0,0,0,0,0,0,0,0,0,0,0,0,0,0,0,0,0,0,0,0,0,0,0,0,0,0,0,0,0,0,0,0,0,0,0,0,0,0,0,0,0,0,0,0,null,"Rondes confirmées",{"$f":"SUM(C186:BM186)","v":0},0,0,0,0,0,0,0,0,0,0,0,0,0,0,0,0,0,null,"Rondes confirmées",{"$f":"SUM(BQ186:CH186)","v":0},"Rondes confirmées",{"$f":"SUM(CJ186+BP186)","v":0}]
[null,null,null,{"$f":"SUM((D184+D185)*D186)","v":0},0,0,0,0,0,0,0,0,0,0,0,0,0,0,0,0,0,0,0,0,0,0,0,0,0,0,0,0,0,0,0,0,0,0,0,0,0,0,0,0,0,0,0,0,0,0,0,0,0,0,0,0,0,0,0,0,0,{"$f":"SUM((BJ184+BJ185)*BJ186)","v":0},{"$f":"SUM((BK184+BK185)*BK186)","v":0},0,0,null,"Rondes effectuées",{"$f":"COUNTIF(D184:BM184,\">0\")","v":0},{"$f":"SUM((BQ184+BQ185)*BQ186)","v":0},0,0,0,0,0,0,0,0,0,0,0,0,0,0,0,0,null,"Rondes Effectuées",{"$f":"COUNTIF(BQ184:CG184,\">0\")","v":0},"Rondes effectuées",{"$f":"SUM(CJ187+BP187)","v":0}]
[46,{"$f":"VLOOKUP(A188,'Numéro licences'!$H$4:$I$47,2)","v":0},"Aller-Retour",null,null,null,null,null,null,null,null,null,null,null,null,null,null,null,null,null,null,null,null,null,null,null,null,null,null,null,null,null,null,null,null,null,null,null,null,null,null,null,null,null,null,null,null,null,null,null,null,null,null,null,null,null,null,null,null,null,null,null,null,null,null,{"$f":"SUM(D188:BM188)","v":0},"Km  renseignés",{"$f":"SUM(BN188+BN189)","v":0},null,null,null,null,null,null,null,null,null,null,null,null,null,null,null,null,null,{"$f":"SUM(BQ188:CG188)","v":0},"Km  renseignés",{"$f":"SUM(CH188+CH189)","v":0},"Km  renseignés",{"$f":"SUM(BP188+CJ188)","v":0}]
[null,null,"Ronde",null,null,null,null,null,null,null,null,null,null,null,null,null,null,null,null,null,null,null,null,null,null,null,null,null,null,null,null,null,null,null,null,null,null,null,null,null,null,null,null,null,null,null,null,null,null,null,null,null,null,null,null,null,null,null,null,null,null,null,null,null,null,{"$f":"SUM(D189:BM189)","v":0},"Km confirmés",{"$f":"SUM(D191:BM191)","v":0},null,null,null,null,null,null,null,null,null,null,null,null,null,null,null,null,null,{"$f":"SUM(BQ189:CG189)","v":0},"Km confirmés",{"$f":"SUM(BQ191:CG191)","v":0},"Km confirmés",{"$f":"SUM(CJ189+BP189)","v":0}]
[null,null,null,0,0,0,0,0,0,0,0,0,0,0,0,0,0,0,0,0,0,0,0,0,0,0,0,0,0,0,0,0,0,0,0,0,0,0,0,0,0,0,0,0,0,0,0,0,0,0,0,0,0,0,0,0,0,0,0,0,0,0,0,0,0,null,"Rondes confirmées",{"$f":"SUM(C190:BM190)","v":0},0,0,0,0,0,0,0,0,0,0,0,0,0,0,0,0,0,null,"Rondes confirmées",{"$f":"SUM(BQ190:CH190)","v":0},"Rondes confirmées",{"$f":"SUM(CJ190+BP190)","v":0}]
[null,null,null,{"$f":"SUM((D188+D189)*D190)","v":0},0,0,0,0,0,0,0,0,0,0,0,0,0,0,0,0,0,0,0,0,0,0,0,0,0,0,0,0,0,0,0,0,0,0,0,0,0,0,0,0,0,0,0,0,0,0,0,0,0,0,0,0,0,0,0,0,0,{"$f":"SUM((BJ188+BJ189)*BJ190)","v":0},{"$f":"SUM((BK188+BK189)*BK190)","v":0},0,0,null,"Rondes effectuées",{"$f":"COUNTIF(D188:BM188,\">0\")","v":0},{"$f":"SUM((BQ188+BQ189)*BQ190)","v":0},0,0,0,0,0,0,0,0,0,0,0,0,0,0,0,0,null,"Rondes Effectuées",{"$f":"COUNTIF(BQ188:CG188,\">0\")","v":0},"Rondes effectuées",{"$f":"SUM(CJ191+BP191)","v":0}]
[null,null,"Nat.Pirates-Hors/FMB"]
[null,null,"Inconnu ou non-confirmé"]
[]
[null,null,"Concentres",{"$f":"COUNTIF(D8:D191,D5)","v":0},{"$f":"COUNTIF(E8:E191,E5)","v":0},{"$f":"COUNTIF(F8:F191,F5)","v":0},0,0,0,93,0,0,0,0,0,0,0,0,0,0,0,5,0,4,0,10,0,0,92,0,0,5,7,4,0,0,9,3,3,0,0,3,0,0,0,5,0,5,1,2,0,8,0,7,0,0,3,2,0,4,{"$f":"COUNTIF(BI8:BI191,BI5)","v":0},0,{"$f":"COUNTIF(BK8:BK191,BK5)","v":3},4,7,{"$f":"SUM(D195:BM195)","v":289},"Concentres",null,6,93,6,6,{"$f":"COUNTIF(BU8:BU191,BU5)","v":92},92,0,0,0,0,0,0,0,0,0,0,0,{"$f":"SUM(BQ195:CG195)","v":295},"Concentres",null,"Concentres",{"$f":"SUM(CH195+BN195)","v":584}]
[null,null,"Rondes",{"$f":"COUNTIF(D9:D192,D6)","v":92},{"$f":"COUNTIF(E9:E192,E6)","v":92},{"$f":"COUNTIF(F9:F192,F6)","v":92},92,92,92,93,92,92,92,92,92,92,92,92,92,92,92,5,92,4,92,10,92,92,18,92,92,5,4,4,92,92,6,3,3,92,92,3,92,92,92,3,92,2,1,0,0,6,0,7,0,0,3,2,0,4,92,3,{"$f":"COUNTIF(BK9:BK192,BK6)","v":2},4,5,{"$f":"SUM(D196:BM196)","v":3144},"Rondes",null,6,19,6,6,{"$f":"COUNTIF(BU9:BU192,BU6)","v":92},92,0,0,0,0,0,0,0,0,0,0,0,{"$f":"SUM(BQ196:CG196)","v":221},"Rondes",null,"Rondes",{"$f":"SUM(CH196+BN196)","v":3365}]
[]
[]
[]
[]
[null,"Colonne1"]
[1,"BALLION Pierre"]
[{"$f":"SUM(A202+1)","v":2},"BERDOYES Yannick"]
[{"$f":"SUM(A203+1)","v":3},"CLAISSE Jean-Luc"]
[4,"DAVIN Philippe"]
[5,"DE BONDT Philippe"]
[6,"DE SCHEPPERS Jean-Claude"]
[7,"DECELLE Hubert"]
[8,"DONY Marc"]
[9,"FAVRESSSE René"]
[10,"FONTAINE Guy"]
[11,"GADEYNE Claude"]
[12,"GOOSSENS Joël"]
[13,"LAMBOTTE Didier"]
[14,"LEFEVRE Didier"]
[15,"LEROY Michel"]
[16,"LONDOT Philippe"]
[17,"MALLIEN Philippe"]
[18,"MILET Benoit"]
[19,"NIHOUL Dany"]
[20,"PARMENTIER Dominique"]
[21,"POMPIER Philippe"]
[22,"RICHARD Didier"]
[23,"ROUSSEAU Eric"]
[24,"SERGI Gérard"]
[25,"SMETS Rudy"]
[26,"STRYPSTEIN Nicolas"]
[27,"VANBELLINGEN Jean-Claude"]
[28,"VANDERVELDEN Robert"]
[29]
[30]
[31]
[32]
[33]
[34]
[35]
[36]
[37]
[38]
[39]
[40]
[41]
[42]
[43]
[{"$f":"SUM(A244+1)","v":44}]
[45]
[46]

{"sheet":"Passagers Nat","index":5,"n_rows":179,"n_cols":96,"rows_kept":179,"cut":false,"hidden":false,"merged":[[83,1,86,1],[87,1,90,1],[91,1,94,1],[95,1,98,1],[119,1,122,1],[99,1,102,1],[103,1,106,1],[107,1,110,1],[111,1,114,1],[115,1,118,1],[63,1,66,1],[67,1,70,1],[71,1,74,1],[75,1,78,1],[79,1,82,1],[82,93,82,95],[4,91,5,95],[7,1,10,1],[11,1,14,1],[15,1,18,1],[19,1,22,1],[23,1,26,1],[27,1,30,1],[31,1,34,1],[35,1,38,1],[39,1,42,1],[43,1,46,1],[47,1,50,1],[51,1,54,1],[55,1,58,1],[59,1,62,1]]}
[null,null,null,1,{"$f":"SUM(D1+1)","v":2},{"$f":"SUM(E1+1)","v":3},4,5,6,7,8,9,10,11,12,13,14,15,16,17,18,19,20,21,22,23,24,25,26,27,28,29,30,31,32,33,34,35,36,37,38,39,40,41,42,43,44,45,46,47,48,49,50,51,52,53,54,55,56,57,58,59,{"$f":"SUM(BJ1+1)","v":60},{"$f":"SUM(BK1+1)","v":61},{"$f":"SUM(BL1+1)","v":62}]
[null,null,null,902,531,516,103,206,904,713,912,721,730,726,426,716,533,549,806,126,427,729,721,729,419,0,312,508,713,137,705,516,703,531,903,427,710,921,614,810,103,818,920,922,406,902,138,730,426,703,908,705,136,729,907,137,531,126,910,422,427,332,508,332,710]
[null,null,null,"2021-02-14","2021-02-28","2021-03-07","2021-03-14","2021-03-14","2021-03-20","2021-03-21","2021-03-28","2021-04-04","2021-04-05","2021-04-10","2021-04-11","2021-04-18","2021-04-25","2021-05-01","2021-05-01","2021-05-02","2021-05-09","2021-05-16","2021-05-23","2021-05-24","2021-05-29","2021-06-05","2021-06-12","2021-06-20","2021-06-26","2021-06-27","2021-06-27","2021-07-03","2021-07-04","2021-07-10","2021-07-17","2021-07-18","2021-07-21","2021-07-24","2021-07-31","2021-08-01","2021-08-08","2021-08-14","2021-08-14","2021-08-21","2021-08-22","2021-08-28","2021-08-28","2021-08-29","2021-09-04","2021-09-05","2021-09-11","2021-09-12","2021-09-18","2021-09-19","2021-09-19","2021-09-25","2021-09-26","2021-10-02","2021-10-03","2021-10-10","2021-10-17","2021-10-31","2021-11-01","2021-11-07","2021-11-11",null,null,null,"2021-05-09","2021-06-06","2021-06-27","2021-10-17"]
[null,null,null,{"$f":"VLOOKUP(D2,'Kilomètre AR'!$A$1:$B$58,2)","v":"AMC GIJVERINKHOVE"},{"$f":"VLOOKUP(E2,'Kilomètre AR'!$A$1:$B$58,2)","v":"MC HOESELT"},{"$f":"VLOOKUP(F2,'Kilomètre AR'!$A$1:$B$58,2)","v":"MC LOTUS  Bilzen"},{"$f":"VLOOKUP(G2,'Kilomètre AR'!$A$1:$B$58,2)","v":"KAMC HERENTALS"},{"$f":"VLOOKUP(H2,'Kilomètre AR'!$A$1:$B$58,2)","v":"MC L'EQUIPE  Bruxelles"},{"$f":"VLOOKUP(I2,'Kilomètre AR'!$A$1:$B$58,2)","v":"KAMC MENEN"},{"$f":"VLOOKUP(J2,'Kilomètre AR'!$A$1:$B$58,2)","v":"MC ST SERVAIS"},{"$f":"VLOOKUP(K2,'Kilomètre AR'!$A$1:$B$58,2)","v":"MTC ZEDELGEM"},{"$f":"VLOOKUP(L2,'Kilomètre AR'!$A$1:$B$58,2)","v":"MC LES PETITS GRIS   Warisoulx"},{"$f":"VLOOKUP(M2,'Kilomètre AR'!$A$1:$B$58,2)","v":"MC LES 4 & CO  Assesse"},{"$f":"VLOOKUP(N2,'Kilomètre AR'!$A$1:$B$58,2)","v":"MC BIKE AND TRIKE BELGIUM  Dhuy"},{"$f":"VLOOKUP(O2,'Kilomètre AR'!$A$1:$B$58,2)","v":"MTC WELKENRAEDT"},{"$f":"VLOOKUP(P2,'Kilomètre AR'!$A$1:$B$58,2)","v":"AMC FLOREFFE"},{"$f":"VLOOKUP(Q2,'Kilomètre AR'!$A$1:$B$58,2)","v":"MTC 13  Leopoldsburg"},{"$f":"VLOOKUP(R2,'Kilomètre AR'!$A$1:$B$58,2)","v":"MTC WELLEN   Wellen"},{"$f":"VLOOKUP(S2,'Kilomètre AR'!$A$1:$B$58,2)","v":"MC SCHELDELAND  Wichelen"},{"$f":"VLOOKUP(T2,'Kilomètre AR'!$A$1:$B$58,2)","v":"MTC TOERVRIENDEN  Brasschaat"},{"$f":"VLOOKUP(U2,'Kilomètre AR'!$A$1:$B$58,2)","v":"MC ZEBUS  Flémalle"},{"$f":"VLOOKUP(V2,'Kilomètre AR'!$A$1:$B$58,2)","v":"VIROINVAL MOTOR SPORT Dourbes"},{"$f":"VLOOKUP(W2,'Kilomètre AR'!$A$1:$B$58,2)","v":"MC LES PETITS GRIS   Warisoulx"},{"$f":"VLOOKUP(X2,'Kilomètre AR'!$A$1:$B$58,2)","v":"VIROINVAL MOTOR SPORT Dourbes"},{"$f":"VLOOKUP(Y2,'Kilomètre AR'!$A$1:$B$58,2)","v":"AMC ST VITH"},{"$f":"VLOOKUP(Z2,'Kilomètre AR'!$A$1:$B$58,2)","v":"RONDE FMB"},{"$f":"VLOOKUP(AA2,'Kilomètre AR'!$A$1:$B$58,2)","v":"MC RESSAIX"},{"$f":"VLOOKUP(AB2,'Kilomètre AR'!$A$1:$B$58,2)","v":"AMC KOERSEL"},{"$f":"VLOOKUP(AC2,'Kilomètre AR'!$A$1:$B$58,2)","v":"MC ST SERVAIS"},{"$f":"VLOOKUP(AD2,'Kilomètre AR'!$A$1:$B$58,2)","v":"MTC YELLS ARMY   Berchem"},{"$f":"VLOOKUP(AE2,'Kilomètre AR'!$A$1:$B$58,2)","v":"MC DINANT"},{"$f":"VLOOKUP(AF2,'Kilomètre AR'!$A$1:$B$58,2)","v":"MC LOTUS  Bilzen"},{"$f":"VLOOKUP(AG2,'Kilomètre AR'!$A$1:$B$58,2)","v":"R CINEY MC"},{"$f":"VLOOKUP(AH2,'Kilomètre AR'!$A$1:$B$58,2)","v":"MC HOESELT"},{"$f":"VLOOKUP(AI2,'Kilomètre AR'!$A$1:$B$58,2)","v":"AMSC LEIELAND  Wervik"},{"$f":"VLOOKUP(AJ2,'Kilomètre AR'!$A$1:$B$58,2)","v":"MC ZEBUS  Flémalle"},{"$f":"VLOOKUP(AK2,'Kilomètre AR'!$A$1:$B$58,2)","v":"MC MOLIGNARD  Warnant"},{"$f":"VLOOKUP(AL2,'Kilomètre AR'!$A$1:$B$58,2)","v":"MTC VRIJBOS   Houthulst"},{"$f":"VLOOKUP(AM2,'Kilomètre AR'!$A$1:$B$58,2)","v":"MC CHEVY RACING   Libramont-Chevigny"},{"$f":"VLOOKUP(AN2,'Kilomètre AR'!$A$1:$B$58,2)","v":"BMW MC VLAANDEREN  Lede"},{"$f":"VLOOKUP(AO2,'Kilomètre AR'!$A$1:$B$58,2)","v":"KAMC HERENTALS"},{"$f":"VLOOKUP(AP2,'Kilomètre AR'!$A$1:$B$58,2)","v":"MTC VLAANDEREN   Aalst"},{"$f":"VLOOKUP(AQ2,'Kilomètre AR'!$A$1:$B$58,2)","v":"WESTHOEK BIKERS  Houtem"},{"$f":"VLOOKUP(AR2,'Kilomètre AR'!$A$1:$B$58,2)","v":"MTC REDBONE  Wevezele"},{"$f":"VLOOKUP(AS2,'Kilomètre AR'!$A$1:$B$58,2)","v":"RAMC EUPEN"},{"$f":"VLOOKUP(AT2,'Kilomètre AR'!$A$1:$B$58,2)","v":"AMC GIJVERINKHOVE"},{"$f":"VLOOKUP(AU2,'Kilomètre AR'!$A$1:$B$58,2)","v":"MC TIGRIS PANTERA  Brasschaat"},{"$f":"VLOOKUP(AV2,'Kilomètre AR'!$A$1:$B$58,2)","v":"MC LES 4 & CO  Assesse"},{"$f":"VLOOKUP(AW2,'Kilomètre AR'!$A$1:$B$58,2)","v":"MTC WELKENRAEDT"},{"$f":"VLOOKUP(AX2,'Kilomètre AR'!$A$1:$B$58,2)","v":"R CINEY MC"},{"$f":"VLOOKUP(AY2,'Kilomètre AR'!$A$1:$B$58,2)","v":"AMC POPERINGE"},{"$f":"VLOOKUP(AZ2,'Kilomètre AR'!$A$1:$B$58,2)","v":"MC DINANT"},{"$f":"VLOOKUP(BA2,'Kilomètre AR'!$A$1:$B$58,2)","v":"MTC AMIGO'S   Schoten"},{"$f":"VLOOKUP(BB2,'Kilomètre AR'!$A$1:$B$58,2)","v":"VIROINVAL MOTOR SPORT Dourbes"},{"$f":"VLOOKUP(BC2,'Kilomètre AR'!$A$1:$B$58,2)","v":"KV OSTEND MS"},{"$f":"VLOOKUP(BD2,'Kilomètre AR'!$A$1:$B$58,2)","v":"MTC YELLS ARMY   Berchem"},{"$f":"VLOOKUP(BE2,'Kilomètre AR'!$A$1:$B$58,2)","v":"MC HOESELT"},{"$f":"VLOOKUP(BF2,'Kilomètre AR'!$A$1:$B$58,2)","v":"MTC TOERVRIENDEN  Brasschaat"},{"$f":"VLOOKUP(BG2,'Kilomètre AR'!$A$1:$B$58,2)","v":"AMC EENDRACHT TORHOUT"},{"$f":"VLOOKUP(BH2,'Kilomètre AR'!$A$1:$B$58,2)","v":"MC THEUX-FRANCHIMONT"},{"$f":"VLOOKUP(BI2,'Kilomètre AR'!$A$1:$B$58,2)","v":"MC ZEBUS  Flémalle"},{"$f":"VLOOKUP(BJ2,'Kilomètre AR'!$A$1:$B$58,2)","v":"MC BUTZ BIKERS 95   Ecaussinnes"},{"$f":"VLOOKUP(BK2,'Kilomètre AR'!$A$1:$B$58,2)","v":"AMC KOERSEL"},{"$f":"VLOOKUP(BL2,'Kilomètre AR'!$A$1:$B$58,2)","v":"MC BUTZ BIKERS 95   Ecaussinnes"},{"$f":"VLOOKUP(BM2,'Kilomètre AR'!$A$1:$B$58,2)","v":"MC MOLIGNARD  Warnant"},null,null,null,"MC Theux","MCSS","MCSS - DINANT","Moto Retro Flemalle"]
[null,"Aller-Retour",null,{"$f":"VLOOKUP(D2,'Kilomètre AR'!$A$1:$D$58,4)","v":380},{"$f":"VLOOKUP(E2,'Kilomètre AR'!$A$1:$D$58,4)","v":140},{"$f":"VLOOKUP(F2,'Kilomètre AR'!$A$1:$D$58,4)","v":148},{"$f":"VLOOKUP(G2,'Kilomètre AR'!$A$1:$D$58,4)","v":190},{"$f":"VLOOKUP(H2,'Kilomètre AR'!$A$1:$D$58,4)","v":116},{"$f":"VLOOKUP(I2,'Kilomètre AR'!$A$1:$D$58,4)","v":296},{"$f":"VLOOKUP(J2,'Kilomètre AR'!$A$1:$D$58,4)","v":0},{"$f":"VLOOKUP(K2,'Kilomètre AR'!$A$1:$D$58,4)","v":312},{"$f":"VLOOKUP(L2,'Kilomètre AR'!$A$1:$D$58,4)","v":20},{"$f":"VLOOKUP(M2,'Kilomètre AR'!$A$1:$D$58,4)","v":38},{"$f":"VLOOKUP(N2,'Kilomètre AR'!$A$1:$D$58,4)","v":34},{"$f":"VLOOKUP(O2,'Kilomètre AR'!$A$1:$D$58,4)","v":186},{"$f":"VLOOKUP(P2,'Kilomètre AR'!$A$1:$D$58,4)","v":20},{"$f":"VLOOKUP(Q2,'Kilomètre AR'!$A$1:$D$58,4)","v":184},{"$f":"VLOOKUP(R2,'Kilomètre AR'!$A$1:$D$58,4)","v":130},{"$f":"VLOOKUP(S2,'Kilomètre AR'!$A$1:$D$58,4)","v":194},{"$f":"VLOOKUP(T2,'Kilomètre AR'!$A$1:$D$58,4)","v":218},{"$f":"VLOOKUP(U2,'Kilomètre AR'!$A$1:$D$58,4)","v":104},{"$f":"VLOOKUP(V2,'Kilomètre AR'!$A$1:$D$58,4)","v":124},{"$f":"VLOOKUP(W2,'Kilomètre AR'!$A$1:$D$58,4)","v":20},{"$f":"VLOOKUP(X2,'Kilomètre AR'!$A$1:$D$58,4)","v":124},{"$f":"VLOOKUP(Y2,'Kilomètre AR'!$A$1:$D$58,4)","v":262},38,1645,{"$f":"VLOOKUP(AB2,'Kilomètre AR'!$A$1:$D$58,4)","v":176},{"$f":"VLOOKUP(AC2,'Kilomètre AR'!$A$1:$D$58,4)","v":0},{"$f":"VLOOKUP(AD2,'Kilomètre AR'!$A$1:$D$58,4)","v":192},{"$f":"VLOOKUP(AE2,'Kilomètre AR'!$A$1:$D$58,4)","v":60},{"$f":"VLOOKUP(AF2,'Kilomètre AR'!$A$1:$D$58,4)","v":148},{"$f":"VLOOKUP(AG2,'Kilomètre AR'!$A$1:$D$58,4)","v":60},{"$f":"VLOOKUP(AH2,'Kilomètre AR'!$A$1:$D$58,4)","v":140},{"$f":"VLOOKUP(AI2,'Kilomètre AR'!$A$1:$D$58,4)","v":296},{"$f":"VLOOKUP(AJ2,'Kilomètre AR'!$A$1:$D$58,4)","v":104},{"$f":"VLOOKUP(AK2,'Kilomètre AR'!$A$1:$D$58,4)","v":52},{"$f":"VLOOKUP(AL2,'Kilomètre AR'!$A$1:$D$58,4)","v":344},{"$f":"VLOOKUP(AM2,'Kilomètre AR'!$A$1:$D$58,4)","v":162},{"$f":"VLOOKUP(AN2,'Kilomètre AR'!$A$1:$D$58,4)","v":184},{"$f":"VLOOKUP(AO2,'Kilomètre AR'!$A$1:$D$58,4)","v":190},{"$f":"VLOOKUP(AP2,'Kilomètre AR'!$A$1:$D$58,4)","v":176},{"$f":"VLOOKUP(AQ2,'Kilomètre AR'!$A$1:$D$58,4)","v":386},{"$f":"VLOOKUP(AR2,'Kilomètre AR'!$A$1:$D$58,4)","v":292},{"$f":"VLOOKUP(AS2,'Kilomètre AR'!$A$1:$D$58,4)","v":194},{"$f":"VLOOKUP(AT2,'Kilomètre AR'!$A$1:$D$58,4)","v":380},{"$f":"VLOOKUP(AU2,'Kilomètre AR'!$A$1:$D$58,4)","v":218},{"$f":"VLOOKUP(AV2,'Kilomètre AR'!$A$1:$D$58,4)","v":38},{"$f":"VLOOKUP(AW2,'Kilomètre AR'!$A$1:$D$58,4)","v":186},{"$f":"VLOOKUP(AX2,'Kilomètre AR'!$A$1:$D$58,4)","v":60},{"$f":"VLOOKUP(AY2,'Kilomètre AR'!$A$1:$D$58,4)","v":356},{"$f":"VLOOKUP(AZ2,'Kilomètre AR'!$A$1:$D$58,4)","v":60},{"$f":"VLOOKUP(BA2,'Kilomètre AR'!$A$1:$D$58,4)","v":208},{"$f":"VLOOKUP(BB2,'Kilomètre AR'!$A$1:$D$58,4)","v":124},{"$f":"VLOOKUP(BC2,'Kilomètre AR'!$A$1:$D$58,4)","v":344},{"$f":"VLOOKUP(BD2,'Kilomètre AR'!$A$1:$D$58,4)","v":192},{"$f":"VLOOKUP(BE2,'Kilomètre AR'!$A$1:$D$58,4)","v":140},{"$f":"VLOOKUP(BF2,'Kilomètre AR'!$A$1:$D$58,4)","v":218},{"$f":"VLOOKUP(BG2,'Kilomètre AR'!$A$1:$D$58,4)","v":324},{"$f":"VLOOKUP(BH2,'Kilomètre AR'!$A$1:$D$58,4)","v":166},{"$f":"VLOOKUP(BI2,'Kilomètre AR'!$A$1:$D$58,4)","v":104},{"$f":"VLOOKUP(BJ2,'Kilomètre AR'!$A$1:$D$58,4)","v":108},{"$f":"VLOOKUP(BK2,'Kilomètre AR'!$A$1:$D$58,4)","v":176},{"$f":"VLOOKUP(BL2,'Kilomètre AR'!$A$1:$D$58,4)","v":108},{"$f":"VLOOKUP(BM2,'Kilomètre AR'!$A$1:$D$58,4)","v":52},null,null,null,166,0,79,36,-1,-1,-1,-1,-1,-1,-1,-1,-1,-1,-1,-1,-1,null,null,null,null,null,null,"NATIONAL"]
[null,"Ronde",null,null,null,null,null,null,null,null,null,null,null,null,null,null,null,null,null,null,null,215,null,195,null,513,null,null,200,null,null,200,210,180,null,null,200,300,220,null,null,250,null,null,null,220,null,220,166,220,165,194,180,180,165,150,165,170,160,220,null,165,140,150,130,null,null,null,216,200,186,120,-1,-1,-1,-1,-1,-1,-1,-1,-1,-1,-1,-1,-1]
[null,null,null,"ANNULEE\nCOVID-19","ANNULEE\nCOVID-19","ANNULEE\nCOVID-19","ANNULEE\nCOVID-19","ANNULEE\nCOVID-19","ANNULEE\nCOVID-19","ANNULEE\nCOVID-19","ANNULEE\nCOVID-19","ANNULEE\nCOVID-19","ANNULEE\nCOVID-19","ANNULEE\nCOVID-19","ANNULEE\nCOVID-19","ANNULEE\nCOVID-19","ANNULEE\nCOVID-19","ANNULEE\nCOVID-19","ANNULEE\nCOVID-19","ANNULEE\nCOVID-19","ANNULEE\nCOVID-19",null,"ANNULEE\nCOVID-19",null,"ANNULEE\nCOVID-19",null,"ANNULEE\nCOVID-19",null,null,"ANNULEE\nCOVID-19","ANNULEE\nCOVID-19",null,null,null,"ANNULEE\nCOVID-19","ANNULEE\nCOVID-19",null,null,null,"Hors\nChampionnat","ANNULEE\nCOVID-19",null,"ANNULEE\nCOVID-19","ANNULEE\nCOVID-19","ANNULEE\nCOVID-19","Inter","ANNULEE\nCOVID-19",null,"Inter",null,null,null,null,null,null,null,null,null,null,"Hors Championnat","Annulée","174 Km A/R !!\nAdresse Salle déportée",null,null,null,"Sous-Total\nFMB",null,"Total FMB",null,null,null,null,null,null,null,null,null,null,null,null,null,null,null,null,null,"Sous-Totaux\nPirates",null,"Total Pirates",null,"TOTAL",null,null,null,"FMB","Hors FMB","Total"]
[1,{"$f":"VLOOKUP(A8,'Numéro licences'!$A$4:$B$32,2)","v":"BRIATTE Joëlle"},"Aller-Retour",null,null,null,null,null,null,null,null,null,null,null,null,null,null,null,null,null,null,null,null,null,null,null,null,null,null,null,null,null,null,null,null,null,null,null,null,null,null,null,null,null,null,null,null,null,null,null,null,null,null,null,null,null,null,null,null,null,null,null,null,null,null,{"$f":"SUM(D8:BM8)","v":0},"Km  renseignés",{"$f":"SUM(BN8+BN9)","v":0},null,null,null,null,null,null,null,null,null,null,null,null,null,null,null,null,null,{"$f":"SUM(BQ8:CG8)","v":0},"Km  renseignés",{"$f":"SUM(CH8+CH9)","v":0},"Km  renseignés",{"$f":"SUM(BP8+CJ8)","v":0},null,1,{"$f":"VLOOKUP(CN8,A8:B188,2)","v":"BRIATTE Joëlle"},{"$f":"SUM(BP8)","v":0},{"$f":"SUM(CJ8)","v":0},{"$f":"SUM(CP8+CQ8)","v":0}]
[null,null,"Ronde",null,null,null,null,null,null,null,null,null,null,null,null,null,null,null,null,null,null,null,null,null,null,null,null,null,null,null,null,null,null,null,null,null,null,null,null,null,null,null,null,null,null,null,null,null,null,null,null,null,null,null,null,null,null,null,null,null,null,null,null,null,null,{"$f":"SUM(D9:BM9)","v":0},"Km confirmés",{"$f":"SUM(D11:BM11)","v":0},null,null,null,null,null,null,null,null,null,null,null,null,null,null,null,null,null,{"$f":"SUM(BQ9:CG9)","v":0},"Km confirmés",{"$f":"SUM(BQ11:CG11)","v":0},"Km confirmés",{"$f":"SUM(CJ9+BP9)","v":0},null,2,{"$f":"VLOOKUP(CN9,A8:B188,2)","v":"DEL FABBRO Laurence"},{"$f":"SUM(BP12)","v":200},{"$f":"SUM(CJ12)","v":0},{"$f":"SUM(CP9+CQ9)","v":200}]
[null,null,null,0,0,0,0,0,0,0,0,0,0,0,0,0,0,0,0,0,0,0,0,0,0,0,0,0,0,0,0,0,0,0,0,0,0,0,0,0,0,0,0,0,0,0,0,0,0,0,0,0,0,0,0,0,0,0,0,0,0,0,0,0,0,null,"Rondes confirmées",{"$f":"SUM(C10:BM10)","v":0},0,0,0,0,0,0,0,0,0,0,0,0,0,0,0,0,0,null,"Rondes confirmées",{"$f":"SUM(BQ10:CH10)","v":0},"Rondes confirmées",{"$f":"SUM(CJ10+BP10)","v":0},null,3,{"$f":"VLOOKUP(CN10,A8:B188,2)","v":"ERVEN France"},{"$f":"SUM(BP16)","v":252},{"$f":"SUM(CJ16)","v":265},{"$f":"SUM(CP10+CQ10)","v":517}]
[null,null,null,{"$f":"SUM((D8+D9)*D10)","v":0},0,0,0,0,0,0,0,0,0,0,0,0,0,0,0,0,0,0,0,0,0,0,0,0,0,0,0,0,0,0,0,0,0,0,0,0,0,0,0,0,0,0,0,0,0,0,0,0,0,0,0,0,0,0,0,0,0,0,{"$f":"SUM((BK8+BK9)*BK10)","v":0},0,0,null,"Rondes effectuées",{"$f":"COUNTIF(D8:BM8,\">0\")","v":0},{"$f":"SUM((BQ8+BQ9)*BQ10)","v":0},0,0,0,0,0,0,0,0,0,0,0,0,0,0,0,0,null,"Rondes Effectuées",{"$f":"COUNTIF(BQ8:CG8,\">0\")","v":0},"Rondes effectuées",{"$f":"SUM(CJ11+BP11)","v":0},null,4,{"$f":"VLOOKUP(CN11,A8:B188,2)","v":"FIEVET Nathalie"},{"$f":"SUM(BP20)","v":0},{"$f":"SUM(CJ20)","v":0},0]
[2,{"$f":"VLOOKUP(A12,'Numéro licences'!$A$4:$B$32,2)","v":"DEL FABBRO Laurence"},"Aller-Retour",null,null,null,null,null,null,null,null,null,null,null,null,null,null,null,null,null,null,null,null,null,null,null,null,null,0,null,null,null,null,null,null,null,null,null,null,null,null,null,null,null,null,null,null,null,null,null,null,null,null,null,null,null,null,null,null,null,null,null,null,null,null,{"$f":"SUM(D12:BM12)","v":0},"Km  renseignés",{"$f":"SUM(BN12+BN13)","v":200},null,null,null,null,null,null,null,null,null,null,null,null,null,null,null,null,null,{"$f":"SUM(BQ12:CG12)","v":0},"Km  renseignés",{"$f":"SUM(CH12+CH13)","v":0},"Km  renseignés",{"$f":"SUM(BP12+CJ12)","v":200},null,5,{"$f":"VLOOKUP(CN12,A8:B188,2)","v":"GIAUX Annie"},{"$f":"SUM(BP24)","v":690},{"$f":"SUM(CJ24)","v":156},846]
[null,null,"Ronde",null,null,null,null,null,null,null,null,null,null,null,null,null,null,null,null,null,null,null,null,null,null,null,null,null,200,null,null,null,null,null,null,null,null,null,null,null,null,null,null,null,null,null,null,null,null,null,null,null,null,null,null,null,null,null,null,null,null,null,null,null,null,{"$f":"SUM(D13:BM13)","v":200},"Km confirmés",{"$f":"SUM(D15:BM15)","v":0},null,null,null,null,null,null,null,null,null,null,null,null,null,null,null,null,null,{"$f":"SUM(BQ13:CG13)","v":0},"Km confirmés",{"$f":"SUM(BQ15:CG15)","v":0},"Km confirmés",{"$f":"SUM(CJ13+BP13)","v":0},null,6,{"$f":"VLOOKUP(CN13,A8:B188,2)","v":"GOFFIN Guillaume"},{"$f":"SUM(BP28)","v":0},{"$f":"SUM(CJ28)","v":0},0]
[null,null,null,0,0,0,0,0,0,0,0,0,0,0,0,0,0,0,0,0,0,0,0,0,0,0,0,0,0,0,0,0,0,0,0,0,0,0,0,0,0,0,0,0,0,0,0,0,0,0,0,0,0,0,0,0,0,0,0,0,0,0,0,0,0,null,"Rondes confirmées",{"$f":"SUM(C14:BM14)","v":0},0,0,0,0,0,0,0,0,0,0,0,0,0,0,0,0,0,null,"Rondes confirmées",{"$f":"SUM(BQ14:CH14)","v":0},"Rondes confirmées",{"$f":"SUM(CJ14+BP14)","v":0},null,7,{"$f":"VLOOKUP(CN14,A8:B188,2)","v":"GREGORICS Kathy"},{"$f":"SUM(BP32)","v":200},{"$f":"SUM(CJ32)","v":0},200]
[null,null,null,{"$f":"SUM((D12+D13)*D14)","v":0},0,0,0,0,0,0,0,0,0,0,0,0,0,0,0,0,0,0,0,0,0,0,0,0,0,0,0,0,0,0,0,0,0,0,0,0,0,0,0,0,0,0,0,0,0,0,0,0,0,0,0,0,0,0,0,0,0,0,{"$f":"SUM((BK12+BK13)*BK14)","v":0},0,0,null,"Rondes effectuées",{"$f":"COUNTIF(D12:BM12,\">0\")","v":0},{"$f":"SUM((BQ12+BQ13)*BQ14)","v":0},0,0,0,0,0,0,0,0,0,0,0,0,0,0,0,0,null,"Rondes Effectuées",{"$f":"COUNTIF(BQ12:CG12,\">0\")","v":0},"Rondes effectuées",{"$f":"SUM(CJ15+BP15)","v":0},null,8,{"$f":"VLOOKUP(CN15,A8:B188,2)","v":"GRIGNET Audrey"},{"$f":"SUM(BP36)","v":0},{"$f":"SUM(CJ36)","v":0},0]
[3,{"$f":"VLOOKUP(A16,'Numéro licences'!$A$4:$B$32,2)","v":"ERVEN France"},"Aller-Retour",null,null,null,null,null,null,null,null,null,null,null,null,null,null,null,null,null,null,null,null,null,null,null,null,null,null,null,null,null,null,null,null,null,52,null,null,null,null,null,null,null,null,null,null,null,null,null,null,null,null,null,null,null,null,null,null,null,null,null,null,null,null,{"$f":"SUM(D16:BM16)","v":52},"Km  renseignés",{"$f":"SUM(BN16+BN17)","v":252},null,null,79,null,null,null,null,null,null,null,null,null,null,null,null,null,null,{"$f":"SUM(BQ16:CG16)","v":79},"Km  renseignés",{"$f":"SUM(CH16+CH17)","v":265},"Km  renseignés",{"$f":"SUM(BP16+CJ16)","v":517},null,9,{"$f":"VLOOKUP(CN16,A8:B188,2)","v":"LAMBILLON Anne"},{"$f":"SUM(BP40)","v":200},{"$f":"SUM(CJ40)","v":0},200]
[null,null,"Ronde",null,null,null,null,null,null,null,null,null,null,null,null,null,null,null,null,null,null,null,null,null,null,null,null,null,null,null,null,null,null,null,null,null,200,null,null,null,null,null,null,null,null,null,null,null,null,null,null,null,null,null,null,null,null,null,null,null,null,null,null,null,null,{"$f":"SUM(D17:BM17)","v":200},"Km confirmés",{"$f":"SUM(D19:BM19)","v":0},null,null,186,null,null,null,null,null,null,null,null,null,null,null,null,null,null,{"$f":"SUM(BQ17:CG17)","v":186},"Km confirmés",{"$f":"SUM(BQ19:CG19)","v":0},"Km confirmés",{"$f":"SUM(CJ17+BP17)","v":0},null,10,{"$f":"VLOOKUP(CN17,A8:B188,2)","v":"LAMIROY Anne"},{"$f":"SUM(BP44)","v":0},{"$f":"SUM(CJ44)","v":0},0]
[null,null,null,0,0,0,0,0,0,0,0,0,0,0,0,0,0,0,0,0,0,0,0,0,0,0,0,0,0,0,0,0,0,0,0,0,0,0,0,0,0,0,0,0,0,0,0,0,0,0,0,0,0,0,0,0,0,0,0,0,0,0,0,0,0,null,"Rondes confirmées",{"$f":"SUM(C18:BM18)","v":0},0,0,0,0,0,0,0,0,0,0,0,0,0,0,0,0,0,null,"Rondes confirmées",{"$f":"SUM(BQ18:CH18)","v":0},"Rondes confirmées",{"$f":"SUM(CJ18+BP18)","v":0},null,11,{"$f":"VLOOKUP(CN18,A8:B188,2)","v":"LEROY Laure"},{"$f":"SUM(BP48)","v":112},{"$f":"SUM(CJ48)","v":0},112]
[null,null,null,{"$f":"SUM((D16+D17)*D18)","v":0},0,0,0,0,0,0,0,0,0,0,0,0,0,0,0,0,0,0,0,0,0,0,0,0,0,0,0,0,0,0,0,0,0,0,0,0,0,0,0,0,0,0,0,0,0,0,0,0,0,0,0,0,0,0,0,0,0,0,{"$f":"SUM((BK16+BK17)*BK18)","v":0},0,0,null,"Rondes effectuées",{"$f":"COUNTIF(D16:BM16,\">0\")","v":1},{"$f":"SUM((BQ16+BQ17)*BQ18)","v":0},0,0,0,0,0,0,0,0,0,0,0,0,0,0,0,0,null,"Rondes Effectuées",{"$f":"COUNTIF(BQ16:CG16,\">0\")","v":1},"Rondes effectuées",{"$f":"SUM(CJ19+BP19)","v":2},null,12,{"$f":"VLOOKUP(CN19,A8:B188,2)","v":"NICLOUX Christine"},{"$f":"SUM(BP52)","v":0},{"$f":"SUM(CJ52)","v":0},0]
[4,{"$f":"VLOOKUP(A20,'Numéro licences'!$A$4:$B$32,2)","v":"FIEVET Nathalie"},"Aller-Retour",null,null,null,null,null,null,null,null,null,null,null,null,null,null,null,null,null,null,null,null,null,null,null,null,null,null,null,null,null,null,null,null,null,null,null,null,null,null,null,null,null,null,null,null,null,null,null,null,null,null,null,null,null,null,null,null,null,null,null,null,null,null,{"$f":"SUM(D20:BM20)","v":0},"Km  renseignés",{"$f":"SUM(BN20+BN21)","v":0},null,null,null,null,null,null,null,null,null,null,null,null,null,null,null,null,null,{"$f":"SUM(BQ20:CG20)","v":0},"Km  renseignés",{"$f":"SUM(CH20+CH21)","v":0},"Km  renseignés",{"$f":"SUM(BP20+CJ20)","v":0},null,13,{"$f":"VLOOKUP(CN20,A8:B188,2)","v":"PONT Patricia"},{"$f":"SUM(BP56)","v":7515},{"$f":"SUM(CJ56)","v":1003},8518]
[null,null,"Ronde",null,null,null,null,null,null,null,null,null,null,null,null,null,null,null,null,null,null,null,null,null,null,null,null,null,null,null,null,null,null,null,null,null,null,null,null,null,null,null,null,null,null,null,null,null,null,null,null,null,null,null,null,null,null,null,null,null,null,null,null,null,null,{"$f":"SUM(D21:BM21)","v":0},"Km confirmés",{"$f":"SUM(D23:BM23)","v":0},null,null,null,null,null,null,null,null,null,null,null,null,null,null,null,null,null,{"$f":"SUM(BQ21:CG21)","v":0},"Km confirmés",{"$f":"SUM(BQ23:CG23)","v":0},"Km confirmés",{"$f":"SUM(CJ21+BP21)","v":0},null,14,{"$f":"VLOOKUP(CN21,A8:B188,2)","v":"THOMAS Isabelle"},{"$f":"SUM(BP60)","v":0},{"$f":"SUM(CJ60)","v":0},0]
[null,null,null,0,0,0,0,0,0,0,0,0,0,0,0,0,0,0,0,0,0,0,0,0,0,0,0,0,0,0,0,0,0,0,0,0,0,0,0,0,0,0,0,0,0,0,0,0,0,0,0,0,0,0,0,0,0,0,0,0,0,0,0,0,0,null,"Rondes confirmées",{"$f":"SUM(C22:BM22)","v":0},0,0,0,0,0,0,0,0,0,0,0,0,0,0,0,0,0,null,"Rondes confirmées",{"$f":"SUM(BQ22:CH22)","v":0},"Rondes confirmées",{"$f":"SUM(CJ22+BP22)","v":0},null,15,{"$f":"VLOOKUP(CN22,A8:B188,2)","v":0},{"$f":"SUM(BP64)","v":0},{"$f":"SUM(CJ64)","v":0},0]
[null,null,null,{"$f":"SUM((D20+D21)*D22)","v":0},0,0,0,0,0,0,0,0,0,0,0,0,0,0,0,0,0,0,0,0,0,0,0,0,0,0,0,0,0,0,0,0,0,0,0,0,0,0,0,0,0,0,0,0,0,0,0,0,0,0,0,0,0,0,0,0,0,0,{"$f":"SUM((BK20+BK21)*BK22)","v":0},0,0,null,"Rondes effectuées",{"$f":"COUNTIF(D20:BM20,\">0\")","v":0},{"$f":"SUM((BQ20+BQ21)*BQ22)","v":0},0,0,0,0,0,0,0,0,0,0,0,0,0,0,0,0,null,"Rondes Effectuées",{"$f":"COUNTIF(BQ20:CG20,\">0\")","v":0},"Rondes effectuées",{"$f":"SUM(CJ23+BP23)","v":0},null,16,{"$f":"VLOOKUP(CN23,A8:B188,2)","v":0},{"$f":"SUM(BP68)","v":0},{"$f":"SUM(CJ68)","v":0},0]
[5,{"$f":"VLOOKUP(A24,'Numéro licences'!$A$4:$B$32,2)","v":"GIAUX Annie"},"Aller-Retour",null,null,null,null,null,null,null,null,null,null,null,null,null,null,null,null,null,null,null,null,null,null,null,null,null,null,null,null,null,null,null,null,null,null,null,null,null,null,null,null,null,null,null,null,null,null,null,null,null,null,124,null,null,null,null,null,166,null,null,null,null,null,{"$f":"SUM(D24:BM24)","v":290},"Km  renseignés",{"$f":"SUM(BN24+BN25)","v":690},null,null,null,36,null,null,null,null,null,null,null,null,null,null,null,null,null,{"$f":"SUM(BQ24:CG24)","v":36},"Km  renseignés",{"$f":"SUM(CH24+CH25)","v":156},"Km  renseignés",{"$f":"SUM(BP24+CJ24)","v":846},null,17,{"$f":"VLOOKUP(CN24,A8:B188,2)","v":0},{"$f":"SUM(BP72)","v":0},{"$f":"SUM(CJ72)","v":0},0]
[null,null,"Ronde",null,null,null,null,null,null,null,null,null,null,null,null,null,null,null,null,null,null,null,null,null,null,null,null,null,null,null,null,null,null,null,null,null,null,null,null,null,null,null,null,null,null,null,null,null,null,null,null,null,null,180,null,null,null,null,null,220,null,null,null,null,null,{"$f":"SUM(D25:BM25)","v":400},"Km confirmés",{"$f":"SUM(D27:BM27)","v":0},null,null,null,120,null,null,null,null,null,null,null,null,null,null,null,null,null,{"$f":"SUM(BQ25:CG25)","v":120},"Km confirmés",{"$f":"SUM(BQ27:CG27)","v":0},"Km confirmés",{"$f":"SUM(CJ25+BP25)","v":0},null,18,{"$f":"VLOOKUP(CN25,A8:B188,2)","v":0},{"$f":"SUM(BP76)","v":0},{"$f":"SUM(CJ76)","v":0},0]
[null,null,null,0,0,0,0,0,0,0,0,0,0,0,0,0,0,0,0,0,0,0,0,0,0,0,0,0,0,0,0,0,0,0,0,0,0,0,0,0,0,0,0,0,0,0,0,0,0,0,0,0,0,0,0,0,0,0,0,0,0,0,0,0,0,null,"Rondes confirmées",{"$f":"SUM(C26:BM26)","v":0},0,0,0,0,0,0,0,0,0,0,0,0,0,0,0,0,0,null,"Rondes confirmées",{"$f":"SUM(BQ26:CH26)","v":0},"Rondes confirmées",{"$f":"SUM(CJ26+BP26)","v":0},null,19,{"$f":"VLOOKUP(CN26,A8:B188,2)","v":0},{"$f":"SUM(BP80)","v":0},{"$f":"SUM(CJ80)","v":0},0]
[null,null,null,{"$f":"SUM((D24+D25)*D26)","v":0},0,0,0,0,0,0,0,0,0,0,0,0,0,0,0,0,0,0,0,0,0,0,0,0,0,0,0,0,0,0,0,0,0,0,0,0,0,0,0,0,0,0,0,0,0,0,0,0,0,0,0,0,0,0,0,0,0,0,{"$f":"SUM((BK24+BK25)*BK26)","v":0},0,0,null,"Rondes effectuées",{"$f":"COUNTIF(D24:BM24,\">0\")","v":2},{"$f":"SUM((BQ24+BQ25)*BQ26)","v":0},0,0,0,0,0,0,0,0,0,0,0,0,0,0,0,0,null,"Rondes Effectuées",{"$f":"COUNTIF(BQ24:CG24,\">0\")","v":1},"Rondes effectuées",{"$f":"SUM(CJ27+BP27)","v":3},null,20,{"$f":"VLOOKUP(CN27,A8:B188,2)","v":0},{"$f":"SUM(BP84)","v":0},{"$f":"SUM(CJ84)","v":0},0]
[6,{"$f":"VLOOKUP(A28,'Numéro licences'!$A$4:$B$32,2)","v":"GOFFIN Guillaume"},"Aller-Retour",null,null,null,null,null,null,null,null,null,null,null,null,null,null,null,null,null,null,null,null,null,null,null,null,null,null,null,null,null,null,null,null,null,null,null,null,null,null,null,null,null,null,null,null,null,null,null,null,null,null,null,null,null,null,null,null,null,null,null,null,null,null,{"$f":"SUM(D28:BM28)","v":0},"Km  renseignés",{"$f":"SUM(BN28+BN29)","v":0},null,null,null,null,null,null,null,null,null,null,null,null,null,null,null,null,null,{"$f":"SUM(BQ28:CG28)","v":0},"Km  renseignés",{"$f":"SUM(CH28+CH29)","v":0},"Km  renseignés",{"$f":"SUM(BP28+CJ28)","v":0},null,21,{"$f":"VLOOKUP(CN28,A8:B188,2)","v":0},{"$f":"SUM(BP88)","v":0},{"$f":"SUM(CJ88)","v":0},0]
[null,null,"Ronde",null,null,null,null,null,null,null,null,null,null,null,null,null,null,null,null,null,null,null,null,null,null,null,null,null,null,null,null,null,null,null,null,null,null,null,null,null,null,null,null,null,null,null,null,null,null,null,null,null,null,null,null,null,null,null,null,null,null,null,null,null,null,{"$f":"SUM(D29:BM29)","v":0},"Km confirmés",{"$f":"SUM(D31:BM31)","v":0},null,null,null,null,null,null,null,null,null,null,null,null,null,null,null,null,null,{"$f":"SUM(BQ29:CG29)","v":0},"Km confirmés",{"$f":"SUM(BQ31:CG31)","v":0},"Km confirmés",{"$f":"SUM(CJ29+BP29)","v":0},null,22,{"$f":"VLOOKUP(CN29,A8:B188,2)","v":0},{"$f":"SUM(BP92)","v":0},{"$f":"SUM(CJ92)","v":0},0]
[null,null,null,0,0,0,0,0,0,0,0,0,0,0,0,0,0,0,0,0,0,0,0,0,0,0,0,0,0,0,0,0,0,0,0,0,0,0,0,0,0,0,0,0,0,0,0,0,0,0,0,0,0,0,0,0,0,0,0,0,0,0,0,0,0,null,"Rondes confirmées",{"$f":"SUM(C30:BM30)","v":0},0,0,0,0,0,0,0,0,0,0,0,0,0,0,0,0,0,null,"Rondes confirmées",{"$f":"SUM(BQ30:CH30)","v":0},"Rondes confirmées",{"$f":"SUM(CJ30+BP30)","v":0},null,23,{"$f":"VLOOKUP(CN30,A8:B188,2)","v":0},{"$f":"SUM(BP96)","v":0},{"$f":"SUM(CJ96)","v":0},0]
[null,null,null,{"$f":"SUM((D28+D29)*D30)","v":0},0,0,0,0,0,0,0,0,0,0,0,0,0,0,0,0,0,0,0,0,0,0,0,0,0,0,0,0,0,0,0,0,0,0,0,0,0,0,0,0,0,0,0,0,0,0,0,0,0,0,0,0,0,0,0,0,0,0,{"$f":"SUM((BK28+BK29)*BK30)","v":0},0,0,null,"Rondes effectuées",{"$f":"COUNTIF(D28:BM28,\">0\")","v":0},{"$f":"SUM((BQ28+BQ29)*BQ30)","v":0},0,0,0,0,0,0,0,0,0,0,0,0,0,0,0,0,null,"Rondes Effectuées",{"$f":"COUNTIF(BQ28:CG28,\">0\")","v":0},"Rondes effectuées",{"$f":"SUM(CJ31+BP31)","v":0},null,24,{"$f":"VLOOKUP(CN31,A8:B188,2)","v":0},{"$f":"SUM(BP100)","v":0},{"$f":"SUM(CJ100)","v":0},0]
[7,{"$f":"VLOOKUP(A32,'Numéro licences'!$A$4:$B$32,2)","v":"GREGORICS Kathy"},"Aller-Retour",null,null,null,null,null,null,null,null,null,null,null,null,null,null,null,null,null,null,null,null,null,null,null,null,null,0,null,null,null,null,null,null,null,null,null,null,null,null,null,null,null,null,null,null,null,null,null,null,null,null,null,null,null,null,null,null,null,null,null,null,null,null,{"$f":"SUM(D32:BM32)","v":0},"Km  renseignés",{"$f":"SUM(BN32+BN33)","v":200},null,null,null,null,null,null,null,null,null,null,null,null,null,null,null,null,null,{"$f":"SUM(BQ32:CG32)","v":0},"Km  renseignés",{"$f":"SUM(CH32+CH33)","v":0},"Km  renseignés",{"$f":"SUM(BP32+CJ32)","v":200},null,25,{"$f":"VLOOKUP(CN32,A8:B188,2)","v":0},{"$f":"SUM(BP104)","v":0},{"$f":"SUM(CJ104)","v":0},0]
[null,null,"Ronde",null,null,null,null,null,null,null,null,null,null,null,null,null,null,null,null,null,null,null,null,null,null,null,null,null,200,null,null,null,null,null,null,null,null,null,null,null,null,null,null,null,null,null,null,null,null,null,null,null,null,null,null,null,null,null,null,null,null,null,null,null,null,{"$f":"SUM(D33:BM33)","v":200},"Km confirmés",{"$f":"SUM(D35:BM35)","v":0},null,null,null,null,null,null,null,null,null,null,null,null,null,null,null,null,null,{"$f":"SUM(BQ33:CG33)","v":0},"Km confirmés",{"$f":"SUM(BQ35:CG35)","v":0},"Km confirmés",{"$f":"SUM(CJ33+BP33)","v":0},null,26,{"$f":"VLOOKUP(CN33,A8:B188,2)","v":0},{"$f":"SUM(BP108)","v":0},{"$f":"SUM(CJ108)","v":0},0]
[null,null,null,0,0,0,0,0,0,0,0,0,0,0,0,0,0,0,0,0,0,0,0,0,0,0,0,0,0,0,0,0,0,0,0,0,0,0,0,0,0,0,0,0,0,0,0,0,0,0,0,0,0,0,0,0,0,0,0,0,0,0,0,0,0,null,"Rondes confirmées",{"$f":"SUM(C34:BM34)","v":0},0,0,0,0,0,0,0,0,0,0,0,0,0,0,0,0,0,null,"Rondes confirmées",{"$f":"SUM(BQ34:CH34)","v":0},"Rondes confirmées",{"$f":"SUM(CJ34+BP34)","v":0},null,27,{"$f":"VLOOKUP(CN34,A8:B188,2)","v":0},{"$f":"SUM(BP112)","v":0},{"$f":"SUM(CJ112)","v":0},0]
[null,null,null,{"$f":"SUM((D32+D33)*D34)","v":0},0,0,0,0,0,0,0,0,0,0,0,0,0,0,0,0,0,0,0,0,0,0,0,0,0,0,0,0,0,0,0,0,0,0,0,0,0,0,0,0,0,0,0,0,0,0,0,0,0,0,0,0,0,0,0,0,0,0,{"$f":"SUM((BK32+BK33)*BK34)","v":0},0,0,null,"Rondes effectuées",{"$f":"COUNTIF(D32:BM32,\">0\")","v":0},{"$f":"SUM((BQ32+BQ33)*BQ34)","v":0},0,0,0,0,0,0,0,0,0,0,0,0,0,0,0,0,null,"Rondes Effectuées",{"$f":"COUNTIF(BQ32:CG32,\">0\")","v":0},"Rondes effectuées",{"$f":"SUM(CJ35+BP35)","v":0},null,28,{"$f":"VLOOKUP(CN35,A8:B188,2)","v":0},{"$f":"SUM(BP116)","v":0},{"$f":"SUM(CJ116)","v":0},0]
[8,{"$f":"VLOOKUP(A36,'Numéro licences'!$A$4:$B$32,2)","v":"GRIGNET Audrey"},"Aller-Retour",null,null,null,null,null,null,null,null,null,null,null,null,null,null,null,null,null,null,null,null,null,null,null,null,null,null,null,null,null,null,null,null,null,null,null,null,null,null,null,null,null,null,null,null,null,null,null,null,null,null,null,null,null,null,null,null,null,null,null,null,null,null,{"$f":"SUM(D36:BM36)","v":0},"Km  renseignés",{"$f":"SUM(BN36+BN37)","v":0},null,null,null,null,null,null,null,null,null,null,null,null,null,null,null,null,null,{"$f":"SUM(BQ36:CG36)","v":0},"Km  renseignés",{"$f":"SUM(CH36+CH37)","v":0},"Km  renseignés",{"$f":"SUM(BP36+CJ36)","v":0},null,29,{"$f":"VLOOKUP(CN36,A8:B188,2)","v":0},{"$f":"SUM(BP120)","v":0},{"$f":"SUM(CJ120)","v":0},0]
[null,null,"Ronde",null,null,null,null,null,null,null,null,null,null,null,null,null,null,null,null,null,null,null,null,null,null,null,null,null,null,null,null,null,null,null,null,null,null,null,null,null,null,null,null,null,null,null,null,null,null,null,null,null,null,null,null,null,null,null,null,null,null,null,null,null,null,{"$f":"SUM(D37:BM37)","v":0},"Km confirmés",{"$f":"SUM(D39:BM39)","v":0},null,null,null,null,null,null,null,null,null,null,null,null,null,null,null,null,null,{"$f":"SUM(BQ37:CG37)","v":0},"Km confirmés",{"$f":"SUM(BQ39:CG39)","v":0},"Km confirmés",{"$f":"SUM(CJ37+BP37)","v":0}]
[null,null,null,0,0,0,0,0,0,0,0,0,0,0,0,0,0,0,0,0,0,0,0,0,0,0,0,0,0,0,0,0,0,0,0,0,0,0,0,0,0,0,0,0,0,0,0,0,0,0,0,0,0,0,0,0,0,0,0,0,0,0,0,0,0,null,"Rondes confirmées",{"$f":"SUM(C38:BM38)","v":0},0,0,0,0,0,0,0,0,0,0,0,0,0,0,0,0,0,null,"Rondes confirmées",{"$f":"SUM(BQ38:CH38)","v":0},"Rondes confirmées",{"$f":"SUM(CJ38+BP38)","v":0}]
[null,null,null,{"$f":"SUM((D36+D37)*D38)","v":0},0,0,0,0,0,0,0,0,0,0,0,0,0,0,0,0,0,0,0,0,0,0,0,0,0,0,0,0,0,0,0,0,0,0,0,0,0,0,0,0,0,0,0,0,0,0,0,0,0,0,0,0,0,0,0,0,0,0,{"$f":"SUM((BK36+BK37)*BK38)","v":0},0,0,null,"Rondes effectuées",{"$f":"COUNTIF(D36:BM36,\">0\")","v":0},{"$f":"SUM((BQ36+BQ37)*BQ38)","v":0},0,0,0,0,0,0,0,0,0,0,0,0,0,0,0,0,null,"Rondes Effectuées",{"$f":"COUNTIF(BQ36:CG36,\">0\")","v":0},"Rondes effectuées",{"$f":"SUM(CJ39+BP39)","v":0}]
[9,{"$f":"VLOOKUP(A40,'Numéro licences'!$A$4:$B$32,2)","v":"LAMBILLON Anne"},"Aller-Retour",null,null,null,null,null,null,null,null,null,null,null,null,null,null,null,null,null,null,null,null,null,null,null,null,null,0,null,null,null,null,null,null,null,null,null,null,null,null,null,null,null,null,null,null,null,null,null,null,null,null,null,null,null,null,null,null,null,null,null,null,null,null,{"$f":"SUM(D40:BM40)","v":0},"Km  renseignés",{"$f":"SUM(BN40+BN41)","v":200},null,null,null,null,null,null,null,null,null,null,null,null,null,null,null,null,null,{"$f":"SUM(BQ40:CG40)","v":0},"Km  renseignés",{"$f":"SUM(CH40+CH41)","v":0},"Km  renseignés",{"$f":"SUM(BP40+CJ40)","v":200}]
[null,null,"Ronde",null,null,null,null,null,null,null,null,null,null,null,null,null,null,null,null,null,null,null,null,null,null,null,null,null,200,null,null,null,null,null,null,null,null,null,null,null,null,null,null,null,null,null,null,null,null,null,null,null,null,null,null,null,null,null,null,null,null,null,null,null,null,{"$f":"SUM(D41:BM41)","v":200},"Km confirmés",{"$f":"SUM(D43:BM43)","v":0},null,null,null,null,null,null,null,null,null,null,null,null,null,null,null,null,null,{"$f":"SUM(BQ41:CG41)","v":0},"Km confirmés",{"$f":"SUM(BQ43:CG43)","v":0},"Km confirmés",{"$f":"SUM(CJ41+BP41)","v":0}]
[null,null,null,0,0,0,0,0,0,0,0,0,0,0,0,0,0,0,0,0,0,0,0,0,0,0,0,0,0,0,0,0,0,0,0,0,0,0,0,0,0,0,0,0,0,0,0,0,0,0,0,0,0,0,0,0,0,0,0,0,0,0,0,0,0,null,"Rondes confirmées",{"$f":"SUM(C42:BM42)","v":0},0,0,0,0,0,0,0,0,0,0,0,0,0,0,0,0,0,null,"Rondes confirmées",{"$f":"SUM(BQ42:CH42)","v":0},"Rondes confirmées",{"$f":"SUM(CJ42+BP42)","v":0},null,null,null,{"$f":"SUM(CP9:CP36)","v":9169},{"$f":"SUM(CQ9:CQ36)","v":1424},{"$f":"SUM(CR8:CR36)","v":10593}]
[null,null,null,{"$f":"SUM((D40+D41)*D42)","v":0},0,0,0,0,0,0,0,0,0,0,0,0,0,0,0,0,0,0,0,0,0,0,0,0,0,0,0,0,0,0,0,0,0,0,0,0,0,0,0,0,0,0,0,0,0,0,0,0,0,0,0,0,0,0,0,0,0,0,{"$f":"SUM((BK40+BK41)*BK42)","v":0},0,0,null,"Rondes effectuées",{"$f":"COUNTIF(D40:BM40,\">0\")","v":0},{"$f":"SUM((BQ40+BQ41)*BQ42)","v":0},0,0,0,0,0,0,0,0,0,0,0,0,0,0,0,0,null,"Rondes Effectuées",{"$f":"COUNTIF(BQ40:CG40,\">0\")","v":0},"Rondes effectuées",{"$f":"SUM(CJ43+BP43)","v":0},null,null,null,{"$f":"SUM(CP42/CR42)","v":0.86557160388936094},{"$f":"SUM(CQ42/CR42)","v":0.13442839611063911}]
[10,{"$f":"VLOOKUP(A44,'Numéro licences'!$A$4:$B$32,2)","v":"LAMIROY Anne"},"Aller-Retour",null,null,null,null,null,null,null,null,null,null,null,null,null,null,null,null,null,null,null,null,null,null,null,null,null,null,null,null,null,null,null,null,null,null,null,null,null,null,null,null,null,null,null,null,null,null,null,null,null,null,null,null,null,null,null,null,null,null,null,null,null,null,{"$f":"SUM(D44:BM44)","v":0},"Km  renseignés",{"$f":"SUM(BN44+BN45)","v":0},null,null,null,null,null,null,null,null,null,null,null,null,null,null,null,null,null,{"$f":"SUM(BQ44:CG44)","v":0},"Km  renseignés",{"$f":"SUM(CH44+CH45)","v":0},"Km  renseignés",{"$f":"SUM(BP44+CJ44)","v":0},null,null,null,"FMB","Hors FMB"]
[null,null,"Ronde",null,null,null,null,null,null,null,null,null,null,null,null,null,null,null,null,null,null,null,null,null,null,null,null,null,null,null,null,null,null,null,null,null,null,null,null,null,null,null,null,null,null,null,null,null,null,null,null,null,null,null,null,null,null,null,null,null,null,null,null,null,null,{"$f":"SUM(D45:BM45)","v":0},"Km confirmés",{"$f":"SUM(D47:BM47)","v":0},null,null,null,null,null,null,null,null,null,null,null,null,null,null,null,null,null,{"$f":"SUM(BQ45:CG45)","v":0},"Km confirmés",{"$f":"SUM(BQ47:CG47)","v":0},"Km confirmés",{"$f":"SUM(CJ45+BP45)","v":0}]
[null,null,null,0,0,0,0,0,0,0,0,0,0,0,0,0,0,0,0,0,0,0,0,0,0,0,0,0,0,0,0,0,0,0,0,0,0,0,0,0,0,0,0,0,0,0,0,0,0,0,0,0,0,0,0,0,0,0,0,0,0,0,0,0,0,null,"Rondes confirmées",{"$f":"SUM(C46:BM46)","v":0},0,0,0,0,0,0,0,0,0,0,0,0,0,0,0,0,0,null,"Rondes confirmées",{"$f":"SUM(BQ46:CH46)","v":0},"Rondes confirmées",{"$f":"SUM(CJ46+BP46)","v":0}]
[null,null,null,{"$f":"SUM((D44+D45)*D46)","v":0},0,0,0,0,0,0,0,0,0,0,0,0,0,0,0,0,0,0,0,0,0,0,0,0,0,0,0,0,0,0,0,0,0,0,0,0,0,0,0,0,0,0,0,0,0,0,0,0,0,0,0,0,0,0,0,0,0,0,{"$f":"SUM((BK44+BK45)*BK46)","v":0},0,0,null,"Rondes effectuées",{"$f":"COUNTIF(D44:BM44,\">0\")","v":0},{"$f":"SUM((BQ44+BQ45)*BQ46)","v":0},0,0,0,0,0,0,0,0,0,0,0,0,0,0,0,0,null,"Rondes Effectuées",{"$f":"COUNTIF(BQ44:CG44,\">0\")","v":0},"Rondes effectuées",{"$f":"SUM(CJ47+BP47)","v":0}]
[11,{"$f":"VLOOKUP(A48,'Numéro licences'!$A$4:$B$32,2)","v":"LEROY Laure"},"Aller-Retour",null,null,null,null,null,null,null,null,null,null,null,null,null,null,null,null,null,null,null,null,null,null,null,null,null,null,null,null,null,60,null,null,null,52,null,null,null,null,null,null,null,null,null,null,null,null,null,null,null,null,null,null,null,null,null,null,null,null,null,null,null,null,{"$f":"SUM(D48:BM48)","v":112},"Km  renseignés",{"$f":"SUM(BN48+BN49)","v":112},null,null,null,null,null,null,null,null,null,null,null,null,null,null,null,null,null,{"$f":"SUM(BQ48:CG48)","v":0},"Km  renseignés",{"$f":"SUM(CH48+CH49)","v":0},"Km  renseignés",{"$f":"SUM(BP48+CJ48)","v":112}]
[null,null,"Ronde",null,null,null,null,null,null,null,null,null,null,null,null,null,null,null,null,null,null,null,null,null,null,null,null,null,null,null,null,null,0,null,null,null,0,null,null,null,null,null,null,null,null,null,null,null,null,null,null,null,null,null,null,null,null,null,null,null,null,null,null,null,null,{"$f":"SUM(D49:BM49)","v":0},"Km confirmés",{"$f":"SUM(D51:BM51)","v":0},null,null,null,null,null,null,null,null,null,null,null,null,null,null,null,null,null,{"$f":"SUM(BQ49:CG49)","v":0},"Km confirmés",{"$f":"SUM(BQ51:CG51)","v":0},"Km confirmés",{"$f":"SUM(CJ49+BP49)","v":0}]
[null,null,null,0,0,0,0,0,0,0,0,0,0,0,0,0,0,0,0,0,0,0,0,0,0,0,0,0,0,0,0,0,0,0,0,0,0,0,0,0,0,0,0,0,0,0,0,0,0,0,0,0,0,0,0,0,0,0,0,0,0,0,0,0,0,null,"Rondes confirmées",{"$f":"SUM(C50:BM50)","v":0},0,0,0,0,0,0,0,0,0,0,0,0,0,0,0,0,0,null,"Rondes confirmées",{"$f":"SUM(BQ50:CH50)","v":0},"Rondes confirmées",{"$f":"SUM(CJ50+BP50)","v":0}]
[null,null,null,{"$f":"SUM((D48+D49)*D50)","v":0},0,0,0,0,0,0,0,0,0,0,0,0,0,0,0,0,0,0,0,0,0,0,0,0,0,0,0,0,0,0,0,0,0,0,0,0,0,0,0,0,0,0,0,0,0,0,0,0,0,0,0,0,0,0,0,0,0,0,{"$f":"SUM((BK48+BK49)*BK50)","v":0},0,0,null,"Rondes effectuées",{"$f":"COUNTIF(D48:BM48,\">0\")","v":2},{"$f":"SUM((BQ48+BQ49)*BQ50)","v":0},0,0,0,0,0,0,0,0,0,0,0,0,0,0,0,0,null,"Rondes Effectuées",{"$f":"COUNTIF(BQ48:CG48,\">0\")","v":0},"Rondes effectuées",{"$f":"SUM(CJ51+BP51)","v":2}]
[12,{"$f":"VLOOKUP(A52,'Numéro licences'!$A$4:$B$32,2)","v":"NICLOUX Christine"},"Aller-Retour",null,null,null,null,null,null,null,null,null,null,null,null,null,null,null,null,null,null,null,null,null,null,null,null,null,null,null,null,null,null,null,null,null,null,null,null,null,null,null,null,null,null,null,null,null,null,null,null,null,null,null,null,null,null,null,null,null,null,null,null,null,null,{"$f":"SUM(D52:BM52)","v":0},"Km  renseignés",{"$f":"SUM(BN52+BN53)","v":0},null,null,null,null,null,null,null,null,null,null,null,null,null,null,null,null,null,{"$f":"SUM(BQ52:CG52)","v":0},"Km  renseignés",{"$f":"SUM(CH52+CH53)","v":0},"Km  renseignés",{"$f":"SUM(BP52+CJ52)","v":0}]
[null,null,"Ronde",null,null,null,null,null,null,null,null,null,null,null,null,null,null,null,null,null,null,null,null,null,null,null,null,null,null,null,null,null,null,null,null,null,null,null,null,null,null,null,null,null,null,null,null,null,null,null,null,null,null,null,null,null,null,null,null,null,null,null,null,null,null,{"$f":"SUM(D53:BM53)","v":0},"Km confirmés",{"$f":"SUM(D55:BM55)","v":0},null,null,null,null,null,null,null,null,null,null,null,null,null,null,null,null,null,{"$f":"SUM(BQ53:CG53)","v":0},"Km confirmés",{"$f":"SUM(BQ55:CG55)","v":0},"Km confirmés",{"$f":"SUM(CJ53+BP53)","v":0}]
[null,null,null,0,0,0,0,0,0,0,0,0,0,0,0,0,0,0,0,0,0,0,0,0,0,0,0,0,0,0,0,0,0,0,0,0,0,0,0,0,0,0,0,0,0,0,0,0,0,0,0,0,0,0,0,0,0,0,0,0,0,0,0,0,0,null,"Rondes confirmées",0,0,0,0,0,0,0,0,0,0,0,0,0,0,0,0,0,0,null,"Rondes confirmées",{"$f":"SUM(BQ54:CH54)","v":0},"Rondes confirmées",{"$f":"SUM(CJ54+BP54)","v":0}]
[null,null,null,{"$f":"SUM((D52+D53)*D54)","v":0},0,0,0,0,0,0,0,0,0,0,0,0,0,0,0,0,0,0,0,0,0,0,0,0,0,0,0,0,0,0,0,0,0,0,0,0,0,0,0,0,0,0,0,0,0,0,0,0,0,0,0,0,0,0,0,0,0,0,{"$f":"SUM((BK52+BK53)*BK54)","v":0},0,0,null,"Rondes effectuées",{"$f":"COUNTIF(D52:BM52,\">0\")","v":0},{"$f":"SUM((BQ52+BQ53)*BQ54)","v":0},0,0,0,0,0,0,0,0,0,0,0,0,0,0,0,0,null,"Rondes Effectuées",{"$f":"COUNTIF(BQ52:CG52,\">0\")","v":0},"Rondes effectuées",{"$f":"SUM(CJ55+BP55)","v":0}]
[13,{"$f":"VLOOKUP(A56,'Numéro licences'!$A$4:$B$32,2)","v":"PONT Patricia"},"Aller-Retour",null,null,null,null,null,null,null,null,null,null,null,null,null,null,null,null,null,null,124,null,124,null,38,null,null,0,null,null,148,60,140,null,null,52,344,162,null,null,176,null,null,null,380,null,null,186,null,null,60,null,124,null,null,140,218,null,166,null,174,176,108,52,{"$f":"SUM(D56:BM56)","v":3152},"Km  renseignés",{"$f":"SUM(BN56+BN57)","v":7515},166,0,79,36,null,null,null,null,null,null,null,null,null,null,null,null,null,{"$f":"SUM(BQ56:CG56)","v":281},"Km  renseignés",{"$f":"SUM(CH56+CH57)","v":1003},"Km  renseignés",{"$f":"SUM(BP56+CJ56)","v":8518}]
[null,null,"Ronde",null,null,null,null,null,null,null,null,null,null,null,null,null,null,null,null,null,null,215,null,195,null,513,null,null,200,null,null,200,210,180,null,null,200,300,220,null,null,250,null,null,null,0,null,null,166,null,null,194,null,180,null,null,165,170,null,220,null,165,140,150,130,{"$f":"SUM(D57:BM57)","v":4363},"Km confirmés",{"$f":"SUM(D59:BM59)","v":7515},216,200,186,120,null,null,null,null,null,null,null,null,null,null,null,null,null,{"$f":"SUM(BQ57:CG57)","v":722},"Km confirmés",{"$f":"SUM(BQ59:CG59)","v":1003},"Km confirmés",{"$f":"SUM(CJ57+BP57)","v":8518}]
[null,null,null,0,0,0,0,0,0,0,0,0,0,0,0,0,0,0,0,0,0,1,0,1,0,1,0,0,1,0,0,1,1,1,0,0,1,1,1,0,0,1,0,0,0,1,0,0,1,0,0,1,0,1,0,0,1,1,0,1,0,1,1,1,1,null,"Rondes confirmées",{"$f":"SUM(C58:BM58)","v":22},1,1,1,1,0,0,0,0,0,0,0,0,0,0,0,0,0,null,"Rondes confirmées",{"$f":"SUM(BQ58:CH58)","v":4},"Rondes confirmées",{"$f":"SUM(CJ58+BP58)","v":26}]
[null,null,null,{"$f":"SUM((D56+D57)*D58)","v":0},0,0,0,0,0,0,0,0,0,0,0,0,0,0,0,0,0,339,0,319,0,551,0,0,200,0,0,348,270,320,0,0,252,644,382,0,0,426,0,0,0,380,0,0,352,0,0,254,0,304,0,0,305,388,0,386,0,{"$f":"SUM((BJ56+BJ57)*BJ58)","v":339},316,258,182,null,"Rondes effectuées",{"$f":"COUNTIF(D56:BM56,\">0\")","v":21},{"$f":"SUM((BQ56+BQ57)*BQ58)","v":382},200,265,156,0,0,0,0,0,0,0,0,0,0,0,0,0,null,"Rondes Effectuées",{"$f":"COUNTIF(BQ56:CG56,\">0\")","v":3},"Rondes effectuées",{"$f":"SUM(CJ59+BP59)","v":24}]
[14,{"$f":"VLOOKUP(A60,'Numéro licences'!$A$4:$B$32,2)","v":"THOMAS Isabelle"},"Aller-Retour",null,null,null,null,null,null,null,null,null,null,null,null,null,null,null,null,null,null,null,null,null,null,null,null,null,null,null,null,null,null,null,null,null,null,null,null,null,null,null,null,null,null,null,null,null,null,null,null,null,null,null,null,null,null,null,null,null,null,null,null,null,null,{"$f":"SUM(D60:BM60)","v":0},"Km  renseignés",{"$f":"SUM(BN60+BN61)","v":0},null,null,null,null,null,null,null,null,null,null,null,null,null,null,null,null,null,{"$f":"SUM(BQ60:CG60)","v":0},"Km  renseignés",{"$f":"SUM(CH60+CH61)","v":0},"Km  renseignés",{"$f":"SUM(BP60+CJ60)","v":0}]
[null,null,"Ronde",null,null,null,null,null,null,null,null,null,null,null,null,null,null,null,null,null,null,null,null,null,null,null,null,null,null,null,null,null,null,null,null,null,null,null,null,null,null,null,null,null,null,null,null,null,null,null,null,null,null,null,null,null,null,null,null,null,null,null,null,null,null,{"$f":"SUM(D61:BM61)","v":0},"Km confirmés",{"$f":"SUM(D63:BM63)","v":0},null,null,null,null,null,null,null,null,null,null,null,null,null,null,null,null,null,{"$f":"SUM(BQ61:CG61)","v":0},"Km confirmés",{"$f":"SUM(BQ63:CG63)","v":0},"Km confirmés",{"$f":"SUM(CJ61+BP61)","v":0}]
[null,null,null,0,0,0,0,0,0,0,0,0,0,0,0,0,0,0,0,0,0,0,0,0,0,0,0,0,0,0,0,0,0,0,0,0,0,0,0,0,0,0,0,0,0,0,0,0,0,0,0,0,0,0,0,0,0,0,0,0,0,0,0,0,0,null,"Rondes confirmées",{"$f":"SUM(C62:BM62)","v":0},0,0,0,0,0,0,0,0,0,0,0,0,0,0,0,0,0,null,"Rondes confirmées",{"$f":"SUM(BQ62:CH62)","v":0},"Rondes confirmées",{"$f":"SUM(CJ62+BP62)","v":0}]
[null,null,null,{"$f":"SUM((D60+D61)*D62)","v":0},0,0,0,0,0,0,0,0,0,0,0,0,0,0,0,0,0,0,0,0,0,0,0,0,0,0,0,0,0,0,0,0,0,0,0,0,0,0,0,0,0,0,0,0,0,0,0,0,0,0,0,0,0,0,0,0,0,0,{"$f":"SUM((BK60+BK61)*BK62)","v":0},0,0,null,"Rondes effectuées",{"$f":"COUNTIF(D60:BM60,\">0\")","v":0},{"$f":"SUM((BQ60+BQ61)*BQ62)","v":0},0,0,0,0,0,0,0,0,0,0,0,0,0,0,0,0,null,"Rondes Effectuées",{"$f":"COUNTIF(BQ60:CG60,\">0\")","v":0},"Rondes effectuées",{"$f":"SUM(CJ63+BP63)","v":0}]
[15,{"$f":"VLOOKUP(A64,'Numéro licences'!$A$4:$B$32,2)","v":0},"Aller-Retour",null,null,null,null,null,null,null,null,null,null,null,null,null,null,null,null,null,null,null,null,null,null,null,null,null,null,null,null,null,null,null,null,null,null,null,null,null,null,null,null,null,null,null,null,null,null,null,null,null,null,null,null,null,null,null,null,null,null,null,null,null,null,{"$f":"SUM(D64:BM64)","v":0},"Km  renseignés",{"$f":"SUM(BN64+BN65)","v":0},null,null,null,null,null,null,null,null,null,null,null,null,null,null,null,null,null,{"$f":"SUM(BQ64:CG64)","v":0},"Km  renseignés",{"$f":"SUM(CH64+CH65)","v":0},"Km  renseignés",{"$f":"SUM(BP64+CJ64)","v":0}]
[null,null,"Ronde",null,null,null,null,null,null,null,null,null,null,null,null,null,null,null,null,null,null,null,null,null,null,null,null,null,null,null,null,null,null,null,null,null,null,null,null,null,null,null,null,null,null,null,null,null,null,null,null,null,null,null,null,null,null,null,null,null,null,null,null,null,null,{"$f":"SUM(D65:BM65)","v":0},"Km confirmés",{"$f":"SUM(D67:BM67)","v":0},null,null,null,null,null,null,null,null,null,null,null,null,null,null,null,null,null,{"$f":"SUM(BQ65:CG65)","v":0},"Km confirmés",{"$f":"SUM(BQ67:CG67)","v":0},"Km confirmés",{"$f":"SUM(CJ65+BP65)","v":0}]
[null,null,null,0,0,0,0,0,0,0,0,0,0,0,0,0,0,0,0,0,0,0,0,0,0,0,0,0,0,0,0,0,0,0,0,0,0,0,0,0,0,0,0,0,0,0,0,0,0,0,0,0,0,0,0,0,0,0,0,0,0,0,0,0,0,null,"Rondes confirmées",{"$f":"SUM(C66:BM66)","v":0},0,0,0,0,0,0,0,0,0,0,0,0,0,0,0,0,0,null,"Rondes confirmées",{"$f":"SUM(BQ66:CH66)","v":0},"Rondes confirmées",{"$f":"SUM(CJ66+BP66)","v":0}]
[null,null,null,{"$f":"SUM((D64+D65)*D66)","v":0},0,0,0,0,0,0,0,0,0,0,0,0,0,0,0,0,0,0,0,0,0,0,0,0,0,0,0,0,0,0,0,0,0,0,0,0,0,0,0,0,0,0,0,0,0,0,0,0,0,0,0,0,0,0,0,0,0,0,{"$f":"SUM((BK64+BK65)*BK66)","v":0},0,0,null,"Rondes effectuées",{"$f":"COUNTIF(D64:BM64,\">0\")","v":0},{"$f":"SUM((BQ64+BQ65)*BQ66)","v":0},0,0,0,0,0,0,0,0,0,0,0,0,0,0,0,0,null,"Rondes Effectuées",{"$f":"COUNTIF(BQ64:CG64,\">0\")","v":0},"Rondes effectuées",{"$f":"SUM(CJ67+BP67)","v":0}]
[16,{"$f":"VLOOKUP(A68,'Numéro licences'!$A$4:$B$32,2)","v":0},"Aller-Retour",null,null,null,null,null,null,null,null,null,null,null,null,null,null,null,null,null,null,null,null,null,null,null,null,null,null,null,null,null,null,null,null,null,null,null,null,null,null,null,null,null,null,null,null,null,null,null,null,null,null,null,null,null,null,null,null,null,null,null,null,null,null,{"$f":"SUM(D68:BM68)","v":0},"Km  renseignés",{"$f":"SUM(BN68+BN69)","v":0},null,null,null,null,null,null,null,null,null,null,null,null,null,null,null,null,null,{"$f":"SUM(BQ68:CG68)","v":0},"Km  renseignés",{"$f":"SUM(CH68+CH69)","v":0},"Km  renseignés",{"$f":"SUM(BP68+CJ68)","v":0}]
[null,null,"Ronde",null,null,null,null,null,null,null,null,null,null,null,null,null,null,null,null,null,null,null,null,null,null,null,null,null,null,null,null,null,null,null,null,null,null,null,null,null,null,null,null,null,null,null,null,null,null,null,null,null,null,null,null,null,null,null,null,null,null,null,null,null,null,{"$f":"SUM(D69:BM69)","v":0},"Km confirmés",{"$f":"SUM(D71:BM71)","v":0},null,null,null,null,null,null,null,null,null,null,null,null,null,null,null,null,null,{"$f":"SUM(BQ69:CG69)","v":0},"Km confirmés",{"$f":"SUM(BQ71:CG71)","v":0},"Km confirmés",{"$f":"SUM(CJ69+BP69)","v":0}]
[null,null,null,0,0,0,0,0,0,0,0,0,0,0,0,0,0,0,0,0,0,0,0,0,0,0,0,0,0,0,0,0,0,0,0,0,0,0,0,0,0,0,0,0,0,0,0,0,0,0,0,0,0,0,0,0,0,0,0,0,0,0,0,0,0,null,"Rondes confirmées",{"$f":"SUM(C70:BM70)","v":0},0,0,0,0,0,0,0,0,0,0,0,0,0,0,0,0,0,null,"Rondes confirmées",{"$f":"SUM(BQ70:CH70)","v":0},"Rondes confirmées",{"$f":"SUM(CJ70+BP70)","v":0}]
[null,null,null,{"$f":"SUM((D68+D69)*D70)","v":0},0,0,0,0,0,0,0,0,0,0,0,0,0,0,0,0,0,0,0,0,0,0,0,0,0,0,0,0,0,0,0,0,0,0,0,0,0,0,0,0,0,0,0,0,0,0,0,0,0,0,0,0,0,0,0,0,0,0,{"$f":"SUM((BK68+BK69)*BK70)","v":0},0,0,null,"Rondes effectuées",{"$f":"COUNTIF(D68:BM68,\">0\")","v":0},{"$f":"SUM((BQ68+BQ69)*BQ70)","v":0},0,0,0,0,0,0,0,0,0,0,0,0,0,0,0,0,null,"Rondes Effectuées",{"$f":"COUNTIF(BQ68:CG68,\">0\")","v":0},"Rondes effectuées",{"$f":"SUM(CJ71+BP71)","v":0}]
[17,{"$f":"VLOOKUP(A72,'Numéro licences'!$A$4:$B$32,2)","v":0},"Aller-Retour",null,null,null,null,null,null,null,null,null,null,null,null,null,null,null,null,null,null,null,null,null,null,null,null,null,null,null,null,null,null,null,null,null,null,null,null,null,null,null,null,null,null,null,null,null,null,null,null,null,null,null,null,null,null,null,null,null,null,null,null,null,null,{"$f":"SUM(D72:BM72)","v":0},"Km  renseignés",{"$f":"SUM(BN72+BN73)","v":0},null,null,null,null,null,null,null,null,null,null,null,null,null,null,null,null,null,{"$f":"SUM(BQ72:CG72)","v":0},"Km  renseignés",{"$f":"SUM(CH72+CH73)","v":0},"Km  renseignés",{"$f":"SUM(BP72+CJ72)","v":0}]
[null,null,"Ronde",null,null,null,null,null,null,null,null,null,null,null,null,null,null,null,null,null,null,null,null,null,null,null,null,null,null,null,null,null,null,null,null,null,null,null,null,null,null,null,null,null,null,null,null,null,null,null,null,null,null,null,null,null,null,null,null,null,null,null,null,null,null,{"$f":"SUM(D73:BM73)","v":0},"Km confirmés",{"$f":"SUM(D75:BM75)","v":0},null,null,null,null,null,null,null,null,null,null,null,null,null,null,null,null,null,{"$f":"SUM(BQ73:CG73)","v":0},"Km confirmés",{"$f":"SUM(BQ75:CG75)","v":0},"Km confirmés",{"$f":"SUM(CJ73+BP73)","v":0}]
[null,null,null,0,0,0,0,0,0,0,0,0,0,0,0,0,0,0,0,0,0,0,0,0,0,0,0,0,0,0,0,0,0,0,0,0,0,0,0,0,0,0,0,0,0,0,0,0,0,0,0,0,0,0,0,0,0,0,0,0,0,0,0,0,0,null,"Rondes confirmées",{"$f":"SUM(C74:BM74)","v":0},0,0,0,0,0,0,0,0,0,0,0,0,0,0,0,0,0,null,"Rondes confirmées",{"$f":"SUM(BQ74:CH74)","v":0},"Rondes confirmées",{"$f":"SUM(CJ74+BP74)","v":0}]
[null,null,null,{"$f":"SUM((D72+D73)*D74)","v":0},0,0,0,0,0,0,0,0,0,0,0,0,0,0,0,0,0,0,0,0,0,0,0,0,0,0,0,0,0,0,0,0,0,0,0,0,0,0,0,0,0,0,0,0,0,0,0,0,0,0,0,0,0,0,0,0,0,0,{"$f":"SUM((BK72+BK73)*BK74)","v":0},0,0,null,"Rondes effectuées",{"$f":"COUNTIF(D72:BM72,\">0\")","v":0},{"$f":"SUM((BQ72+BQ73)*BQ74)","v":0},0,0,0,0,0,0,0,0,0,0,0,0,0,0,0,0,null,"Rondes Effectuées",{"$f":"COUNTIF(BQ72:CG72,\">0\")","v":0},"Rondes effectuées",{"$f":"SUM(CJ75+BP75)","v":0}]
[18,{"$f":"VLOOKUP(A76,'Numéro licences'!$A$4:$B$32,2)","v":0},"Aller-Retour",null,null,null,null,null,null,null,null,null,null,null,null,null,null,null,null,null,null,null,null,null,null,null,null,null,null,null,null,null,null,null,null,null,null,null,null,null,null,null,null,null,null,null,null,null,null,null,null,null,null,null,null,null,null,null,null,null,null,null,null,null,null,{"$f":"SUM(D76:BM76)","v":0},"Km  renseignés",{"$f":"SUM(BN76+BN77)","v":0},null,null,null,null,null,null,null,null,null,null,null,null,null,null,null,null,null,{"$f":"SUM(BQ76:CG76)","v":0},"Km  renseignés",{"$f":"SUM(CH76+CH77)","v":0},"Km  renseignés",{"$f":"SUM(BP76+CJ76)","v":0}]
[null,null,"Ronde",null,null,null,null,null,null,null,null,null,null,null,null,null,null,null,null,null,null,null,null,null,null,null,null,null,null,null,null,null,null,null,null,null,null,null,null,null,null,null,null,null,null,null,null,null,null,null,null,null,null,null,null,null,null,null,null,null,null,null,null,null,null,{"$f":"SUM(D77:BM77)","v":0},"Km confirmés",{"$f":"SUM(D79:BM79)","v":0},null,null,null,null,null,null,null,null,null,null,null,null,null,null,null,null,null,{"$f":"SUM(BQ77:CG77)","v":0},"Km confirmés",{"$f":"SUM(BQ79:CG79)","v":0},"Km confirmés",{"$f":"SUM(CJ77+BP77)","v":0}]
[null,null,null,0,0,0,0,0,0,0,0,0,0,0,0,0,0,0,0,0,0,0,0,0,0,0,0,0,0,0,0,0,0,0,0,0,0,0,0,0,0,0,0,0,0,0,0,0,0,0,0,0,0,0,0,0,0,0,0,0,0,0,0,0,0,null,"Rondes confirmées",{"$f":"SUM(C78:BM78)","v":0},0,0,0,0,0,0,0,0,0,0,0,0,0,0,0,0,0,null,"Rondes confirmées",{"$f":"SUM(BQ78:CH78)","v":0},"Rondes confirmées",{"$f":"SUM(CJ78+BP78)","v":0}]
[null,null,null,{"$f":"SUM((D76+D77)*D78)","v":0},0,0,0,0,0,0,0,0,0,0,0,0,0,0,0,0,0,0,0,0,0,0,0,0,0,0,0,0,0,0,0,0,0,0,0,0,0,0,0,0,0,0,0,0,0,0,0,0,0,0,0,0,0,0,0,0,0,0,{"$f":"SUM((BK76+BK77)*BK78)","v":0},0,0,null,"Rondes effectuées",{"$f":"COUNTIF(D76:BM76,\">0\")","v":0},{"$f":"SUM((BQ76+BQ77)*BQ78)","v":0},0,0,0,0,0,0,0,0,0,0,0,0,0,0,0,0,null,"Rondes Effectuées",{"$f":"COUNTIF(BQ76:CG76,\">0\")","v":0},"Rondes effectuées",{"$f":"SUM(CJ79+BP79)","v":0}]
[19,{"$f":"VLOOKUP(A80,'Numéro licences'!$A$4:$B$32,2)","v":0},"Aller-Retour",null,null,null,null,null,null,null,null,null,null,null,null,null,null,null,null,null,null,null,null,null,null,null,null,null,null,null,null,null,null,null,null,null,null,null,null,null,null,null,null,null,null,null,null,null,null,null,null,null,null,null,null,null,null,null,null,null,null,null,null,null,null,{"$f":"SUM(D80:BM80)","v":0},"Km  renseignés",{"$f":"SUM(BN80+BN81)","v":0},null,null,null,null,null,null,null,null,null,null,null,null,null,null,null,null,null,{"$f":"SUM(BQ80:CG80)","v":0},"Km  renseignés",{"$f":"SUM(CH80+CH81)","v":0},"Km  renseignés",{"$f":"SUM(BP80+CJ80)","v":0}]
[null,null,"Ronde",null,null,null,null,null,null,null,null,null,null,null,null,null,null,null,null,null,null,null,null,null,null,null,null,null,null,null,null,null,null,null,null,null,null,null,null,null,null,null,null,null,null,null,null,null,null,null,null,null,null,null,null,null,null,null,null,null,null,null,null,null,null,{"$f":"SUM(D81:BM81)","v":0},"Km confirmés",{"$f":"SUM(D83:BM83)","v":0},null,null,null,null,null,null,null,null,null,null,null,null,null,null,null,null,null,{"$f":"SUM(BQ81:CG81)","v":0},"Km confirmés",{"$f":"SUM(BQ83:CG83)","v":0},"Km confirmés",{"$f":"SUM(CJ81+BP81)","v":0}]
[null,null,null,0,0,0,0,0,0,0,0,0,0,0,0,0,0,0,0,0,0,0,0,0,0,0,0,0,0,0,0,0,0,0,0,0,0,0,0,0,0,0,0,0,0,0,0,0,0,0,0,0,0,0,0,0,0,0,0,0,0,0,0,0,0,null,"Rondes confirmées",{"$f":"SUM(C82:BM82)","v":0},0,0,0,0,0,0,0,0,0,0,0,0,0,0,0,0,0,null,"Rondes confirmées",{"$f":"SUM(BQ82:CH82)","v":0},"Rondes confirmées",{"$f":"SUM(CJ82+BP82)","v":0}]
[null,null,null,{"$f":"SUM((D80+D81)*D82)","v":0},0,0,0,0,0,0,0,0,0,0,0,0,0,0,0,0,0,0,0,0,0,0,0,0,0,0,0,0,0,0,0,0,0,0,0,0,0,0,0,0,0,0,0,0,0,0,0,0,0,0,0,0,0,0,0,0,0,0,{"$f":"SUM((BK80+BK81)*BK82)","v":0},0,0,null,"Rondes effectuées",{"$f":"COUNTIF(D80:BM80,\">0\")","v":0},{"$f":"SUM((BQ80+BQ81)*BQ82)","v":0},0,0,0,0,0,0,0,0,0,0,0,0,0,0,0,0,null,"Rondes Effectuées",{"$f":"COUNTIF(BQ80:CG80,\">0\")","v":0},"Rondes effectuées",{"$f":"SUM(CJ83+BP83)","v":0}]
[20,{"$f":"VLOOKUP(A84,'Numéro licences'!$A$4:$B$32,2)","v":0},"Aller-Retour",null,null,null,null,null,null,null,null,null,null,null,null,null,null,null,null,null,null,null,null,null,null,null,null,null,null,null,null,null,null,null,null,null,null,null,null,null,null,null,null,null,null,null,null,null,null,null,null,null,null,null,null,null,null,null,null,null,null,null,null,null,null,{"$f":"SUM(D84:BM84)","v":0},"Km  renseignés",{"$f":"SUM(BN84+BN85)","v":0},null,null,null,null,null,null,null,null,null,null,null,null,null,null,null,null,null,{"$f":"SUM(BQ84:CG84)","v":0},"Km  renseignés",{"$f":"SUM(CH84+CH85)","v":0},"Km  renseignés",{"$f":"SUM(BP84+CJ84)","v":0}]
[null,null,"Ronde",null,null,null,null,null,null,null,null,null,null,null,null,null,null,null,null,null,null,null,null,null,null,null,null,null,null,null,null,null,null,null,null,null,null,null,null,null,null,null,null,null,null,null,null,null,null,null,null,null,null,null,null,null,null,null,null,null,null,null,null,null,null,{"$f":"SUM(D85:BM85)","v":0},"Km confirmés",{"$f":"SUM(D87:BM87)","v":0},null,null,null,null,null,null,null,null,null,null,null,null,null,null,null,null,null,{"$f":"SUM(BQ85:CG85)","v":0},"Km confirmés",{"$f":"SUM(BQ87:CG87)","v":0},"Km confirmés",{"$f":"SUM(CJ85+BP85)","v":0}]
[null,null,null,0,0,0,0,0,0,0,0,0,0,0,0,0,0,0,0,0,0,0,0,0,0,0,0,0,0,0,0,0,0,0,0,0,0,0,0,0,0,0,0,0,0,0,0,0,0,0,0,0,0,0,0,0,0,0,0,0,0,0,0,0,0,null,"Rondes confirmées",{"$f":"SUM(C86:BM86)","v":0},0,0,0,0,0,0,0,0,0,0,0,0,0,0,0,0,0,null,"Rondes confirmées",{"$f":"SUM(BQ86:CH86)","v":0},"Rondes confirmées",{"$f":"SUM(CJ86+BP86)","v":0}]
[null,null,null,{"$f":"SUM((D84+D85)*D86)","v":0},0,0,0,0,0,0,0,0,0,0,0,0,0,0,0,0,0,0,0,0,0,0,0,0,0,0,0,0,0,0,0,0,0,0,0,0,0,0,0,0,0,0,0,0,0,0,0,0,0,0,0,0,0,0,0,0,0,0,{"$f":"SUM((BK84+BK85)*BK86)","v":0},0,0,null,"Rondes effectuées",{"$f":"COUNTIF(D84:BM84,\">0\")","v":0},{"$f":"SUM((BQ84+BQ85)*BQ86)","v":0},0,0,0,0,0,0,0,0,0,0,0,0,0,0,0,0,null,"Rondes Effectuées",{"$f":"COUNTIF(BQ84:CG84,\">0\")","v":0},"Rondes effectuées",{"$f":"SUM(CJ87+BP87)","v":0}]
[21,{"$f":"VLOOKUP(A88,'Numéro licences'!$A$4:$B$32,2)","v":0},"Aller-Retour",null,null,null,null,null,null,null,null,null,null,null,null,null,null,null,null,null,null,null,null,null,null,null,null,null,null,null,null,null,null,null,null,null,null,null,null,null,null,null,null,null,null,null,null,null,null,null,null,null,null,null,null,null,null,null,null,null,null,null,null,null,null,{"$f":"SUM(D88:BM88)","v":0},"Km  renseignés",{"$f":"SUM(BN88+BN89)","v":0},null,null,null,null,null,null,null,null,null,null,null,null,null,null,null,null,null,{"$f":"SUM(BQ88:CG88)","v":0},"Km  renseignés",{"$f":"SUM(CH88+CH89)","v":0},"Km  renseignés",{"$f":"SUM(BP88+CJ88)","v":0}]
[null,null,"Ronde",null,null,null,null,null,null,null,null,null,null,null,null,null,null,null,null,null,null,null,null,null,null,null,null,null,null,null,null,null,null,null,null,null,null,null,null,null,null,null,null,null,null,null,null,null,null,null,null,null,null,null,null,null,null,null,null,null,null,null,null,null,null,{"$f":"SUM(D89:BM89)","v":0},"Km confirmés",{"$f":"SUM(D91:BM91)","v":0},null,null,null,null,null,null,null,null,null,null,null,null,null,null,null,null,null,{"$f":"SUM(BQ89:CG89)","v":0},"Km confirmés",{"$f":"SUM(BQ91:CG91)","v":0},"Km confirmés",{"$f":"SUM(CJ89+BP89)","v":0}]
[null,null,null,0,0,0,0,0,0,0,0,0,0,0,0,0,0,0,0,0,0,0,0,0,0,0,0,0,0,0,0,0,0,0,0,0,0,0,0,0,0,0,0,0,0,0,0,0,0,0,0,0,0,0,0,0,0,0,0,0,0,0,0,0,0,null,"Rondes confirmées",{"$f":"SUM(C90:BM90)","v":0},0,0,0,0,0,0,0,0,0,0,0,0,0,0,0,0,0,null,"Rondes confirmées",{"$f":"SUM(BQ90:CH90)","v":0},"Rondes confirmées",{"$f":"SUM(CJ90+BP90)","v":0}]
[null,null,null,{"$f":"SUM((D88+D89)*D90)","v":0},0,0,0,0,0,0,0,0,0,0,0,0,0,0,0,0,0,0,0,0,0,0,0,0,0,0,0,0,0,0,0,0,0,0,0,0,0,0,0,0,0,0,0,0,0,0,0,0,0,0,0,0,0,0,0,0,0,0,{"$f":"SUM((BK88+BK89)*BK90)","v":0},0,0,null,"Rondes effectuées",{"$f":"COUNTIF(D88:BM88,\">0\")","v":0},{"$f":"SUM((BQ88+BQ89)*BQ90)","v":0},0,0,0,0,0,0,0,0,0,0,0,0,0,0,0,0,null,"Rondes Effectuées",{"$f":"COUNTIF(BQ88:CG88,\">0\")","v":0},"Rondes effectuées",{"$f":"SUM(CJ91+BP91)","v":0}]
[22,{"$f":"VLOOKUP(A92,'Numéro licences'!$A$4:$B$32,2)","v":0},"Aller-Retour",null,null,null,null,null,null,null,null,null,null,null,null,null,null,null,null,null,null,null,null,null,null,null,null,null,null,null,null,null,null,null,null,null,null,null,null,null,null,null,null,null,null,null,null,null,null,null,null,null,null,null,null,null,null,null,null,null,null,null,null,null,null,{"$f":"SUM(D92:BM92)","v":0},"Km  renseignés",{"$f":"SUM(BN92+BN93)","v":0},null,null,null,null,null,null,null,null,null,null,null,null,null,null,null,null,null,{"$f":"SUM(BQ92:CG92)","v":0},"Km  renseignés",{"$f":"SUM(CH92+CH93)","v":0},"Km  renseignés",{"$f":"SUM(BP92+CJ92)","v":0}]
[null,null,"Ronde",null,null,null,null,null,null,null,null,null,null,null,null,null,null,null,null,null,null,null,null,null,null,null,null,null,null,null,null,null,null,null,null,null,null,null,null,null,null,null,null,null,null,null,null,null,null,null,null,null,null,null,null,null,null,null,null,null,null,null,null,null,null,{"$f":"SUM(D93:BM93)","v":0},"Km confirmés",{"$f":"SUM(D95:BM95)","v":0},null,null,null,null,null,null,null,null,null,null,null,null,null,null,null,null,null,{"$f":"SUM(BQ93:CG93)","v":0},"Km confirmés",{"$f":"SUM(BQ95:CG95)","v":0},"Km confirmés",{"$f":"SUM(CJ93+BP93)","v":0}]
[null,null,null,0,0,0,0,0,0,0,0,0,0,0,0,0,0,0,0,0,0,0,0,0,0,0,0,0,0,0,0,0,0,0,0,0,0,0,0,0,0,0,0,0,0,0,0,0,0,0,0,0,0,0,0,0,0,0,0,0,0,0,0,0,0,null,"Rondes confirmées",{"$f":"SUM(C94:BM94)","v":0},0,0,0,0,0,0,0,0,0,0,0,0,0,0,0,0,0,null,"Rondes confirmées",{"$f":"SUM(BQ94:CH94)","v":0},"Rondes confirmées",{"$f":"SUM(CJ94+BP94)","v":0}]
[null,null,null,{"$f":"SUM((D92+D93)*D94)","v":0},0,0,0,0,0,0,0,0,0,0,0,0,0,0,0,0,0,0,0,0,0,0,0,0,0,0,0,0,0,0,0,0,0,0,0,0,0,0,0,0,0,0,0,0,0,0,0,0,0,0,0,0,0,0,0,0,0,0,{"$f":"SUM((BK92+BK93)*BK94)","v":0},0,0,null,"Rondes effectuées",{"$f":"COUNTIF(D92:BM92,\">0\")","v":0},{"$f":"SUM((BQ92+BQ93)*BQ94)","v":0},0,0,0,0,0,0,0,0,0,0,0,0,0,0,0,0,null,"Rondes Effectuées",{"$f":"COUNTIF(BQ92:CG92,\">0\")","v":0},"Rondes effectuées",{"$f":"SUM(CJ95+BP95)","v":0}]
[23,{"$f":"VLOOKUP(A96,'Numéro licences'!$A$4:$B$32,2)","v":0},"Aller-Retour",null,null,null,null,null,null,null,null,null,null,null,null,null,null,null,null,null,null,null,null,null,null,null,null,null,null,null,null,null,null,null,null,null,null,null,null,null,null,null,null,null,null,null,null,null,null,null,null,null,null,null,null,null,null,null,null,null,null,null,null,null,null,{"$f":"SUM(D96:BM96)","v":0},"Km  renseignés",{"$f":"SUM(BN96+BN97)","v":0},null,null,null,null,null,null,null,null,null,null,null,null,null,null,null,null,null,{"$f":"SUM(BQ96:CG96)","v":0},"Km  renseignés",{"$f":"SUM(CH96+CH97)","v":0},"Km  renseignés",{"$f":"SUM(BP96+CJ96)","v":0}]
[null,null,"Ronde",null,null,null,null,null,null,null,null,null,null,null,null,null,null,null,null,null,null,null,null,null,null,null,null,null,null,null,null,null,null,null,null,null,null,null,null,null,null,null,null,null,null,null,null,null,null,null,null,null,null,null,null,null,null,null,null,null,null,null,null,null,null,{"$f":"SUM(D97:BM97)","v":0},"Km confirmés",{"$f":"SUM(D99:BM99)","v":0},null,null,null,null,null,null,null,null,null,null,null,null,null,null,null,null,null,{"$f":"SUM(BQ97:CG97)","v":0},"Km confirmés",{"$f":"SUM(BQ99:CG99)","v":0},"Km confirmés",{"$f":"SUM(CJ97+BP97)","v":0}]
[null,null,null,0,0,0,0,0,0,0,0,0,0,0,0,0,0,0,0,0,0,0,0,0,0,0,0,0,0,0,0,0,0,0,0,0,0,0,0,0,0,0,0,0,0,0,0,0,0,0,0,0,0,0,0,0,0,0,0,0,0,0,0,0,0,null,"Rondes confirmées",{"$f":"SUM(C98:BM98)","v":0},0,0,0,0,0,0,0,0,0,0,0,0,0,0,0,0,0,null,"Rondes confirmées",{"$f":"SUM(BQ98:CH98)","v":0},"Rondes confirmées",{"$f":"SUM(CJ98+BP98)","v":0}]
[null,null,null,{"$f":"SUM((D96+D97)*D98)","v":0},0,0,0,0,0,0,0,0,0,0,0,0,0,0,0,0,0,0,0,0,0,0,0,0,0,0,0,0,0,0,0,0,0,0,0,0,0,0,0,0,0,0,0,0,0,0,0,0,0,0,0,0,0,0,0,0,0,0,{"$f":"SUM((BK96+BK97)*BK98)","v":0},0,0,null,"Rondes effectuées",{"$f":"COUNTIF(D96:BM96,\">0\")","v":0},{"$f":"SUM((BQ96+BQ97)*BQ98)","v":0},0,0,0,0,0,0,0,0,0,0,0,0,0,0,0,0,null,"Rondes Effectuées",{"$f":"COUNTIF(BQ96:CG96,\">0\")","v":0},"Rondes effectuées",{"$f":"SUM(CJ99+BP99)","v":0}]
[24,{"$f":"VLOOKUP(A100,'Numéro licences'!$A$4:$B$32,2)","v":0},"Aller-Retour",null,null,null,null,null,null,null,null,null,null,null,null,null,null,null,null,null,null,null,null,null,null,null,null,null,null,null,null,null,null,null,null,null,null,null,null,null,null,null,null,null,null,null,null,null,null,null,null,null,null,null,null,null,null,null,null,null,null,null,null,null,null,{"$f":"SUM(D100:BM100)","v":0},"Km  renseignés",{"$f":"SUM(BN100+BN101)","v":0},null,null,null,null,null,null,null,null,null,null,null,null,null,null,null,null,null,{"$f":"SUM(BQ100:CG100)","v":0},"Km  renseignés",{"$f":"SUM(CH100+CH101)","v":0},"Km  renseignés",{"$f":"SUM(BP100+CJ100)","v":0}]
[null,null,"Ronde",null,null,null,null,null,null,null,null,null,null,null,null,null,null,null,null,null,null,null,null,null,null,null,null,null,null,null,null,null,null,null,null,null,null,null,null,null,null,null,null,null,null,null,null,null,null,null,null,null,null,null,null,null,null,null,null,null,null,null,null,null,null,{"$f":"SUM(D101:BM101)","v":0},"Km confirmés",{"$f":"SUM(D103:BM103)","v":0},null,null,null,null,null,null,null,null,null,null,null,null,null,null,null,null,null,{"$f":"SUM(BQ101:CG101)","v":0},"Km confirmés",{"$f":"SUM(BQ103:CG103)","v":0},"Km confirmés",{"$f":"SUM(CJ101+BP101)","v":0}]
[null,null,null,0,0,0,0,0,0,0,0,0,0,0,0,0,0,0,0,0,0,0,0,0,0,0,0,0,0,0,0,0,0,0,0,0,0,0,0,0,0,0,0,0,0,0,0,0,0,0,0,0,0,0,0,0,0,0,0,0,0,0,0,0,0,null,"Rondes confirmées",{"$f":"SUM(C102:BM102)","v":0},0,0,0,0,0,0,0,0,0,0,0,0,0,0,0,0,0,null,"Rondes confirmées",{"$f":"SUM(BQ102:CH102)","v":0},"Rondes confirmées",{"$f":"SUM(CJ102+BP102)","v":0}]
[null,null,null,{"$f":"SUM((D100+D101)*D102)","v":0},0,0,0,0,0,0,0,0,0,0,0,0,0,0,0,0,0,0,0,0,0,0,0,0,0,0,0,0,0,0,0,0,0,0,0,0,0,0,0,0,0,0,0,0,0,0,0,0,0,0,0,0,0,0,0,0,0,0,{"$f":"SUM((BK100+BK101)*BK102)","v":0},0,0,null,"Rondes effectuées",{"$f":"COUNTIF(D100:BM100,\">0\")","v":0},{"$f":"SUM((BQ100+BQ101)*BQ102)","v":0},0,0,0,0,0,0,0,0,0,0,0,0,0,0,0,0,null,"Rondes Effectuées",{"$f":"COUNTIF(BQ100:CG100,\">0\")","v":0},"Rondes effectuées",{"$f":"SUM(CJ103+BP103)","v":0}]
[25,{"$f":"VLOOKUP(A104,'Numéro licences'!$A$4:$B$32,2)","v":0},"Aller-Retour",null,null,null,null,null,null,null,null,null,null,null,null,null,null,null,null,null,null,null,null,null,null,null,null,null,null,null,null,null,null,null,null,null,null,null,null,null,null,null,null,null,null,null,null,null,null,null,null,null,null,null,null,null,null,null,null,null,null,null,null,null,null,{"$f":"SUM(D104:BM104)","v":0},"Km  renseignés",{"$f":"SUM(BN104+BN105)","v":0},null,null,null,null,null,null,null,null,null,null,null,null,null,null,null,null,null,{"$f":"SUM(BQ104:CG104)","v":0},"Km  renseignés",{"$f":"SUM(CH104+CH105)","v":0},"Km  renseignés",{"$f":"SUM(BP104+CJ104)","v":0}]
[null,null,"Ronde",null,null,null,null,null,null,null,null,null,null,null,null,null,null,null,null,null,null,null,null,null,null,null,null,null,null,null,null,null,null,null,null,null,null,null,null,null,null,null,null,null,null,null,null,null,null,null,null,null,null,null,null,null,null,null,null,null,null,null,null,null,null,{"$f":"SUM(D105:BM105)","v":0},"Km confirmés",{"$f":"SUM(D107:BM107)","v":0},null,null,null,null,null,null,null,null,null,null,null,null,null,null,null,null,null,{"$f":"SUM(BQ105:CG105)","v":0},"Km confirmés",{"$f":"SUM(BQ107:CG107)","v":0},"Km confirmés",{"$f":"SUM(CJ105+BP105)","v":0}]
[null,null,null,0,0,0,0,0,0,0,0,0,0,0,0,0,0,0,0,0,0,0,0,0,0,0,0,0,0,0,0,0,0,0,0,0,0,0,0,0,0,0,0,0,0,0,0,0,0,0,0,0,0,0,0,0,0,0,0,0,0,0,0,0,0,null,"Rondes confirmées",{"$f":"SUM(C106:BM106)","v":0},0,0,0,0,0,0,0,0,0,0,0,0,0,0,0,0,0,null,"Rondes confirmées",{"$f":"SUM(BQ106:CH106)","v":0},"Rondes confirmées",{"$f":"SUM(CJ106+BP106)","v":0}]
[null,null,null,{"$f":"SUM((D104+D105)*D106)","v":0},0,0,0,0,0,0,0,0,0,0,0,0,0,0,0,0,0,0,0,0,0,0,0,0,0,0,0,0,0,0,0,0,0,0,0,0,0,0,0,0,0,0,0,0,0,0,0,0,0,0,0,0,0,0,0,0,0,0,{"$f":"SUM((BK104+BK105)*BK106)","v":0},0,0,null,"Rondes effectuées",{"$f":"COUNTIF(D104:BM104,\">0\")","v":0},{"$f":"SUM((BQ104+BQ105)*BQ106)","v":0},0,0,0,0,0,0,0,0,0,0,0,0,0,0,0,0,null,"Rondes Effectuées",{"$f":"COUNTIF(BQ104:CG104,\">0\")","v":0},"Rondes effectuées",{"$f":"SUM(CJ107+BP107)","v":0}]
[26,{"$f":"VLOOKUP(A108,'Numéro licences'!$A$4:$B$32,2)","v":0},"Aller-Retour",null,null,null,null,null,null,null,null,null,null,null,null,null,null,null,null,null,null,null,null,null,null,null,null,null,null,null,null,null,null,null,null,null,null,null,null,null,null,null,null,null,null,null,null,null,null,null,null,null,null,null,null,null,null,null,null,null,null,null,null,null,null,{"$f":"SUM(D108:BM108)","v":0},"Km  renseignés",{"$f":"SUM(BN108+BN109)","v":0},null,null,null,null,null,null,null,null,null,null,null,null,null,null,null,null,null,{"$f":"SUM(BQ108:CG108)","v":0},"Km  renseignés",{"$f":"SUM(CH108+CH109)","v":0},"Km  renseignés",{"$f":"SUM(BP108+CJ108)","v":0}]
[null,null,"Ronde",null,null,null,null,null,null,null,null,null,null,null,null,null,null,null,null,null,null,null,null,null,null,null,null,null,null,null,null,null,null,null,null,null,null,null,null,null,null,null,null,null,null,null,null,null,null,null,null,null,null,null,null,null,null,null,null,null,null,null,null,null,null,{"$f":"SUM(D109:BM109)","v":0},"Km confirmés",{"$f":"SUM(D111:BM111)","v":0},null,null,null,null,null,null,null,null,null,null,null,null,null,null,null,null,null,{"$f":"SUM(BQ109:CG109)","v":0},"Km confirmés",{"$f":"SUM(BQ111:CG111)","v":0},"Km confirmés",{"$f":"SUM(CJ109+BP109)","v":0}]
[null,null,null,0,0,0,0,0,0,0,0,0,0,0,0,0,0,0,0,0,0,0,0,0,0,0,0,0,0,0,0,0,0,0,0,0,0,0,0,0,0,0,0,0,0,0,0,0,0,0,0,0,0,0,0,0,0,0,0,0,0,0,0,0,0,null,"Rondes confirmées",{"$f":"SUM(C110:BM110)","v":0},0,0,0,0,0,0,0,0,0,0,0,0,0,0,0,0,0,null,"Rondes confirmées",{"$f":"SUM(BQ110:CH110)","v":0},"Rondes confirmées",{"$f":"SUM(CJ110+BP110)","v":0}]
[null,null,null,{"$f":"SUM((D108+D109)*D110)","v":0},0,0,0,0,0,0,0,0,0,0,0,0,0,0,0,0,0,0,0,0,0,0,0,0,0,0,0,0,0,0,0,0,0,0,0,0,0,0,0,0,0,0,0,0,0,0,0,0,0,0,0,0,0,0,0,0,0,0,{"$f":"SUM((BK108+BK109)*BK110)","v":0},0,0,null,"Rondes effectuées",{"$f":"COUNTIF(D108:BM108,\">0\")","v":0},{"$f":"SUM((BQ108+BQ109)*BQ110)","v":0},0,0,0,0,0,0,0,0,0,0,0,0,0,0,0,0,null,"Rondes Effectuées",{"$f":"COUNTIF(BQ108:CG108,\">0\")","v":0},"Rondes effectuées",{"$f":"SUM(CJ111+BP111)","v":0}]
[27,{"$f":"VLOOKUP(A112,'Numéro licences'!$A$4:$B$32,2)","v":0},"Aller-Retour",null,null,null,null,null,null,null,null,null,null,null,null,null,null,null,null,null,null,null,null,null,null,null,null,null,null,null,null,null,null,null,null,null,null,null,null,null,null,null,null,null,null,null,null,null,null,null,null,null,null,null,null,null,null,null,null,null,null,null,null,null,null,{"$f":"SUM(D112:BM112)","v":0},"Km  renseignés",{"$f":"SUM(BN112+BN113)","v":0},null,null,null,null,null,null,null,null,null,null,null,null,null,null,null,null,null,{"$f":"SUM(BQ112:CG112)","v":0},"Km  renseignés",{"$f":"SUM(CH112+CH113)","v":0},"Km  renseignés",{"$f":"SUM(BP112+CJ112)","v":0}]
[null,null,"Ronde",null,null,null,null,null,null,null,null,null,null,null,null,null,null,null,null,null,null,null,null,null,null,null,null,null,null,null,null,null,null,null,null,null,null,null,null,null,null,null,null,null,null,null,null,null,null,null,null,null,null,null,null,null,null,null,null,null,null,null,null,null,null,{"$f":"SUM(D113:BM113)","v":0},"Km confirmés",{"$f":"SUM(D115:BM115)","v":0},null,null,null,null,null,null,null,null,null,null,null,null,null,null,null,null,null,{"$f":"SUM(BQ113:CG113)","v":0},"Km confirmés",{"$f":"SUM(BQ115:CG115)","v":0},"Km confirmés",{"$f":"SUM(CJ113+BP113)","v":0}]
[null,null,null,0,0,0,0,0,0,0,0,0,0,0,0,0,0,0,0,0,0,0,0,0,0,0,0,0,0,0,0,0,0,0,0,0,0,0,0,0,0,0,0,0,0,0,0,0,0,0,0,0,0,0,0,0,0,0,0,0,0,0,0,0,0,null,"Rondes confirmées",{"$f":"SUM(C114:BM114)","v":0},0,0,0,0,0,0,0,0,0,0,0,0,0,0,0,0,0,null,"Rondes confirmées",{"$f":"SUM(BQ114:CH114)","v":0},"Rondes confirmées",{"$f":"SUM(CJ114+BP114)","v":0}]
[null,null,null,{"$f":"SUM((D112+D113)*D114)","v":0},0,0,0,0,0,0,0,0,0,0,0,0,0,0,0,0,0,0,0,0,0,0,0,0,0,0,0,0,0,0,0,0,0,0,0,0,0,0,0,0,0,0,0,0,0,0,0,0,0,0,0,0,0,0,0,0,0,0,{"$f":"SUM((BK112+BK113)*BK114)","v":0},0,0,null,"Rondes effectuées",{"$f":"COUNTIF(D112:BM112,\">0\")","v":0},{"$f":"SUM((BQ112+BQ113)*BQ114)","v":0},0,0,0,0,0,0,0,0,0,0,0,0,0,0,0,0,null,"Rondes Effectuées",{"$f":"COUNTIF(BQ112:CG112,\">0\")","v":0},"Rondes effectuées",{"$f":"SUM(CJ115+BP115)","v":0}]
[28,{"$f":"VLOOKUP(A116,'Numéro licences'!$A$4:$B$32,2)","v":0},"Aller-Retour",null,null,null,null,null,null,null,null,null,null,null,null,null,null,null,null,null,null,null,null,null,null,null,null,null,null,null,null,null,null,null,null,null,null,null,null,null,null,null,null,null,null,null,null,null,null,null,null,null,null,null,null,null,null,null,null,null,null,null,null,null,null,{"$f":"SUM(D116:BM116)","v":0},"Km  renseignés",{"$f":"SUM(BN116+BN117)","v":0},null,null,null,null,null,null,null,null,null,null,null,null,null,null,null,null,null,{"$f":"SUM(BQ116:CG116)","v":0},"Km  renseignés",{"$f":"SUM(CH116+CH117)","v":0},"Km  renseignés",{"$f":"SUM(BP116+CJ116)","v":0}]
[null,null,"Ronde",null,null,null,null,null,null,null,null,null,null,null,null,null,null,null,null,null,null,null,null,null,null,null,null,null,null,null,null,null,null,null,null,null,null,null,null,null,null,null,null,null,null,null,null,null,null,null,null,null,null,null,null,null,null,null,null,null,null,null,null,null,null,{"$f":"SUM(D117:BM117)","v":0},"Km confirmés",{"$f":"SUM(D119:BM119)","v":0},null,null,null,null,null,null,null,null,null,null,null,null,null,null,null,null,null,{"$f":"SUM(BQ117:CG117)","v":0},"Km confirmés",{"$f":"SUM(BQ119:CG119)","v":0},"Km confirmés",{"$f":"SUM(CJ117+BP117)","v":0}]
[null,null,null,0,0,0,0,0,0,0,0,0,0,0,0,0,0,0,0,0,0,0,0,0,0,0,0,0,0,0,0,0,0,0,0,0,0,0,0,0,0,0,0,0,0,0,0,0,0,0,0,0,0,0,0,0,0,0,0,0,0,0,0,0,0,null,"Rondes confirmées",{"$f":"SUM(C118:BM118)","v":0},0,0,0,0,0,0,0,0,0,0,0,0,0,0,0,0,0,null,"Rondes confirmées",{"$f":"SUM(BQ118:CH118)","v":0},"Rondes confirmées",{"$f":"SUM(CJ118+BP118)","v":0}]
[null,null,null,{"$f":"SUM((D116+D117)*D118)","v":0},0,0,0,0,0,0,0,0,0,0,0,0,0,0,0,0,0,0,0,0,0,0,0,0,0,0,0,0,0,0,0,0,0,0,0,0,0,0,0,0,0,0,0,0,0,0,0,0,0,0,0,0,0,0,0,0,0,0,{"$f":"SUM((BK116+BK117)*BK118)","v":0},0,0,null,"Rondes effectuées",{"$f":"COUNTIF(D116:BM116,\">0\")","v":0},{"$f":"SUM((BQ116+BQ117)*BQ118)","v":0},0,0,0,0,0,0,0,0,0,0,0,0,0,0,0,0,null,"Rondes Effectuées",{"$f":"COUNTIF(BQ116:CG116,\">0\")","v":0},"Rondes effectuées",{"$f":"SUM(CJ119+BP119)","v":0}]
[29,{"$f":"VLOOKUP(A120,'Numéro licences'!$A$4:$B$32,2)","v":0},"Aller-Retour",null,null,null,null,null,null,null,null,null,null,null,null,null,null,null,null,null,null,null,null,null,null,null,null,null,null,null,null,null,null,null,null,null,null,null,null,null,null,null,null,null,null,null,null,null,null,null,null,null,null,null,null,null,null,null,null,null,null,null,null,null,null,{"$f":"SUM(D120:BM120)","v":0},"Km  renseignés",{"$f":"SUM(BN120+BN121)","v":0},null,null,null,null,null,null,null,null,null,null,null,null,null,null,null,null,null,{"$f":"SUM(BQ120:CG120)","v":0},"Km  renseignés",{"$f":"SUM(CH120+CH121)","v":0},"Km  renseignés",{"$f":"SUM(BP120+CJ120)","v":0}]
[null,null,"Ronde",null,null,null,null,null,null,null,null,null,null,null,null,null,null,null,null,null,null,null,null,null,null,null,null,null,null,null,null,null,null,null,null,null,null,null,null,null,null,null,null,null,null,null,null,null,null,null,null,null,null,null,null,null,null,null,null,null,null,null,null,null,null,{"$f":"SUM(D121:BM121)","v":0},"Km confirmés",{"$f":"SUM(D123:BM123)","v":0},null,null,null,null,null,null,null,null,null,null,null,null,null,null,null,null,null,{"$f":"SUM(BQ121:CG121)","v":0},"Km confirmés",{"$f":"SUM(BQ123:CG123)","v":0},"Km confirmés",{"$f":"SUM(CJ121+BP121)","v":0}]
[null,null,null,0,0,0,0,0,0,0,0,0,0,0,0,0,0,0,0,0,0,0,0,0,0,0,0,0,0,0,0,0,0,0,0,0,0,0,0,0,0,0,0,0,0,0,0,0,0,0,0,0,0,0,0,0,0,0,0,0,0,0,0,0,0,null,"Rondes confirmées",{"$f":"SUM(C122:BM122)","v":0},0,0,0,0,0,0,0,0,0,0,0,0,0,0,0,0,0,null,"Rondes confirmées",{"$f":"SUM(BQ122:CH122)","v":0},"Rondes confirmées",{"$f":"SUM(CJ122+BP122)","v":0}]
[null,null,null,{"$f":"SUM((D120+D121)*D122)","v":0},0,0,0,0,0,0,0,0,0,0,0,0,0,0,0,0,0,0,0,0,0,0,0,0,0,0,0,0,0,0,0,0,0,0,0,0,0,0,0,0,0,0,0,0,0,0,0,0,0,0,0,0,0,0,0,0,0,0,{"$f":"SUM((BK120+BK121)*BK122)","v":0},0,0,null,"Rondes effectuées",{"$f":"COUNTIF(D120:BM120,\">0\")","v":0},{"$f":"SUM((BQ120+BQ121)*BQ122)","v":0},0,0,0,0,0,0,0,0,0,0,0,0,0,0,0,0,null,"Rondes Effectuées",{"$f":"COUNTIF(BQ120:CG120,\">0\")","v":0},"Rondes effectuées",{"$f":"SUM(CJ123+BP123)","v":0}]
[null,null,"Nat.Pirates-Hors/FMB"]
[null,null,"Inconnu ou non-confirmé"]
[]
[null,null,"Concentres",{"$f":"COUNTIF(D8:D120,D5)","v":0},{"$f":"COUNTIF(E8:E120,E5)","v":0},0,0,0,0,56,0,0,0,0,0,0,0,0,0,0,0,1,0,1,0,1,0,0,58,0,0,1,2,1,0,0,3,1,1,0,0,1,0,0,0,2,0,0,1,0,0,1,0,2,0,0,1,1,0,2,0,{"$f":"COUNTIF(BJ8:BJ120,BJ5)","v":0},1,1,1,276,"Concentres",null,92,92,92,92,92,92,0,0,0,0,0,0,0,0,0,0,0,552,"Concentres",null,"Concentres",828]
[null,null,"Rondes",{"$f":"COUNTIF(D9:D123,D6)","v":58},{"$f":"COUNTIF(E9:E123,E6)","v":58},58,58,58,58,58,58,58,58,58,58,58,58,58,58,58,58,1,58,1,58,1,58,58,5,58,58,1,1,1,58,58,2,1,1,58,58,1,58,58,58,0,58,0,1,0,0,1,0,2,0,0,1,1,0,2,58,{"$f":"COUNTIF(BJ9:BJ123,BJ6)","v":1},1,1,1,5521,"Rondes",null,92,92,92,92,92,92,0,0,0,0,0,0,0,0,0,0,0,552,"Rondes",null,"Rondes",6073]
[]
[]
[]
[]
[null,"Colonne1"]
[1,"ALAIMO Rosa"]
[{"$f":"SUM(A134+1)","v":2},"BRIDOUX Jacqueline"]
[{"$f":"SUM(A135+1)","v":3},"COSYNS Carine"]
[4,"DEHAUT Stéphane"]
[5,"GREGORICS Kathy"]
[6,"INGELS Chantal"]
[7,"LAMBILLON Anne"]
[8,"LAMIROY Anne"]
[9,"LEQUEUX Anne"]
[10,"LEROY Laure"]
[11,"PRESTI Rose"]
[12]
[13]
[14]
[15]
[16]
[17]
[18]
[19]
[20]
[21]
[22]
[23]
[24]
[25]
[26]
[27]
[28]
[29]
[30]
[31]
[32]
[33]
[34]
[35]
[36]
[37]
[38]
[39]
[40]
[41]
[42]
[43]
[{"$f":"SUM(A176+1)","v":44}]
[45]
[46]

{"sheet":"Pilotes Inter","index":6,"n_rows":246,"n_cols":97,"rows_kept":246,"cut":false,"hidden":false,"merged":[[182,1,185,1],[186,1,189,1],[162,1,165,1],[166,1,169,1],[170,1,173,1],[174,1,177,1],[178,1,181,1],[142,1,145,1],[146,1,149,1],[150,1,153,1],[154,1,157,1],[158,1,161,1],[122,1,125,1],[126,1,129,1],[130,1,133,1],[134,1,137,1],[138,1,141,1],[102,1,105,1],[106,1,109,1],[110,1,113,1],[114,1,117,1],[118,1,121,1],[82,1,85,1],[86,1,89,1],[90,1,93,1],[94,1,97,1],[98,1,101,1],[62,1,65,1],[66,1,69,1],[70,1,73,1],[74,1,77,1],[78,1,81,1],[0,70,0,88],[98,94,98,96],[6,1,9,1],[10,1,13,1],[14,1,17,1],[18,1,21,1],[22,1,25,1],[26,1,29,1],[30,1,33,1],[34,1,37,1],[38,1,41,1],[42,1,45,1],[46,1,49,1],[50,1,53,1],[54,1,57,1],[58,1,61,1]]}
[null,null,null,1,{"$f":"SUM(D1+1)","v":2},{"$f":"SUM(E1+1)","v":3},4,5,6,7,8,9,10,11,12,13,14,15,16,17,18,19,20,21,22,23,24,25,26,27,28,29,30,31,32,33,34,35,36,37,38,39,40,41,42,43,44,45,46,47,48,49,50,51,52,53,54,55,{"$f":"SUM(BF1+1)","v":56},57,58,59,60,61,62,63,null,null,null,null,"Hors FMB"]
[null,null,null,null,null,null,null,null,null,null,null,null,null,null,null,null,null,null,null,null,null,null,null,null,null,null,null,null,null,null,null,null,null,null,null,null,null,null,null,null,null,null,null,null,null,null,null,null,null,null,null,null,null,null,null,null,null,null,null,null,null,null,null,null,null,null,null,null,null,"2021-09-02","2021-10-24"]
[null,null,null,null,null,null,null,null,null,null,null,null,null,null,null,null,null,null,null,null,null,null,null,null,null,null,null,null,null,null,null,null,null,null,null,null,null,null,null,null,null,null,null,null,null,null,null,null,null,null,null,null,null,null,null,null,null,null,null,null,null,null,null,null,null,null,null,null,null,"Sortie Club - Grande Rivière","Juliénas"]
[null,"Aller-Retour",null,-1,-1,-1,-1,-1,-1,-1,null,-1,null,-1,null,-1,-1,-1,null,-1,null,-1,-1,null,-1,-1,null,-1,null,null,null,null,null,null,-1,-1,null,null,null,-1,null,-1,-1,null,null,null,null,null,null,null,null,-1,-1,-1,null,null,null,null,null,null,null,null,-1,-1,-1,null,null,null,null,null,1242]
[null,"Ronde",null,-1,-1,-1,-1,-1,-1,-1,null,-1,-1,-1,null,-1,-1,-1,null,-1,null,-1,-1,null,-1,-1,-1,-1,null,null,null,null,null,null,-1,-1,null,null,null,-1,-1,-1,-1,null,null,null,null,null,null,null,null,-1,-1,-1,null,null,null,null,null,null,null,null,-1,-1,-1,null,null,null,null,257,0]
[null,null,null,null,null,null,null,null,null,null,null,null,null,null,null,null,null,null,null,null,null,null,null,null,null,null,null,null,null,null,null,null,null,null,null,null,null,null,null,null,null,null,null,null,null,null,null,null,null,null,null,null,null,null,null,null,null,null,null,null,null,null,null,null,null,null,"Sous-Total\nFMB",null,"Total FMB",null,null,null,null,null,null,null,null,null,null,null,null,null,null,null,null,null,"Sous-Totaux\nPirates",null,"Total Pirates",null,"TOTAL",null,null,null,"FMB","Hors FMB","Total"]
[1,{"$f":"VLOOKUP(A7,'Numéro licences'!$H$4:$I$47,2)","v":"BALFROID Pierre"},"Aller-Retour",null,null,null,null,null,null,null,null,null,null,null,null,null,null,null,null,null,null,null,null,null,null,null,null,null,null,null,null,null,null,null,null,null,null,null,null,null,null,null,null,null,null,null,null,null,null,null,null,null,null,null,null,null,null,null,null,null,null,null,null,null,null,null,{"$f":"SUM(D7:BN7)","v":0},"Km  renseignés",{"$f":"SUM(BO7+BO8)","v":0},null,null,null,null,null,null,null,null,null,null,null,null,null,null,null,null,null,{"$f":"SUM(BR7:CH7)","v":0},"Km  renseignés",{"$f":"SUM(CI7+CI8)","v":0},"Km  renseignés",{"$f":"SUM(BQ7+CK7)","v":0},null,1,{"$f":"VLOOKUP(CO7,A7:B187,2)","v":"BALFROID Pierre"},{"$f":"SUM(BQ7)","v":0},{"$f":"SUM(CK7)","v":0},{"$f":"SUM(CQ7+CR7)","v":0}]
[null,null,"Ronde",null,null,null,null,null,null,null,null,null,null,null,null,null,null,null,null,null,null,null,null,null,null,null,null,null,null,null,null,null,null,null,null,null,null,null,null,null,null,null,null,null,null,null,null,null,null,null,null,null,null,null,null,null,null,null,null,null,null,null,null,null,null,null,{"$f":"SUM(D8:BN8)","v":0},"Km confirmés",{"$f":"SUM(D10:BN10)","v":0},null,null,null,null,null,null,null,null,null,null,null,null,null,null,null,null,null,{"$f":"SUM(BR8:CH8)","v":0},"Km confirmés",{"$f":"SUM(BR10:CH10)","v":0},"Km confirmés",{"$f":"SUM(CK8+BQ8)","v":0},null,2,{"$f":"VLOOKUP(CO8,A7:B187,2)","v":"BALLION Pierre"},{"$f":"SUM(BQ11)","v":0},{"$f":"SUM(CK11)","v":0},{"$f":"SUM(CQ8+CR8)","v":0}]
[null,null,null,0,0,0,0,0,0,0,0,0,0,0,0,0,0,0,0,0,0,0,0,0,0,0,0,0,0,0,0,0,0,0,0,0,0,0,0,0,0,0,0,0,0,0,0,0,0,0,0,0,0,0,0,0,0,0,0,0,0,0,0,0,0,0,null,"Rondes confirmées",{"$f":"SUM(C9:BN9)","v":0},0,0,0,0,0,0,0,0,0,0,0,0,0,0,0,0,0,null,"Rondes confirmées",{"$f":"SUM(BR9:CI9)","v":0},"Rondes confirmées",{"$f":"SUM(CK9+BQ9)","v":0},null,3,{"$f":"VLOOKUP(CO9,A7:B187,2)","v":"BERDOYES Bruno"},{"$f":"SUM(BQ15)","v":0},{"$f":"SUM(CK15)","v":0},{"$f":"SUM(CQ9+CR9)","v":0}]
[null,null,null,{"$f":"SUM((D7+D8)*D9)","v":0},0,0,0,0,0,0,0,0,0,0,0,0,0,0,0,0,0,0,0,0,0,0,0,0,0,0,0,0,0,0,0,0,0,0,0,0,0,0,0,0,0,0,0,0,0,0,0,0,0,0,0,0,0,0,0,0,0,0,0,0,0,0,null,"Rondes effectuées",{"$f":"COUNTIF(D7:BN7,\">0\")","v":0},{"$f":"SUM((BR7+BR8)*BR9)","v":0},0,0,0,0,0,0,0,0,0,0,0,0,0,0,0,0,null,"Rondes Effectuées",{"$f":"COUNTIF(BR7:CH7,\">0\")","v":0},"Rondes effectuées",{"$f":"SUM(CK10+BQ10)","v":0},null,4,{"$f":"VLOOKUP(CO10,A7:B187,2)","v":"BERDOYES Yannick"},{"$f":"SUM(BQ19)","v":0},{"$f":"SUM(CK19)","v":0},0]
[2,{"$f":"VLOOKUP(A11,'Numéro licences'!$H$4:$I$47,2)","v":"BALLION Pierre"},"Aller-Retour",null,null,null,null,null,null,null,null,null,null,null,null,null,null,null,null,null,null,null,null,null,null,null,null,null,null,null,null,null,null,null,null,null,null,null,null,null,null,null,null,null,null,null,null,null,null,null,null,null,null,null,null,null,null,null,null,null,null,null,null,null,null,null,{"$f":"SUM(D11:BN11)","v":0},"Km  renseignés",{"$f":"SUM(BO11+BO12)","v":0},null,null,null,null,null,null,null,null,null,null,null,null,null,null,null,null,null,{"$f":"SUM(BR11:CH11)","v":0},"Km  renseignés",{"$f":"SUM(CI11+CI12)","v":0},"Km  renseignés",{"$f":"SUM(BQ11+CK11)","v":0},null,5,{"$f":"VLOOKUP(CO11,A7:B187,2)","v":"BRUNEAU Denis-Claude"},{"$f":"SUM(BQ23)","v":0},{"$f":"SUM(CK23)","v":1379},1379]
[null,null,"Ronde",null,null,null,null,null,null,null,null,null,null,null,null,null,null,null,null,null,null,null,null,null,null,null,null,null,null,null,null,null,null,null,null,null,null,null,null,null,null,null,null,null,null,null,null,null,null,null,null,null,null,null,null,null,null,null,null,null,null,null,null,null,null,null,{"$f":"SUM(D12:BN12)","v":0},"Km confirmés",{"$f":"SUM(D14:BN14)","v":0},null,null,null,null,null,null,null,null,null,null,null,null,null,null,null,null,null,{"$f":"SUM(BR12:CH12)","v":0},"Km confirmés",{"$f":"SUM(BR14:CH14)","v":0},"Km confirmés",{"$f":"SUM(CK12+BQ12)","v":0},null,6,{"$f":"VLOOKUP(CO12,A7:B187,2)","v":"DAVIN Philippe"},{"$f":"SUM(BQ27)","v":0},{"$f":"SUM(CK27)","v":1407},1407]
[null,null,null,0,0,0,0,0,0,0,0,0,0,0,0,0,0,0,0,0,0,0,0,0,0,0,0,0,0,0,0,0,0,0,0,0,0,0,0,0,0,0,0,0,0,0,0,0,0,0,0,0,0,0,0,0,0,0,0,0,0,0,0,0,0,0,null,"Rondes confirmées",{"$f":"SUM(C13:BN13)","v":0},0,0,0,0,0,0,0,0,0,0,0,0,0,0,0,0,0,null,"Rondes confirmées",{"$f":"SUM(BR13:CI13)","v":0},"Rondes confirmées",{"$f":"SUM(CK13+BQ13)","v":0},null,7,{"$f":"VLOOKUP(CO13,A7:B187,2)","v":"DE SCHEPPERS Jean-Claude"},{"$f":"SUM(BQ31)","v":0},{"$f":"SUM(CK31)","v":0},0]
[null,null,null,{"$f":"SUM((D11+D12)*D13)","v":0},0,0,0,0,0,0,0,0,0,0,0,0,0,0,0,0,0,0,0,0,0,0,0,0,0,0,0,0,0,0,0,0,0,0,0,0,0,0,0,0,0,0,0,0,0,0,0,0,0,0,0,0,0,0,0,0,0,0,0,0,0,0,null,"Rondes effectuées",{"$f":"COUNTIF(D11:BN11,\">0\")","v":0},{"$f":"SUM((BR11+BR12)*BR13)","v":0},0,0,0,0,0,0,0,0,0,0,0,0,0,0,0,0,null,"Rondes Effectuées",{"$f":"COUNTIF(BR11:CH11,\">0\")","v":0},"Rondes effectuées",{"$f":"SUM(CK14+BQ14)","v":0},null,8,{"$f":"VLOOKUP(CO14,A7:B187,2)","v":"DECUYPER Frédéric"},{"$f":"SUM(BQ35)","v":0},{"$f":"SUM(CK35)","v":0},0]
[3,{"$f":"VLOOKUP(A15,'Numéro licences'!$H$4:$I$47,2)","v":"BERDOYES Bruno"},"Aller-Retour",null,null,null,null,null,null,null,null,null,null,null,null,null,null,null,null,null,null,null,null,null,null,null,null,null,null,null,null,null,null,null,null,null,null,null,null,null,null,null,null,null,null,null,null,null,null,null,null,null,null,null,null,null,null,null,null,null,null,null,null,null,null,null,{"$f":"SUM(D15:BN15)","v":0},"Km  renseignés",{"$f":"SUM(BO15+BO16)","v":0},null,null,null,null,null,null,null,null,null,null,null,null,null,null,null,null,null,{"$f":"SUM(BR15:CH15)","v":0},"Km  renseignés",{"$f":"SUM(CI15+CI16)","v":0},"Km  renseignés",{"$f":"SUM(BQ15+CK15)","v":0},null,9,{"$f":"VLOOKUP(CO15,A7:B187,2)","v":"DEWAERSEGHERS Francis"},{"$f":"SUM(BQ39)","v":0},{"$f":"SUM(CK39)","v":0},0]
[null,null,"Ronde",null,null,null,null,null,null,null,null,null,null,null,null,null,null,null,null,null,null,null,null,null,null,null,null,null,null,null,null,null,null,null,null,null,null,null,null,null,null,null,null,null,null,null,null,null,null,null,null,null,null,null,null,null,null,null,null,null,null,null,null,null,null,null,{"$f":"SUM(D16:BN16)","v":0},"Km confirmés",{"$f":"SUM(D18:BN18)","v":0},null,null,null,null,null,null,null,null,null,null,null,null,null,null,null,null,null,{"$f":"SUM(BR16:CH16)","v":0},"Km confirmés",{"$f":"SUM(BR18:CH18)","v":0},"Km confirmés",{"$f":"SUM(CK16+BQ16)","v":0},null,10,{"$f":"VLOOKUP(CO16,A7:B187,2)","v":"DHONDT Jerry"},{"$f":"SUM(BQ43)","v":0},{"$f":"SUM(CK43)","v":0},0]
[null,null,null,0,0,0,0,0,0,0,0,0,0,0,0,0,0,0,0,0,0,0,0,0,0,0,0,0,0,0,0,0,0,0,0,0,0,0,0,0,0,0,0,0,0,0,0,0,0,0,0,0,0,0,0,0,0,0,0,0,0,0,0,0,0,0,null,"Rondes confirmées",{"$f":"SUM(C17:BN17)","v":0},0,0,0,0,0,0,0,0,0,0,0,0,0,0,0,0,0,null,"Rondes confirmées",{"$f":"SUM(BR17:CI17)","v":0},"Rondes confirmées",{"$f":"SUM(CK17+BQ17)","v":0},null,11,{"$f":"VLOOKUP(CO17,A7:B187,2)","v":"DONY Marc"},{"$f":"SUM(BQ47)","v":0},{"$f":"SUM(CK47)","v":2682},2682]
[null,null,null,{"$f":"SUM((D15+D16)*D17)","v":0},0,0,0,0,0,0,0,0,0,0,0,0,0,0,0,0,0,0,0,0,0,0,0,0,0,0,0,0,0,0,0,0,0,0,0,0,0,0,0,0,0,0,0,0,0,0,0,0,0,0,0,0,0,0,0,0,0,0,0,0,0,0,null,"Rondes effectuées",{"$f":"COUNTIF(D15:BN15,\">0\")","v":0},{"$f":"SUM((BR15+BR16)*BR17)","v":0},0,0,0,0,0,0,0,0,0,0,0,0,0,0,0,0,null,"Rondes Effectuées",{"$f":"COUNTIF(BR15:CH15,\">0\")","v":0},"Rondes effectuées",{"$f":"SUM(CK18+BQ18)","v":0},null,12,{"$f":"VLOOKUP(CO18,A7:B187,2)","v":"DUMONT Christophe"},{"$f":"SUM(BQ51)","v":0},{"$f":"SUM(CK51)","v":0},0]
[4,{"$f":"VLOOKUP(A19,'Numéro licences'!$H$4:$I$47,2)","v":"BERDOYES Yannick"},"Aller-Retour",null,null,null,null,null,null,null,null,null,null,null,null,null,null,null,null,null,null,null,null,null,null,null,null,null,null,null,null,null,null,null,null,null,null,null,null,null,null,null,null,null,null,null,null,null,null,null,null,null,null,null,null,null,null,null,null,null,null,null,null,null,null,null,{"$f":"SUM(D19:BN19)","v":0},"Km  renseignés",{"$f":"SUM(BO19+BO20)","v":0},null,null,null,null,null,null,null,null,null,null,null,null,null,null,null,null,null,{"$f":"SUM(BR19:CH19)","v":0},"Km  renseignés",{"$f":"SUM(CI19+CI20)","v":0},"Km  renseignés",{"$f":"SUM(BQ19+CK19)","v":0},null,13,{"$f":"VLOOKUP(CO19,A7:B187,2)","v":"FAVRESSSE René"},{"$f":"SUM(BQ55)","v":0},{"$f":"SUM(CK55)","v":0},0]
[null,null,"Ronde",null,null,null,null,null,null,null,null,null,null,null,null,null,null,null,null,null,null,null,null,null,null,null,null,null,null,null,null,null,null,null,null,null,null,null,null,null,null,null,null,null,null,null,null,null,null,null,null,null,null,null,null,null,null,null,null,null,null,null,null,null,null,null,{"$f":"SUM(D20:BN20)","v":0},"Km confirmés",{"$f":"SUM(D22:BN22)","v":0},null,null,null,null,null,null,null,null,null,null,null,null,null,null,null,null,null,{"$f":"SUM(BR20:CH20)","v":0},"Km confirmés",{"$f":"SUM(BR22:CH22)","v":0},"Km confirmés",{"$f":"SUM(CK20+BQ20)","v":0},null,14,{"$f":"VLOOKUP(CO20,A7:B187,2)","v":"GOFFIN Amaury"},{"$f":"SUM(BQ59)","v":0},{"$f":"SUM(CK59)","v":0},0]
[null,null,null,0,0,0,0,0,0,0,0,0,0,0,0,0,0,0,0,0,0,0,0,0,0,0,0,0,0,0,0,0,0,0,0,0,0,0,0,0,0,0,0,0,0,0,0,0,0,0,0,0,0,0,0,0,0,0,0,0,0,0,0,0,0,0,null,"Rondes confirmées",{"$f":"SUM(C21:BN21)","v":0},0,0,0,0,0,0,0,0,0,0,0,0,0,0,0,0,0,null,"Rondes confirmées",{"$f":"SUM(BR21:CI21)","v":0},"Rondes confirmées",{"$f":"SUM(CK21+BQ21)","v":0},null,15,{"$f":"VLOOKUP(CO21,A7:B187,2)","v":"JAMOTTE Jean"},{"$f":"SUM(BQ63)","v":0},{"$f":"SUM(CK63)","v":1470},1470]
[null,null,null,{"$f":"SUM((D19+D20)*D21)","v":0},0,0,0,0,0,0,0,0,0,0,0,0,0,0,0,0,0,0,0,0,0,0,0,0,0,0,0,0,0,0,0,0,0,0,0,0,0,0,0,0,0,0,0,0,0,0,0,0,0,0,0,0,0,0,0,0,0,0,0,0,0,0,null,"Rondes effectuées",{"$f":"COUNTIF(D19:BN19,\">0\")","v":0},{"$f":"SUM((BR19+BR20)*BR21)","v":0},0,0,0,0,0,0,0,0,0,0,0,0,0,0,0,0,null,"Rondes Effectuées",{"$f":"COUNTIF(BR19:CH19,\">0\")","v":0},"Rondes effectuées",{"$f":"SUM(CK22+BQ22)","v":0},null,16,{"$f":"VLOOKUP(CO22,A7:B187,2)","v":"LAMBOTTE Didier"},{"$f":"SUM(BQ67)","v":0},{"$f":"SUM(CK67)","v":0},0]
[5,{"$f":"VLOOKUP(A23,'Numéro licences'!$H$4:$I$47,2)","v":"BRUNEAU Denis-Claude"},"Aller-Retour",null,null,null,null,null,null,null,null,null,null,null,null,null,null,null,null,null,null,null,null,null,null,null,null,null,null,null,null,null,null,null,null,null,null,null,null,null,null,null,null,null,null,null,null,null,null,null,null,null,null,null,null,null,null,null,null,null,null,null,null,null,null,null,{"$f":"SUM(D23:BN23)","v":0},"Km  renseignés",{"$f":"SUM(BO23+BO24)","v":0},1122,null,null,null,null,null,null,null,null,null,null,null,null,null,null,null,null,{"$f":"SUM(BR23:CH23)","v":1122},"Km  renseignés",{"$f":"SUM(CI23+CI24)","v":1379},"Km  renseignés",{"$f":"SUM(BQ23+CK23)","v":1379},null,17,{"$f":"VLOOKUP(CO23,A7:B187,2)","v":"LEFEVRE Francis"},{"$f":"SUM(BQ71)","v":0},{"$f":"SUM(CK71)","v":0},0]
[null,null,"Ronde",null,null,null,null,null,null,null,null,null,null,null,null,null,null,null,null,null,null,null,null,null,null,null,null,null,null,null,null,null,null,null,null,null,null,null,null,null,null,null,null,null,null,null,null,null,null,null,null,null,null,null,null,null,null,null,null,null,null,null,null,null,null,null,{"$f":"SUM(D24:BN24)","v":0},"Km confirmés",{"$f":"SUM(D26:BN26)","v":0},257,null,null,null,null,null,null,null,null,null,null,null,null,null,null,null,null,{"$f":"SUM(BR24:CH24)","v":257},"Km confirmés",{"$f":"SUM(BR26:CH26)","v":1379},"Km confirmés",{"$f":"SUM(CK24+BQ24)","v":1379},null,18,{"$f":"VLOOKUP(CO24,A7:B187,2)","v":"LESCAL Thierry"},{"$f":"SUM(BQ75)","v":0},{"$f":"SUM(CK75)","v":0},0]
[null,null,null,0,0,0,0,0,0,0,0,0,0,0,0,0,0,0,0,0,0,0,0,0,0,0,0,0,0,0,0,0,0,0,0,0,0,0,0,0,0,0,0,0,0,0,0,0,0,0,0,0,0,0,0,0,0,0,0,0,0,0,0,0,0,0,null,"Rondes confirmées",{"$f":"SUM(C25:BN25)","v":0},1,0,0,0,0,0,0,0,0,0,0,0,0,0,0,0,0,null,"Rondes confirmées",{"$f":"SUM(BR25:CI25)","v":1},"Rondes confirmées",{"$f":"SUM(CK25+BQ25)","v":1},null,19,{"$f":"VLOOKUP(CO25,A7:B187,2)","v":"MALLIEN Philippe"},{"$f":"SUM(BQ79)","v":0},{"$f":"SUM(CK79)","v":0},0]
[null,null,null,{"$f":"SUM((D23+D24)*D25)","v":0},0,0,0,0,0,0,0,0,0,0,0,0,0,0,0,0,0,0,0,0,0,0,0,0,0,0,0,0,0,0,0,0,0,0,0,0,0,0,0,0,0,0,0,0,0,0,0,0,0,0,0,0,0,0,0,0,0,0,0,0,0,0,null,"Rondes effectuées",{"$f":"COUNTIF(D23:BN23,\">0\")","v":0},{"$f":"SUM((BR23+BR24)*BR25)","v":1379},0,0,0,0,0,0,0,0,0,0,0,0,0,0,0,0,null,"Rondes Effectuées",{"$f":"COUNTIF(BR23:CH23,\">0\")","v":1},"Rondes effectuées",{"$f":"SUM(CK26+BQ26)","v":1},null,20,{"$f":"VLOOKUP(CO26,A7:B187,2)","v":"MARIEL Didier"},{"$f":"SUM(BQ83)","v":0},{"$f":"SUM(CK83)","v":0},0]
[6,{"$f":"VLOOKUP(A27,'Numéro licences'!$H$4:$I$47,2)","v":"DAVIN Philippe"},"Aller-Retour",null,null,null,null,null,null,null,null,null,null,null,null,null,null,null,null,null,null,null,null,null,null,null,null,null,null,null,null,null,null,null,null,null,null,null,null,null,null,null,null,null,null,null,null,null,null,null,null,null,null,null,null,null,null,null,null,null,null,null,null,null,null,null,{"$f":"SUM(D27:BN27)","v":0},"Km  renseignés",{"$f":"SUM(BO27+BO28)","v":0},1150,null,null,null,null,null,null,null,null,null,null,null,null,null,null,null,null,{"$f":"SUM(BR27:CH27)","v":1150},"Km  renseignés",{"$f":"SUM(CI27+CI28)","v":1407},"Km  renseignés",{"$f":"SUM(BQ27+CK27)","v":1407},null,21,{"$f":"VLOOKUP(CO27,A7:B187,2)","v":"MILET Benoit"},{"$f":"SUM(BQ87)","v":0},{"$f":"SUM(CK87)","v":532},532]
[null,null,"Ronde",null,null,null,null,null,null,null,null,null,null,null,null,null,null,null,null,null,null,null,null,null,null,null,null,null,null,null,null,null,null,null,null,null,null,null,null,null,null,null,null,null,null,null,null,null,null,null,null,null,null,null,null,null,null,null,null,null,null,null,null,null,null,null,{"$f":"SUM(D28:BN28)","v":0},"Km confirmés",{"$f":"SUM(D30:BN30)","v":0},257,null,null,null,null,null,null,null,null,null,null,null,null,null,null,null,null,{"$f":"SUM(BR28:CH28)","v":257},"Km confirmés",{"$f":"SUM(BR30:CH30)","v":1407},"Km confirmés",{"$f":"SUM(CK28+BQ28)","v":1407},null,22,{"$f":"VLOOKUP(CO28,A7:B187,2)","v":"NIHOUL Dany"},{"$f":"SUM(BQ91)","v":0},{"$f":"SUM(CK91)","v":1462},1462]
[null,null,null,0,0,0,0,0,0,0,0,0,0,0,0,0,0,0,0,0,0,0,0,0,0,0,0,0,0,0,0,0,0,0,0,0,0,0,0,0,0,0,0,0,0,0,0,0,0,0,0,0,0,0,0,0,0,0,0,0,0,0,0,0,0,0,null,"Rondes confirmées",{"$f":"SUM(C29:BN29)","v":0},1,0,0,0,0,0,0,0,0,0,0,0,0,0,0,0,0,null,"Rondes confirmées",{"$f":"SUM(BR29:CI29)","v":1},"Rondes confirmées",{"$f":"SUM(CK29+BQ29)","v":1},null,23,{"$f":"VLOOKUP(CO29,A7:B187,2)","v":"OVAERE Jimmy"},{"$f":"SUM(BQ95)","v":0},{"$f":"SUM(CK95)","v":0},0]
[null,null,null,{"$f":"SUM((D27+D28)*D29)","v":0},0,0,0,0,0,0,0,0,0,0,0,0,0,0,0,0,0,0,0,0,0,0,0,0,0,0,0,0,0,0,0,0,0,0,0,0,0,0,0,0,0,0,0,0,0,0,0,0,0,0,0,0,0,0,0,0,0,0,0,0,0,0,null,"Rondes effectuées",{"$f":"COUNTIF(D27:BN27,\">0\")","v":0},{"$f":"SUM((BR27+BR28)*BR29)","v":1407},0,0,0,0,0,0,0,0,0,0,0,0,0,0,0,0,null,"Rondes Effectuées",{"$f":"COUNTIF(BR27:CH27,\">0\")","v":1},"Rondes effectuées",{"$f":"SUM(CK30+BQ30)","v":1},null,24,{"$f":"VLOOKUP(CO30,A7:B187,2)","v":"PARMENTIER Dominique"},{"$f":"SUM(BQ99)","v":0},{"$f":"SUM(CK99)","v":0},0]
[7,{"$f":"VLOOKUP(A31,'Numéro licences'!$H$4:$I$47,2)","v":"DE SCHEPPERS Jean-Claude"},"Aller-Retour",null,null,null,null,null,null,null,null,null,null,null,null,null,null,null,null,null,null,null,null,null,null,null,null,null,null,null,null,null,null,null,null,null,null,null,null,null,null,null,null,null,null,null,null,null,null,null,null,null,null,null,null,null,null,null,null,null,null,null,null,null,null,null,{"$f":"SUM(D31:BN31)","v":0},"Km  renseignés",{"$f":"SUM(BO31+BO32)","v":0},null,null,null,null,null,null,null,null,null,null,null,null,null,null,null,null,null,{"$f":"SUM(BR31:CH31)","v":0},"Km  renseignés",{"$f":"SUM(CI31+CI32)","v":0},"Km  renseignés",{"$f":"SUM(BQ31+CK31)","v":0},null,25,{"$f":"VLOOKUP(CO31,A7:B187,2)","v":"POCHET Jean-Dominique"},{"$f":"SUM(BQ103)","v":0},{"$f":"SUM(CK103)","v":0},0]
[null,null,"Ronde",null,null,null,null,null,null,null,null,null,null,null,null,null,null,null,null,null,null,null,null,null,null,null,null,null,null,null,null,null,null,null,null,null,null,null,null,null,null,null,null,null,null,null,null,null,null,null,null,null,null,null,null,null,null,null,null,null,null,null,null,null,null,null,{"$f":"SUM(D32:BN32)","v":0},"Km confirmés",{"$f":"SUM(D34:BN34)","v":0},null,null,null,null,null,null,null,null,null,null,null,null,null,null,null,null,null,{"$f":"SUM(BR32:CH32)","v":0},"Km confirmés",{"$f":"SUM(BR34:CH34)","v":0},"Km confirmés",{"$f":"SUM(CK32+BQ32)","v":0},null,26,{"$f":"VLOOKUP(CO32,A7:B187,2)","v":"POMPIER Philippe"},{"$f":"SUM(BQ107)","v":0},{"$f":"SUM(CK107)","v":0},0]
[null,null,null,0,0,0,0,0,0,0,0,0,0,0,0,0,0,0,0,0,0,0,0,0,0,0,0,0,0,0,0,0,0,0,0,0,0,0,0,0,0,0,0,0,0,0,0,0,0,0,0,0,0,0,0,0,0,0,0,0,0,0,0,0,0,0,null,"Rondes confirmées",{"$f":"SUM(C33:BN33)","v":0},0,0,0,0,0,0,0,0,0,0,0,0,0,0,0,0,0,null,"Rondes confirmées",{"$f":"SUM(BR33:CI33)","v":0},"Rondes confirmées",{"$f":"SUM(CK33+BQ33)","v":0},null,27,{"$f":"VLOOKUP(CO33,A7:B187,2)","v":"RAMEAU Didier"},{"$f":"SUM(BQ111)","v":0},{"$f":"SUM(CK111)","v":0},0]
[null,null,null,{"$f":"SUM((D31+D32)*D33)","v":0},0,0,0,0,0,0,0,0,0,0,0,0,0,0,0,0,0,0,0,0,0,0,0,0,0,0,0,0,0,0,0,0,0,0,0,0,0,0,0,0,0,0,0,0,0,0,0,0,0,0,0,0,0,0,0,0,0,0,0,0,0,0,null,"Rondes effectuées",{"$f":"COUNTIF(D31:BN31,\">0\")","v":0},{"$f":"SUM((BR31+BR32)*BR33)","v":0},0,0,0,0,0,0,0,0,0,0,0,0,0,0,0,0,null,"Rondes Effectuées",{"$f":"COUNTIF(BR31:CH31,\">0\")","v":0},"Rondes effectuées",{"$f":"SUM(CK34+BQ34)","v":0},null,28,{"$f":"VLOOKUP(CO34,A7:B187,2)","v":"SPITAELS Bernard"},{"$f":"SUM(BQ115)","v":0},{"$f":"SUM(CK115)","v":0},0]
[8,{"$f":"VLOOKUP(A35,'Numéro licences'!$H$4:$I$47,2)","v":"DECUYPER Frédéric"},"Aller-Retour",null,null,null,null,null,null,null,null,null,null,null,null,null,null,null,null,null,null,null,null,null,null,null,null,null,null,null,null,null,null,null,null,null,null,null,null,null,null,null,null,null,null,null,null,null,null,null,null,null,null,null,null,null,null,null,null,null,null,null,null,null,null,null,{"$f":"SUM(D35:BN35)","v":0},"Km  renseignés",{"$f":"SUM(BO35+BO36)","v":0},null,null,null,null,null,null,null,null,null,null,null,null,null,null,null,null,null,{"$f":"SUM(BR35:CH35)","v":0},"Km  renseignés",{"$f":"SUM(CI35+CI36)","v":0},"Km  renseignés",{"$f":"SUM(BQ35+CK35)","v":0},null,29,{"$f":"VLOOKUP(CO35,A7:B187,2)","v":"TERWAGNE Freddy"},{"$f":"SUM(BQ119)","v":0},{"$f":"SUM(CK119)","v":0},0]
[null,null,"Ronde",null,null,null,null,null,null,null,null,null,null,null,null,null,null,null,null,null,null,null,null,null,null,null,null,null,null,null,null,null,null,null,null,null,null,null,null,null,null,null,null,null,null,null,null,null,null,null,null,null,null,null,null,null,null,null,null,null,null,null,null,null,null,null,{"$f":"SUM(D36:BN36)","v":0},"Km confirmés",{"$f":"SUM(D38:BN38)","v":0},null,null,null,null,null,null,null,null,null,null,null,null,null,null,null,null,null,{"$f":"SUM(BR36:CH36)","v":0},"Km confirmés",{"$f":"SUM(BR38:CH38)","v":0},"Km confirmés",{"$f":"SUM(CK36+BQ36)","v":0},null,30,{"$f":"VLOOKUP(CO36,A7:B187,2)","v":"TERWAGNE Julien"},{"$f":"SUM(BQ123)","v":0},{"$f":"SUM(CK123)","v":0},0]
[null,null,null,0,0,0,0,0,0,0,0,0,0,0,0,0,0,0,0,0,0,0,0,0,0,0,0,0,0,0,0,0,0,0,0,0,0,0,0,0,0,0,0,0,0,0,0,0,0,0,0,0,0,0,0,0,0,0,0,0,0,0,0,0,0,0,null,"Rondes confirmées",{"$f":"SUM(C37:BN37)","v":0},0,0,0,0,0,0,0,0,0,0,0,0,0,0,0,0,0,null,"Rondes confirmées",{"$f":"SUM(BR37:CI37)","v":0},"Rondes confirmées",{"$f":"SUM(CK37+BQ37)","v":0},null,31,{"$f":"VLOOKUP(CO37,A7:B187,2)","v":"THOMAS Isabelle"},{"$f":"SUM(BQ127)","v":0},{"$f":"SUM(CK127)","v":0},0]
[null,null,null,{"$f":"SUM((D35+D36)*D37)","v":0},0,0,0,0,0,0,0,0,0,0,0,0,0,0,0,0,0,0,0,0,0,0,0,0,0,0,0,0,0,0,0,0,0,0,0,0,0,0,0,0,0,0,0,0,0,0,0,0,0,0,0,0,0,0,0,0,0,0,0,0,0,0,null,"Rondes effectuées",{"$f":"COUNTIF(D35:BN35,\">0\")","v":0},{"$f":"SUM((BR35+BR36)*BR37)","v":0},0,0,0,0,0,0,0,0,0,0,0,0,0,0,0,0,null,"Rondes Effectuées",{"$f":"COUNTIF(BR35:CH35,\">0\")","v":0},"Rondes effectuées",{"$f":"SUM(CK38+BQ38)","v":0},null,32,{"$f":"VLOOKUP(CO38,A7:B187,2)","v":"URBAIN Philippe"},{"$f":"SUM(BQ131)","v":0},{"$f":"SUM(CK131)","v":1417},1417]
[9,{"$f":"VLOOKUP(A39,'Numéro licences'!$H$4:$I$47,2)","v":"DEWAERSEGHERS Francis"},"Aller-Retour",null,null,null,null,null,null,null,null,null,null,null,null,null,null,null,null,null,null,null,null,null,null,null,null,null,null,null,null,null,null,null,null,null,null,null,null,null,null,null,null,null,null,null,null,null,null,null,null,null,null,null,null,null,null,null,null,null,null,null,null,null,null,null,{"$f":"SUM(D39:BN39)","v":0},"Km  renseignés",{"$f":"SUM(BO39+BO40)","v":0},null,null,null,null,null,null,null,null,null,null,null,null,null,null,null,null,null,{"$f":"SUM(BR39:CH39)","v":0},"Km  renseignés",{"$f":"SUM(CI39+CI40)","v":0},"Km  renseignés",{"$f":"SUM(BQ39+CK39)","v":0},null,33,{"$f":"VLOOKUP(CO39,A7:B187,2)","v":"VANBELLINGEN Jean-Claude"},{"$f":"SUM(BQ135)","v":0},{"$f":"SUM(CK135)","v":0},0]
[null,null,"Ronde",null,null,null,null,null,null,null,null,null,null,null,null,null,null,null,null,null,null,null,null,null,null,null,null,null,null,null,null,null,null,null,null,null,null,null,null,null,null,null,null,null,null,null,null,null,null,null,null,null,null,null,null,null,null,null,null,null,null,null,null,null,null,null,{"$f":"SUM(D40:BN40)","v":0},"Km confirmés",{"$f":"SUM(D42:BN42)","v":0},null,null,null,null,null,null,null,null,null,null,null,null,null,null,null,null,null,{"$f":"SUM(BR40:CH40)","v":0},"Km confirmés",{"$f":"SUM(BR42:CH42)","v":0},"Km confirmés",{"$f":"SUM(CK40+BQ40)","v":0},null,34,{"$f":"VLOOKUP(CO40,A7:B187,2)","v":"VANDEN BOSSCHE Vincent"},{"$f":"SUM(BQ139)","v":0},{"$f":"SUM(CK139)","v":0},0]
[null,null,null,0,0,0,0,0,0,0,0,0,0,0,0,0,0,0,0,0,0,0,0,0,0,0,0,0,0,0,0,0,0,0,0,0,0,0,0,0,0,0,0,0,0,0,0,0,0,0,0,0,0,0,0,0,0,0,0,0,0,0,0,0,0,0,null,"Rondes confirmées",{"$f":"SUM(C41:BN41)","v":0},0,0,0,0,0,0,0,0,0,0,0,0,0,0,0,0,0,null,"Rondes confirmées",{"$f":"SUM(BR41:CI41)","v":0},"Rondes confirmées",{"$f":"SUM(CK41+BQ41)","v":0},null,35,{"$f":"VLOOKUP(CO41,A7:B187,2)","v":"VANDEN WAEYENBERGH Michel"},{"$f":"SUM(BQ143)","v":0},{"$f":"SUM(CK143)","v":0},0]
[null,null,null,{"$f":"SUM((D39+D40)*D41)","v":0},0,0,0,0,0,0,0,0,0,0,0,0,0,0,0,0,0,0,0,0,0,0,0,0,0,0,0,0,0,0,0,0,0,0,0,0,0,0,0,0,0,0,0,0,0,0,0,0,0,0,0,0,0,0,0,0,0,0,0,0,0,0,null,"Rondes effectuées",{"$f":"COUNTIF(D39:BN39,\">0\")","v":0},{"$f":"SUM((BR39+BR40)*BR41)","v":0},0,0,0,0,0,0,0,0,0,0,0,0,0,0,0,0,null,"Rondes Effectuées",{"$f":"COUNTIF(BR39:CH39,\">0\")","v":0},"Rondes effectuées",{"$f":"SUM(CK42+BQ42)","v":0},null,36,{"$f":"VLOOKUP(CO42,A7:B187,2)","v":"VANSTEYVOORT André"},{"$f":"SUM(BQ147)","v":0},{"$f":"SUM(CK147)","v":0},0]
[10,{"$f":"VLOOKUP(A43,'Numéro licences'!$H$4:$I$47,2)","v":"DHONDT Jerry"},"Aller-Retour",null,null,null,null,null,null,null,null,null,null,null,null,null,null,null,null,null,null,null,null,null,null,null,null,null,null,null,null,null,null,null,null,null,null,null,null,null,null,null,null,null,null,null,null,null,null,null,null,null,null,null,null,null,null,null,null,null,null,null,null,null,null,null,{"$f":"SUM(D43:BN43)","v":0},"Km  renseignés",{"$f":"SUM(BO43+BO44)","v":0},null,null,null,null,null,null,null,null,null,null,null,null,null,null,null,null,null,{"$f":"SUM(BR43:CH43)","v":0},"Km  renseignés",{"$f":"SUM(CI43+CI44)","v":0},"Km  renseignés",{"$f":"SUM(BQ43+CK43)","v":0},null,37,{"$f":"VLOOKUP(CO43,A7:B187,2)","v":"WOUTERS Olivier"},{"$f":"SUM(BQ151)","v":0},{"$f":"SUM(CK151)","v":0},0]
[null,null,"Ronde",null,null,null,null,null,null,null,null,null,null,null,null,null,null,null,null,null,null,null,null,null,null,null,null,null,null,null,null,null,null,null,null,null,null,null,null,null,null,null,null,null,null,null,null,null,null,null,null,null,null,null,null,null,null,null,null,null,null,null,null,null,null,null,{"$f":"SUM(D44:BN44)","v":0},"Km confirmés",{"$f":"SUM(D46:BN46)","v":0},null,null,null,null,null,null,null,null,null,null,null,null,null,null,null,null,null,{"$f":"SUM(BR44:CH44)","v":0},"Km confirmés",{"$f":"SUM(BR46:CH46)","v":0},"Km confirmés",{"$f":"SUM(CK44+BQ44)","v":0},null,38,{"$f":"VLOOKUP(CO44,A7:B187,2)","v":"DEMETS Eric"},{"$f":"SUM(BQ155)","v":0},{"$f":"SUM(CK155)","v":0},0]
[null,null,null,0,0,0,0,0,0,0,0,0,0,0,0,0,0,0,0,0,0,0,0,0,0,0,0,0,0,0,0,0,0,0,0,0,0,0,0,0,0,0,0,0,0,0,0,0,0,0,0,0,0,0,0,0,0,0,0,0,0,0,0,0,0,0,null,"Rondes confirmées",{"$f":"SUM(C45:BN45)","v":0},0,0,0,0,0,0,0,0,0,0,0,0,0,0,0,0,0,null,"Rondes confirmées",{"$f":"SUM(BR45:CI45)","v":0},"Rondes confirmées",{"$f":"SUM(CK45+BQ45)","v":0},null,39,{"$f":"VLOOKUP(CO45,A7:B187,2)","v":"DECELLE Hubert"},{"$f":"SUM(BQ159)","v":0},{"$f":"SUM(CK159)","v":0},0]
[null,null,null,{"$f":"SUM((D43+D44)*D45)","v":0},0,0,0,0,0,0,0,0,0,0,0,0,0,0,0,0,0,0,0,0,0,0,0,0,0,0,0,0,0,0,0,0,0,0,0,0,0,0,0,0,{"$f":"SUM((AS43+AS44)*AS45)","v":0},0,0,0,0,0,0,0,0,0,0,0,0,0,0,0,0,0,0,0,0,0,null,"Rondes effectuées",{"$f":"COUNTIF(D43:BN43,\">0\")","v":0},{"$f":"SUM((BR43+BR44)*BR45)","v":0},0,0,0,0,0,0,0,0,0,0,0,0,0,0,0,0,null,"Rondes Effectuées",{"$f":"COUNTIF(BR43:CH43,\">0\")","v":0},"Rondes effectuées",{"$f":"SUM(CK46+BQ46)","v":0},null,40,{"$f":"VLOOKUP(CO46,A7:B187,2)","v":0},{"$f":"SUM(BQ163)","v":0},{"$f":"SUM(CK163)","v":0},0]
[11,{"$f":"VLOOKUP(A47,'Numéro licences'!$H$4:$I$47,2)","v":"DONY Marc"},"Aller-Retour",null,null,null,null,null,null,null,null,null,null,null,null,null,null,null,null,null,null,null,null,null,null,null,null,null,null,null,null,null,null,null,null,null,null,null,null,null,null,null,null,null,null,null,null,null,null,null,null,null,null,null,null,null,null,null,null,null,null,null,null,null,null,null,{"$f":"SUM(D47:BN47)","v":0},"Km  renseignés",{"$f":"SUM(BO47+BO48)","v":0},1183,1242,null,null,null,null,null,null,null,null,null,null,null,null,null,null,null,{"$f":"SUM(BR47:CH47)","v":2425},"Km  renseignés",{"$f":"SUM(CI47+CI48)","v":2682},"Km  renseignés",{"$f":"SUM(BQ47+CK47)","v":2682},null,41,{"$f":"VLOOKUP(CO47,A7:B187,2)","v":0},{"$f":"SUM(BQ167)","v":0},{"$f":"SUM(CK167)","v":0},0]
[null,null,"Ronde",null,null,null,null,null,null,null,null,null,null,null,null,null,null,null,null,null,null,null,null,null,null,null,null,null,null,null,null,null,null,null,null,null,null,null,null,null,null,null,null,null,null,null,null,null,null,null,null,null,null,null,null,null,null,null,null,null,null,null,null,null,null,null,{"$f":"SUM(D48:BN48)","v":0},"Km confirmés",{"$f":"SUM(D50:BN50)","v":0},257,null,null,null,null,null,null,null,null,null,null,null,null,null,null,null,null,{"$f":"SUM(BR48:CH48)","v":257},"Km confirmés",{"$f":"SUM(BR50:CH50)","v":2682},"Km confirmés",{"$f":"SUM(CK48+BQ48)","v":2682},null,42,{"$f":"VLOOKUP(CO48,A7:B187,2)","v":0},{"$f":"SUM(BQ171)","v":0},{"$f":"SUM(CK171)","v":0},0]
[null,null,null,0,0,0,0,0,0,0,0,0,0,0,0,0,0,0,0,0,0,0,0,0,0,0,0,0,0,0,0,0,0,0,0,0,0,0,0,0,0,0,0,0,0,0,0,0,0,0,0,0,0,0,0,0,0,0,0,0,0,0,0,0,0,0,null,"Rondes confirmées",{"$f":"SUM(C49:BN49)","v":0},1,1,0,0,0,0,0,0,0,0,0,0,0,0,0,0,0,null,"Rondes confirmées",{"$f":"SUM(BR49:CI49)","v":2},"Rondes confirmées",{"$f":"SUM(CK49+BQ49)","v":2},null,43,{"$f":"VLOOKUP(CO49,A7:B187,2)","v":0},{"$f":"SUM(BQ175)","v":0},{"$f":"SUM(CK175)","v":0},0]
[null,null,null,{"$f":"SUM((D47+D48)*D49)","v":0},0,0,0,0,0,0,0,0,0,0,0,0,0,0,0,0,0,0,0,0,0,0,0,0,0,0,0,0,0,0,0,0,0,0,0,0,0,0,0,0,0,0,0,0,0,0,0,0,0,0,0,0,0,0,0,0,0,0,0,0,0,0,null,"Rondes effectuées",{"$f":"COUNTIF(D47:BN47,\">0\")","v":0},{"$f":"SUM((BR47+BR48)*BR49)","v":1440},1242,0,0,0,0,0,0,0,0,0,0,0,0,0,0,0,null,"Rondes Effectuées",{"$f":"COUNTIF(BR47:CH47,\">0\")","v":2},"Rondes effectuées",{"$f":"SUM(CK50+BQ50)","v":2},null,44,{"$f":"VLOOKUP(CO50,A7:B187,2)","v":0},{"$f":"SUM(BQ179)","v":0},{"$f":"SUM(CK179)","v":0},0]
[12,{"$f":"VLOOKUP(A51,'Numéro licences'!$H$4:$I$47,2)","v":"DUMONT Christophe"},"Aller-Retour",null,null,null,null,null,null,null,null,null,null,null,null,null,null,null,null,null,null,null,null,null,null,null,null,null,null,null,null,null,null,null,null,null,null,null,null,null,null,null,null,null,null,null,null,null,null,null,null,null,null,null,null,null,null,null,null,null,null,null,null,null,null,null,{"$f":"SUM(D51:BN51)","v":0},"Km  renseignés",{"$f":"SUM(BO51+BO52)","v":0},null,null,null,null,null,null,null,null,null,null,null,null,null,null,null,null,null,{"$f":"SUM(BR51:CH51)","v":0},"Km  renseignés",{"$f":"SUM(CI51+CI52)","v":0},"Km  renseignés",{"$f":"SUM(BQ51+CK51)","v":0},null,45,{"$f":"VLOOKUP(CO51,A7:B187,2)","v":0},{"$f":"SUM(BQ183)","v":0},{"$f":"SUM(CK183)","v":0},0]
[null,null,"Ronde",null,null,null,null,null,null,null,null,null,null,null,null,null,null,null,null,null,null,null,null,null,null,null,null,null,null,null,null,null,null,null,null,null,null,null,null,null,null,null,null,null,null,null,null,null,null,null,null,null,null,null,null,null,null,null,null,null,null,null,null,null,null,null,{"$f":"SUM(D52:BN52)","v":0},"Km confirmés",{"$f":"SUM(D54:BN54)","v":0},null,null,null,null,null,null,null,null,null,null,null,null,null,null,null,null,null,{"$f":"SUM(BR52:CH52)","v":0},"Km confirmés",{"$f":"SUM(BR54:CH54)","v":0},"Km confirmés",{"$f":"SUM(CK52+BQ52)","v":0},null,46,{"$f":"VLOOKUP(CO52,A7:B187,2)","v":0},{"$f":"SUM(BQ187)","v":0},{"$f":"SUM(CK187)","v":0},0]
[null,null,null,0,0,0,0,0,0,0,0,0,0,0,0,0,0,0,0,0,0,0,0,0,0,0,0,0,0,0,0,0,0,0,0,0,0,0,0,0,0,0,0,0,0,0,0,0,0,0,0,0,0,0,0,0,0,0,0,0,0,0,0,0,0,0,null,"Rondes confirmées",{"$f":"SUM(C53:BN53)","v":0},0,0,0,0,0,0,0,0,0,0,0,0,0,0,0,0,0,null,"Rondes confirmées",{"$f":"SUM(BR53:CI53)","v":0},"Rondes confirmées",{"$f":"SUM(CK53+BQ53)","v":0}]
[null,null,null,{"$f":"SUM((D51+D52)*D53)","v":0},0,0,0,0,0,0,0,0,0,0,0,0,0,0,0,0,0,0,0,0,0,0,0,0,0,0,0,0,0,0,0,0,0,0,0,0,0,0,0,0,0,0,0,0,0,0,0,0,0,0,0,0,0,0,0,0,0,0,0,0,0,0,null,"Rondes effectuées",{"$f":"COUNTIF(D51:BN51,\">0\")","v":0},{"$f":"SUM((BR51+BR52)*BR53)","v":0},0,0,0,0,0,0,0,0,0,0,0,0,0,0,0,0,null,"Rondes Effectuées",{"$f":"COUNTIF(BR51:CH51,\">0\")","v":0},"Rondes effectuées",{"$f":"SUM(CK54+BQ54)","v":0}]
[13,{"$f":"VLOOKUP(A55,'Numéro licences'!$H$4:$I$47,2)","v":"FAVRESSSE René"},"Aller-Retour",null,null,null,null,null,null,null,null,null,null,null,null,null,null,null,null,null,null,null,null,null,null,null,null,null,null,null,null,null,null,null,null,null,null,null,null,null,null,null,null,null,null,null,null,null,null,null,null,null,null,null,null,null,null,null,null,null,null,null,null,null,null,null,{"$f":"SUM(D55:BN55)","v":0},"Km  renseignés",{"$f":"SUM(BO55+BO56)","v":0},null,null,null,null,null,null,null,null,null,null,null,null,null,null,null,null,null,{"$f":"SUM(BR55:CH55)","v":0},"Km  renseignés",{"$f":"SUM(CI55+CI56)","v":0},"Km  renseignés",{"$f":"SUM(BQ55+CK55)","v":0}]
[null,null,"Ronde",null,null,null,null,null,null,null,null,null,null,null,null,null,null,null,null,null,null,null,null,null,null,null,null,null,null,null,null,null,null,null,null,null,null,null,null,null,null,null,null,null,null,null,null,null,null,null,null,null,null,null,null,null,null,null,null,null,null,null,null,null,null,null,{"$f":"SUM(D56:BN56)","v":0},"Km confirmés",{"$f":"SUM(D58:BN58)","v":0},null,null,null,null,null,null,null,null,null,null,null,null,null,null,null,null,null,{"$f":"SUM(BR56:CH56)","v":0},"Km confirmés",{"$f":"SUM(BR58:CH58)","v":0},"Km confirmés",{"$f":"SUM(CK56+BQ56)","v":0}]
[null,null,null,0,0,0,0,0,0,0,0,0,0,0,0,0,0,0,0,0,0,0,0,0,0,0,0,0,0,0,0,0,0,0,0,0,0,0,0,0,0,0,0,0,0,0,0,0,0,0,0,0,0,0,0,0,0,0,0,0,0,0,0,0,0,0,null,"Rondes confirmées",{"$f":"SUM(C57:BN57)","v":0},0,0,0,0,0,0,0,0,0,0,0,0,0,0,0,0,0,null,"Rondes confirmées",{"$f":"SUM(BR57:CI57)","v":0},"Rondes confirmées",{"$f":"SUM(CK57+BQ57)","v":0}]
[null,null,null,{"$f":"SUM((D55+D56)*D57)","v":0},0,0,0,0,0,0,0,0,0,0,0,0,0,0,0,0,0,0,0,0,0,0,0,0,0,0,0,0,0,0,0,0,0,0,0,0,0,0,0,0,0,0,0,0,0,0,0,0,0,0,0,0,0,0,0,0,0,0,0,0,0,0,null,"Rondes effectuées",{"$f":"COUNTIF(D55:BN55,\">0\")","v":0},{"$f":"SUM((BR55+BR56)*BR57)","v":0},0,0,0,0,0,0,0,0,0,0,0,0,0,0,0,0,null,"Rondes Effectuées",{"$f":"COUNTIF(BR55:CH55,\">0\")","v":0},"Rondes effectuées",{"$f":"SUM(CK58+BQ58)","v":0},null,null,null,{"$f":"SUM(CQ8:CQ52)","v":0},{"$f":"SUM(CR8:CR52)","v":10349},{"$f":"SUM(CS7:CS52)","v":10349}]
[14,{"$f":"VLOOKUP(A59,'Numéro licences'!$H$4:$I$47,2)","v":"GOFFIN Amaury"},"Aller-Retour",null,null,null,null,null,null,null,null,null,null,null,null,null,null,null,null,null,null,null,null,null,null,null,null,null,null,null,null,null,null,null,null,null,null,null,null,null,null,null,null,null,null,null,null,null,null,null,null,null,null,null,null,null,null,null,null,null,null,null,null,null,null,null,{"$f":"SUM(D59:BN59)","v":0},"Km  renseignés",{"$f":"SUM(BO59+BO60)","v":0},null,null,null,null,null,null,null,null,null,null,null,null,null,null,null,null,null,{"$f":"SUM(BR59:CH59)","v":0},"Km  renseignés",{"$f":"SUM(CI59+CI60)","v":0},"Km  renseignés",{"$f":"SUM(BQ59+CK59)","v":0},null,null,null,{"$f":"SUM(CQ58/CS58)","v":0},{"$f":"SUM(CR58/CS58)","v":1}]
[null,null,"Ronde",null,null,null,null,null,null,null,null,null,null,null,null,null,null,null,null,null,null,null,null,null,null,null,null,null,null,null,null,null,null,null,null,null,null,null,null,null,null,null,null,null,null,null,null,null,null,null,null,null,null,null,null,null,null,null,null,null,null,null,null,null,null,null,{"$f":"SUM(D60:BN60)","v":0},"Km confirmés",{"$f":"SUM(D62:BN62)","v":0},null,null,null,null,null,null,null,null,null,null,null,null,null,null,null,null,null,{"$f":"SUM(BR60:CH60)","v":0},"Km confirmés",{"$f":"SUM(BR62:CH62)","v":0},"Km confirmés",{"$f":"SUM(CK60+BQ60)","v":0},null,null,null,"FMB","Hors FMB"]
[null,null,null,0,0,0,0,0,0,0,0,0,0,0,0,0,0,0,0,0,0,0,0,0,0,0,0,0,0,0,0,0,0,0,0,0,0,0,0,0,0,0,0,0,0,0,0,0,0,0,0,0,0,0,0,0,0,0,0,0,0,0,0,0,0,0,null,"Rondes confirmées",{"$f":"SUM(C61:BN61)","v":0},0,0,0,0,0,0,0,0,0,0,0,0,0,0,0,0,0,null,"Rondes confirmées",{"$f":"SUM(BR61:CI61)","v":0},"Rondes confirmées",{"$f":"SUM(CK61+BQ61)","v":0}]
[null,null,null,{"$f":"SUM((D59+D60)*D61)","v":0},0,0,0,0,0,0,0,0,0,0,0,0,0,0,0,0,0,0,0,0,0,0,0,0,0,0,0,0,0,0,0,0,0,0,0,0,0,0,0,0,0,0,0,0,0,0,0,0,0,0,0,0,0,0,0,0,0,0,0,0,0,0,null,"Rondes effectuées",{"$f":"COUNTIF(D59:BN59,\">0\")","v":0},{"$f":"SUM((BR59+BR60)*BR61)","v":0},0,0,0,0,0,0,0,0,0,0,0,0,0,0,0,0,null,"Rondes Effectuées",{"$f":"COUNTIF(BR59:CH59,\">0\")","v":0},"Rondes effectuées",{"$f":"SUM(CK62+BQ62)","v":0}]
[15,{"$f":"VLOOKUP(A63,'Numéro licences'!$H$4:$I$47,2)","v":"JAMOTTE Jean"},"Aller-Retour",null,null,null,null,null,null,null,null,null,null,null,null,null,null,null,null,null,null,null,null,null,null,null,null,null,null,null,null,null,null,null,null,null,null,null,null,null,null,null,null,null,null,null,null,null,null,null,null,null,null,null,null,null,null,null,null,null,null,null,null,null,null,null,{"$f":"SUM(D63:BN63)","v":0},"Km  renseignés",{"$f":"SUM(BO63+BO64)","v":0},1213,null,null,null,null,null,null,null,null,null,null,null,null,null,null,null,null,{"$f":"SUM(BR63:CH63)","v":1213},"Km  renseignés",{"$f":"SUM(CI63+CI64)","v":1470},"Km  renseignés",{"$f":"SUM(BQ63+CK63)","v":1470}]
[null,null,"Ronde",null,null,null,null,null,null,null,null,null,null,null,null,null,null,null,null,null,null,null,null,null,null,null,null,null,null,null,null,null,null,null,null,null,null,null,null,null,null,null,null,null,null,null,null,null,null,null,null,null,null,null,null,null,null,null,null,null,null,null,null,null,null,null,{"$f":"SUM(D64:BN64)","v":0},"Km confirmés",{"$f":"SUM(D66:BN66)","v":0},257,null,null,null,null,null,null,null,null,null,null,null,null,null,null,null,null,{"$f":"SUM(BR64:CH64)","v":257},"Km confirmés",{"$f":"SUM(BR66:CH66)","v":1470},"Km confirmés",{"$f":"SUM(CK64+BQ64)","v":1470}]
[null,null,null,0,0,0,0,0,0,0,0,0,0,0,0,0,0,0,0,0,0,0,0,0,0,0,0,0,0,0,0,0,0,0,0,0,0,0,0,0,0,0,0,0,0,0,0,0,0,0,0,0,0,0,0,0,0,0,0,0,0,0,0,0,0,0,null,"Rondes confirmées",{"$f":"SUM(C65:BN65)","v":0},1,0,0,0,0,0,0,0,0,0,0,0,0,0,0,0,0,null,"Rondes confirmées",{"$f":"SUM(BR65:CI65)","v":1},"Rondes confirmées",{"$f":"SUM(CK65+BQ65)","v":1}]
[null,null,null,{"$f":"SUM((D63+D64)*D65)","v":0},0,0,0,0,0,0,0,0,0,0,0,0,0,0,0,0,0,0,0,0,0,0,0,0,0,0,0,0,0,0,0,0,0,0,0,0,0,0,0,0,0,0,0,0,0,0,0,0,0,0,0,0,0,0,0,0,0,0,0,0,0,0,null,"Rondes effectuées",{"$f":"COUNTIF(D63:BN63,\">0\")","v":0},{"$f":"SUM((BR63+BR64)*BR65)","v":1470},0,0,0,0,0,0,0,0,0,0,0,0,0,0,0,0,null,"Rondes Effectuées",{"$f":"COUNTIF(BR63:CH63,\">0\")","v":1},"Rondes effectuées",{"$f":"SUM(CK66+BQ66)","v":1}]
[16,{"$f":"VLOOKUP(A67,'Numéro licences'!$H$4:$I$47,2)","v":"LAMBOTTE Didier"},"Aller-Retour",null,null,null,null,null,null,null,null,null,null,null,null,null,null,null,null,null,null,null,null,null,null,null,null,null,null,null,null,null,null,null,null,null,null,null,null,null,null,null,null,null,null,null,null,null,null,null,null,null,null,null,null,null,null,null,null,null,null,null,null,null,null,null,{"$f":"SUM(D67:BN67)","v":0},"Km  renseignés",{"$f":"SUM(BO67+BO68)","v":0},null,null,null,null,null,null,null,null,null,null,null,null,null,null,null,null,null,{"$f":"SUM(BR67:CH67)","v":0},"Km  renseignés",{"$f":"SUM(CI67+CI68)","v":0},"Km  renseignés",{"$f":"SUM(BQ67+CK67)","v":0}]
[null,null,"Ronde",null,null,null,null,null,null,null,null,null,null,null,null,null,null,null,null,null,null,null,null,null,null,null,null,null,null,null,null,null,null,null,null,null,null,null,null,null,null,null,null,null,null,null,null,null,null,null,null,null,null,null,null,null,null,null,null,null,null,null,null,null,null,null,{"$f":"SUM(D68:BN68)","v":0},"Km confirmés",{"$f":"SUM(D70:BN70)","v":0},null,null,null,null,null,null,null,null,null,null,null,null,null,null,null,null,null,{"$f":"SUM(BR68:CH68)","v":0},"Km confirmés",{"$f":"SUM(BR70:CH70)","v":0},"Km confirmés",{"$f":"SUM(CK68+BQ68)","v":0}]
[null,null,null,0,0,0,0,0,0,0,0,0,0,0,0,0,0,0,0,0,0,0,0,0,0,0,0,0,0,0,0,0,0,0,0,0,0,0,0,0,0,0,0,0,0,0,0,0,0,0,0,0,0,0,0,0,0,0,0,0,0,0,0,0,0,0,null,"Rondes confirmées",{"$f":"SUM(C69:BN69)","v":0},0,0,0,0,0,0,0,0,0,0,0,0,0,0,0,0,0,null,"Rondes confirmées",{"$f":"SUM(BR69:CI69)","v":0},"Rondes confirmées",{"$f":"SUM(CK69+BQ69)","v":0}]
[null,null,null,{"$f":"SUM((D67+D68)*D69)","v":0},0,0,0,0,0,0,0,0,0,0,0,0,0,0,0,0,0,0,0,0,0,0,0,0,0,0,0,0,0,0,0,0,0,0,0,0,0,0,0,0,0,0,0,0,0,0,0,0,0,0,0,0,0,0,0,0,0,0,0,0,0,0,null,"Rondes effectuées",{"$f":"COUNTIF(D67:BN67,\">0\")","v":0},{"$f":"SUM((BR67+BR68)*BR69)","v":0},0,0,0,0,0,0,0,0,0,0,0,0,0,0,0,0,null,"Rondes Effectuées",{"$f":"COUNTIF(BR67:CH67,\">0\")","v":0},"Rondes effectuées",{"$f":"SUM(CK70+BQ70)","v":0}]
[17,{"$f":"VLOOKUP(A71,'Numéro licences'!$H$4:$I$47,2)","v":"LEFEVRE Francis"},"Aller-Retour",null,null,null,null,null,null,null,null,null,null,null,null,null,null,null,null,null,null,null,null,null,null,null,null,null,null,null,null,null,null,null,null,null,null,null,null,null,null,null,null,null,null,null,null,null,null,null,null,null,null,null,null,null,null,null,null,null,null,null,null,null,null,null,{"$f":"SUM(D71:BN71)","v":0},"Km  renseignés",{"$f":"SUM(BO71+BO72)","v":0},null,null,null,null,null,null,null,null,null,null,null,null,null,null,null,null,null,{"$f":"SUM(BR71:CH71)","v":0},"Km  renseignés",{"$f":"SUM(CI71+CI72)","v":0},"Km  renseignés",{"$f":"SUM(BQ71+CK71)","v":0}]
[null,null,"Ronde",null,null,null,null,null,null,null,null,null,null,null,null,null,null,null,null,null,null,null,null,null,null,null,null,null,null,null,null,null,null,null,null,null,null,null,null,null,null,null,null,null,null,null,null,null,null,null,null,null,null,null,null,null,null,null,null,null,null,null,null,null,null,null,{"$f":"SUM(D72:BN72)","v":0},"Km confirmés",{"$f":"SUM(D74:BN74)","v":0},null,null,null,null,null,null,null,null,null,null,null,null,null,null,null,null,null,{"$f":"SUM(BR72:CH72)","v":0},"Km confirmés",{"$f":"SUM(BR74:CH74)","v":0},"Km confirmés",{"$f":"SUM(CK72+BQ72)","v":0}]
[null,null,null,0,0,0,0,0,0,0,0,0,0,0,0,0,0,0,0,0,0,0,0,0,0,0,0,0,0,0,0,0,0,0,0,0,0,0,0,0,0,0,0,0,0,0,0,0,0,0,0,0,0,0,0,0,0,0,0,0,0,0,0,0,0,0,null,"Rondes confirmées",{"$f":"SUM(C73:BN73)","v":0},0,0,0,0,0,0,0,0,0,0,0,0,0,0,0,0,0,null,"Rondes confirmées",{"$f":"SUM(BR73:CI73)","v":0},"Rondes confirmées",{"$f":"SUM(CK73+BQ73)","v":0}]
[null,null,null,{"$f":"SUM((D71+D72)*D73)","v":0},0,0,0,0,0,0,0,0,0,0,0,0,0,0,0,0,0,0,0,0,0,0,0,0,0,0,0,0,0,0,0,0,0,0,0,0,0,0,0,0,0,0,0,0,0,0,0,0,0,0,0,0,0,0,0,0,0,0,0,0,0,0,null,"Rondes effectuées",{"$f":"COUNTIF(D71:BN71,\">0\")","v":0},{"$f":"SUM((BR71+BR72)*BR73)","v":0},{"$f":"SUM((BS71+BS72)*BS73)","v":0},0,0,0,0,0,0,0,0,0,0,0,0,0,0,0,null,"Rondes Effectuées",{"$f":"COUNTIF(BR71:CH71,\">0\")","v":0},"Rondes effectuées",{"$f":"SUM(CK74+BQ74)","v":0}]
[18,{"$f":"VLOOKUP(A75,'Numéro licences'!$H$4:$I$47,2)","v":"LESCAL Thierry"},"Aller-Retour",null,null,null,null,null,null,null,null,null,null,null,null,null,null,null,null,null,null,null,null,null,null,null,null,null,null,null,null,null,null,null,null,null,null,null,null,null,null,null,null,null,null,null,null,null,null,null,null,null,null,null,null,null,null,null,null,null,null,null,null,null,null,null,{"$f":"SUM(D75:BN75)","v":0},"Km  renseignés",{"$f":"SUM(BO75+BO76)","v":0},null,null,null,null,null,null,null,null,null,null,null,null,null,null,null,null,null,{"$f":"SUM(BR75:CH75)","v":0},"Km  renseignés",{"$f":"SUM(CI75+CI76)","v":0},"Km  renseignés",{"$f":"SUM(BQ75+CK75)","v":0}]
[null,null,"Ronde",null,null,null,null,null,null,null,null,null,null,null,null,null,null,null,null,null,null,null,null,null,null,null,null,null,null,null,null,null,null,null,null,null,null,null,null,null,null,null,null,null,null,null,null,null,null,null,null,null,null,null,null,null,null,null,null,null,null,null,null,null,null,null,{"$f":"SUM(D76:BN76)","v":0},"Km confirmés",{"$f":"SUM(D78:BN78)","v":0},null,null,null,null,null,null,null,null,null,null,null,null,null,null,null,null,null,{"$f":"SUM(BR76:CH76)","v":0},"Km confirmés",{"$f":"SUM(BR78:CH78)","v":0},"Km confirmés",{"$f":"SUM(CK76+BQ76)","v":0}]
[null,null,null,0,0,0,0,0,0,0,0,0,0,0,0,0,0,0,0,0,0,0,0,0,0,0,0,0,0,0,0,0,0,0,0,0,0,0,0,0,0,0,0,0,0,0,0,0,0,0,0,0,0,0,0,0,0,0,0,0,0,0,0,0,0,0,null,"Rondes confirmées",{"$f":"SUM(C77:BN77)","v":0},0,0,0,0,0,0,0,0,0,0,0,0,0,0,0,0,0,null,"Rondes confirmées",{"$f":"SUM(BR77:CI77)","v":0},"Rondes confirmées",{"$f":"SUM(CK77+BQ77)","v":0}]
[null,null,null,{"$f":"SUM((D75+D76)*D77)","v":0},0,0,0,0,0,0,0,0,0,0,0,0,0,0,0,0,0,0,0,0,0,0,0,0,0,0,0,0,0,0,0,0,0,0,0,0,0,0,0,0,0,0,0,0,0,0,0,0,0,0,0,0,0,0,0,0,0,0,0,0,0,0,null,"Rondes effectuées",{"$f":"COUNTIF(D75:BN75,\">0\")","v":0},{"$f":"SUM((BR75+BR76)*BR77)","v":0},{"$f":"SUM((BS75+BS76)*BS77)","v":0},0,0,0,0,0,0,0,0,0,0,0,0,0,0,0,null,"Rondes Effectuées",{"$f":"COUNTIF(BR75:CH75,\">0\")","v":0},"Rondes effectuées",{"$f":"SUM(CK78+BQ78)","v":0}]
[19,{"$f":"VLOOKUP(A79,'Numéro licences'!$H$4:$I$47,2)","v":"MALLIEN Philippe"},"Aller-Retour",null,null,null,null,null,null,null,null,null,null,null,null,null,null,null,null,null,null,null,null,null,null,null,null,null,null,null,null,null,null,null,null,null,null,null,null,null,null,null,null,null,null,null,null,null,null,null,null,null,null,null,null,null,null,null,null,null,null,null,null,null,null,null,{"$f":"SUM(D79:BN79)","v":0},"Km  renseignés",{"$f":"SUM(BO79+BO80)","v":0},null,null,null,null,null,null,null,null,null,null,null,null,null,null,null,null,null,{"$f":"SUM(BR79:CH79)","v":0},"Km  renseignés",{"$f":"SUM(CI79+CI80)","v":0},"Km  renseignés",{"$f":"SUM(BQ79+CK79)","v":0}]
[null,null,"Ronde",null,null,null,null,null,null,null,null,null,null,null,null,null,null,null,null,null,null,null,null,null,null,null,null,null,null,null,null,null,null,null,null,null,null,null,null,null,null,null,null,null,null,null,null,null,null,null,null,null,null,null,null,null,null,null,null,null,null,null,null,null,null,null,{"$f":"SUM(D80:BN80)","v":0},"Km confirmés",{"$f":"SUM(D82:BN82)","v":0},null,null,null,null,null,null,null,null,null,null,null,null,null,null,null,null,null,{"$f":"SUM(BR80:CH80)","v":0},"Km confirmés",{"$f":"SUM(BR82:CH82)","v":0},"Km confirmés",{"$f":"SUM(CK80+BQ80)","v":0}]
[null,null,null,0,0,0,0,0,0,0,0,0,0,0,0,0,0,0,0,0,0,0,0,0,0,0,0,0,0,0,0,0,0,0,0,0,0,0,0,0,0,0,0,0,0,0,0,0,0,0,0,0,0,0,0,0,0,0,0,0,0,0,0,0,0,0,null,"Rondes confirmées",{"$f":"SUM(C81:BN81)","v":0},0,0,0,0,0,0,0,0,0,0,0,0,0,0,0,0,0,null,"Rondes confirmées",{"$f":"SUM(BR81:CI81)","v":0},"Rondes confirmées",{"$f":"SUM(CK81+BQ81)","v":0}]
[null,null,null,{"$f":"SUM((D79+D80)*D81)","v":0},0,0,0,0,0,0,0,0,0,0,0,0,0,0,0,0,0,0,0,0,0,0,0,0,0,0,0,0,0,0,0,0,0,0,0,0,0,0,0,0,0,0,0,0,0,0,0,0,0,0,0,0,0,0,0,0,0,0,0,0,0,0,null,"Rondes effectuées",{"$f":"COUNTIF(D79:BN79,\">0\")","v":0},{"$f":"SUM((BR79+BR80)*BR81)","v":0},{"$f":"SUM((BS79+BS80)*BS81)","v":0},0,0,0,0,0,0,0,0,0,0,0,0,0,0,0,null,"Rondes Effectuées",{"$f":"COUNTIF(BR79:CH79,\">0\")","v":0},"Rondes effectuées",{"$f":"SUM(CK82+BQ82)","v":0}]
[20,{"$f":"VLOOKUP(A83,'Numéro licences'!$H$4:$I$47,2)","v":"MARIEL Didier"},"Aller-Retour",null,null,null,null,null,null,null,null,null,null,null,null,null,null,null,null,null,null,null,null,null,null,null,null,null,null,null,null,null,null,null,null,null,null,null,null,null,null,null,null,null,null,null,null,null,null,null,null,null,null,null,null,null,null,null,null,null,null,null,null,null,null,null,{"$f":"SUM(D83:BN83)","v":0},"Km  renseignés",{"$f":"SUM(BO83+BO84)","v":0},null,null,null,null,null,null,null,null,null,null,null,null,null,null,null,null,null,{"$f":"SUM(BR83:CH83)","v":0},"Km  renseignés",{"$f":"SUM(CI83+CI84)","v":0},"Km  renseignés",{"$f":"SUM(BQ83+CK83)","v":0}]
[null,null,"Ronde",null,null,null,null,null,null,null,null,null,null,null,null,null,null,null,null,null,null,null,null,null,null,null,null,null,null,null,null,null,null,null,null,null,null,null,null,null,null,null,null,null,null,null,null,null,null,null,null,null,null,null,null,null,null,null,null,null,null,null,null,null,null,null,{"$f":"SUM(D84:BN84)","v":0},"Km confirmés",{"$f":"SUM(D86:BN86)","v":0},null,null,null,null,null,null,null,null,null,null,null,null,null,null,null,null,null,{"$f":"SUM(BR84:CH84)","v":0},"Km confirmés",{"$f":"SUM(BR86:CH86)","v":0},"Km confirmés",{"$f":"SUM(CK84+BQ84)","v":0}]
[null,null,null,0,0,0,0,0,0,0,0,0,0,0,0,0,0,0,0,0,0,0,0,0,0,0,0,0,0,0,0,0,0,0,0,0,0,0,0,0,0,0,0,0,0,0,0,0,0,0,0,0,0,0,0,0,0,0,0,0,0,0,0,0,0,0,null,"Rondes confirmées",{"$f":"SUM(C85:BN85)","v":0},0,0,0,0,0,0,0,0,0,0,0,0,0,0,0,0,0,null,"Rondes confirmées",{"$f":"SUM(BR85:CI85)","v":0},"Rondes confirmées",{"$f":"SUM(CK85+BQ85)","v":0}]
[null,null,null,{"$f":"SUM((D83+D84)*D85)","v":0},0,0,0,0,0,0,0,0,0,0,0,0,0,0,0,0,0,0,0,0,0,0,0,0,0,0,0,0,0,0,0,0,0,0,0,0,0,0,0,0,0,0,0,0,0,0,0,0,0,0,0,0,0,0,0,0,0,0,0,0,0,0,null,"Rondes effectuées",{"$f":"COUNTIF(D83:BN83,\">0\")","v":0},{"$f":"SUM((BR83+BR84)*BR85)","v":0},{"$f":"SUM((BS83+BS84)*BS85)","v":0},0,0,0,0,0,0,0,0,0,0,0,0,0,0,0,null,"Rondes Effectuées",{"$f":"COUNTIF(BR83:CH83,\">0\")","v":0},"Rondes effectuées",{"$f":"SUM(CK86+BQ86)","v":0}]
[21,{"$f":"VLOOKUP(A87,'Numéro licences'!$H$4:$I$47,2)","v":"MILET Benoit"},"Aller-Retour",null,null,null,null,null,null,null,null,null,null,null,null,null,null,null,null,null,null,null,null,null,null,null,null,null,null,null,null,null,null,null,null,null,null,null,null,null,null,null,null,null,null,null,null,null,null,null,null,null,null,null,null,null,null,null,null,null,null,null,null,null,null,null,{"$f":"SUM(D87:BN87)","v":0},"Km  renseignés",{"$f":"SUM(BO87+BO88)","v":0},275,null,null,null,null,null,null,null,null,null,null,null,null,null,null,null,null,{"$f":"SUM(BR87:CH87)","v":275},"Km  renseignés",{"$f":"SUM(CI87+CI88)","v":532},"Km  renseignés",{"$f":"SUM(BQ87+CK87)","v":532}]
[null,null,"Ronde",null,null,null,null,null,null,null,null,null,null,null,null,null,null,null,null,null,null,null,null,null,null,null,null,null,null,null,null,null,null,null,null,null,null,null,null,null,null,null,null,null,null,null,null,null,null,null,null,null,null,null,null,null,null,null,null,null,null,null,null,null,null,null,{"$f":"SUM(D88:BN88)","v":0},"Km confirmés",{"$f":"SUM(D90:BN90)","v":0},257,null,null,null,null,null,null,null,null,null,null,null,null,null,null,null,null,{"$f":"SUM(BR88:CH88)","v":257},"Km confirmés",{"$f":"SUM(BR90:CH90)","v":532},"Km confirmés",{"$f":"SUM(CK88+BQ88)","v":532}]
[null,null,null,0,0,0,0,0,0,0,0,0,0,0,0,0,0,0,0,0,0,0,0,0,0,0,0,0,0,0,0,0,0,0,0,0,0,0,0,0,0,0,0,0,0,0,0,0,0,0,0,0,0,0,0,0,0,0,0,0,0,0,0,0,0,0,null,"Rondes confirmées",{"$f":"SUM(C89:BN89)","v":0},1,0,0,0,0,0,0,0,0,0,0,0,0,0,0,0,0,null,"Rondes confirmées",{"$f":"SUM(BR89:CI89)","v":1},"Rondes confirmées",{"$f":"SUM(CK89+BQ89)","v":1}]
[null,null,null,{"$f":"SUM((D87+D88)*D89)","v":0},0,0,0,0,0,0,0,0,0,0,0,0,0,0,0,0,0,0,0,0,0,0,0,0,0,0,0,0,0,0,0,0,0,0,0,0,0,0,0,0,0,0,0,0,0,0,0,0,0,0,0,0,0,0,0,0,0,0,0,0,0,0,null,"Rondes effectuées",{"$f":"COUNTIF(D87:BN87,\">0\")","v":0},{"$f":"SUM((BR87+BR88)*BR89)","v":532},{"$f":"SUM((BS87+BS88)*BS89)","v":0},0,0,0,0,0,0,0,0,0,0,0,0,0,0,0,null,"Rondes Effectuées",{"$f":"COUNTIF(BR87:CH87,\">0\")","v":1},"Rondes effectuées",{"$f":"SUM(CK90+BQ90)","v":1}]
[22,{"$f":"VLOOKUP(A91,'Numéro licences'!$H$4:$I$47,2)","v":"NIHOUL Dany"},"Aller-Retour",null,null,null,null,null,null,null,null,null,null,null,null,null,null,null,null,null,null,null,null,null,null,null,null,null,null,null,null,null,null,null,null,null,null,null,null,null,null,null,null,null,null,null,null,null,null,null,null,null,null,null,null,null,null,null,null,null,null,null,null,null,null,null,{"$f":"SUM(D91:BN91)","v":0},"Km  renseignés",{"$f":"SUM(BO91+BO92)","v":0},1205,null,null,null,null,null,null,null,null,null,null,null,null,null,null,null,null,{"$f":"SUM(BR91:CH91)","v":1205},"Km  renseignés",{"$f":"SUM(CI91+CI92)","v":1462},"Km  renseignés",{"$f":"SUM(BQ91+CK91)","v":1462}]
[null,null,"Ronde",null,null,null,null,null,null,null,null,null,null,null,null,null,null,null,null,null,null,null,null,null,null,null,null,null,null,null,null,null,null,null,null,null,null,null,null,null,null,null,null,null,null,null,null,null,null,null,null,null,null,null,null,null,null,null,null,null,null,null,null,null,null,null,{"$f":"SUM(D92:BN92)","v":0},"Km confirmés",{"$f":"SUM(D94:BN94)","v":0},257,null,null,null,null,null,null,null,null,null,null,null,null,null,null,null,null,{"$f":"SUM(BR92:CH92)","v":257},"Km confirmés",{"$f":"SUM(BR94:CH94)","v":1462},"Km confirmés",{"$f":"SUM(CK92+BQ92)","v":1462}]
[null,null,null,0,0,0,0,0,0,0,0,0,0,0,0,0,0,0,0,0,0,0,0,0,0,0,0,0,0,0,0,0,0,0,0,0,0,0,0,0,0,0,0,0,0,0,0,0,0,0,0,0,0,0,0,0,0,0,0,0,0,0,0,0,0,0,null,"Rondes confirmées",{"$f":"SUM(C93:BN93)","v":0},1,0,0,0,0,0,0,0,0,0,0,0,0,0,0,0,0,null,"Rondes confirmées",{"$f":"SUM(BR93:CI93)","v":1},"Rondes confirmées",{"$f":"SUM(CK93+BQ93)","v":1}]
[null,null,null,{"$f":"SUM((D91+D92)*D93)","v":0},0,0,0,0,0,0,0,0,0,0,0,0,0,0,0,0,0,0,0,0,0,0,0,0,0,0,0,0,0,0,0,0,0,0,0,0,0,0,0,0,0,0,0,0,0,0,0,0,0,0,0,0,0,0,0,0,0,0,0,0,0,0,null,"Rondes effectuées",{"$f":"COUNTIF(D91:BN91,\">0\")","v":0},{"$f":"SUM((BR91+BR92)*BR93)","v":1462},{"$f":"SUM((BS91+BS92)*BS93)","v":0},0,0,0,0,0,0,0,0,0,0,0,0,0,0,0,null,"Rondes Effectuées",{"$f":"COUNTIF(BR91:CH91,\">0\")","v":1},"Rondes effectuées",{"$f":"SUM(CK94+BQ94)","v":1}]
[23,{"$f":"VLOOKUP(A95,'Numéro licences'!$H$4:$I$47,2)","v":"OVAERE Jimmy"},"Aller-Retour",null,null,null,null,null,null,null,null,null,null,null,null,null,null,null,null,null,null,null,null,null,null,null,null,null,null,null,null,null,null,null,null,null,null,null,null,null,null,null,null,null,null,null,null,null,null,null,null,null,null,null,null,null,null,null,null,null,null,null,null,null,null,null,{"$f":"SUM(D95:BN95)","v":0},"Km  renseignés",{"$f":"SUM(BO95+BO96)","v":0},null,null,null,null,null,null,null,null,null,null,null,null,null,null,null,null,null,{"$f":"SUM(BR95:CH95)","v":0},"Km  renseignés",{"$f":"SUM(CI95+CI96)","v":0},"Km  renseignés",{"$f":"SUM(BQ95+CK95)","v":0}]
[null,null,"Ronde",null,null,null,null,null,null,null,null,null,null,null,null,null,null,null,null,null,null,null,null,null,null,null,null,null,null,null,null,null,null,null,null,null,null,null,null,null,null,null,null,null,null,null,null,null,null,null,null,null,null,null,null,null,null,null,null,null,null,null,null,null,null,null,{"$f":"SUM(D96:BN96)","v":0},"Km confirmés",{"$f":"SUM(D98:BN98)","v":0},null,null,null,null,null,null,null,null,null,null,null,null,null,null,null,null,null,{"$f":"SUM(BR96:CH96)","v":0},"Km confirmés",{"$f":"SUM(BR98:CH98)","v":0},"Km confirmés",{"$f":"SUM(CK96+BQ96)","v":0}]
[null,null,null,0,0,0,0,0,0,0,0,0,0,0,0,0,0,0,0,0,0,0,0,0,0,0,0,0,0,0,0,0,0,0,0,0,0,0,0,0,0,0,0,0,0,0,0,0,0,0,0,0,0,0,0,0,0,0,0,0,0,0,0,0,0,0,null,"Rondes confirmées",{"$f":"SUM(C97:BN97)","v":0},0,0,0,0,0,0,0,0,0,0,0,0,0,0,0,0,0,null,"Rondes confirmées",{"$f":"SUM(BR97:CI97)","v":0},"Rondes confirmées",{"$f":"SUM(CK97+BQ97)","v":0}]
[null,null,null,{"$f":"SUM((D95+D96)*D97)","v":0},0,0,0,0,0,0,0,0,0,0,0,0,0,0,0,0,0,0,0,0,0,0,0,0,0,0,0,0,0,0,0,0,0,0,0,0,0,0,0,0,0,0,0,0,0,0,0,0,0,0,0,0,0,0,0,0,0,0,0,0,0,0,null,"Rondes effectuées",{"$f":"COUNTIF(D95:BN95,\">0\")","v":0},{"$f":"SUM((BR95+BR96)*BR97)","v":0},{"$f":"SUM((BS95+BS96)*BS97)","v":0},0,0,0,0,0,0,0,0,0,0,0,0,0,0,0,null,"Rondes Effectuées",{"$f":"COUNTIF(BR95:CH95,\">0\")","v":0},"Rondes effectuées",{"$f":"SUM(CK98+BQ98)","v":0}]
[24,{"$f":"VLOOKUP(A99,'Numéro licences'!$H$4:$I$47,2)","v":"PARMENTIER Dominique"},"Aller-Retour",null,null,null,null,null,null,null,null,null,null,null,null,null,null,null,null,null,null,null,null,null,null,null,null,null,null,null,null,null,null,null,null,null,null,null,null,null,null,null,null,null,null,null,null,null,null,null,null,null,null,null,null,null,null,null,null,null,null,null,null,null,null,null,{"$f":"SUM(D99:BN99)","v":0},"Km  renseignés",{"$f":"SUM(BO99+BO100)","v":0},null,null,null,null,null,null,null,null,null,null,null,null,null,null,null,null,null,{"$f":"SUM(BR99:CH99)","v":0},"Km  renseignés",{"$f":"SUM(CI99+CI100)","v":0},"Km  renseignés",{"$f":"SUM(BQ99+CK99)","v":0}]
[null,null,"Ronde",null,null,null,null,null,null,null,null,null,null,null,null,null,null,null,null,null,null,null,null,null,null,null,null,null,null,null,null,null,null,null,null,null,null,null,null,null,null,null,null,null,null,null,null,null,null,null,null,null,null,null,null,null,null,null,null,null,null,null,null,null,null,null,{"$f":"SUM(D100:BN100)","v":0},"Km confirmés",{"$f":"SUM(D102:BN102)","v":0},null,null,null,null,null,null,null,null,null,null,null,null,null,null,null,null,null,{"$f":"SUM(BR100:CH100)","v":0},"Km confirmés",{"$f":"SUM(BR102:CH102)","v":0},"Km confirmés",{"$f":"SUM(CK100+BQ100)","v":0}]
[null,null,null,0,0,0,0,0,0,0,0,0,0,0,0,0,0,0,0,0,0,0,0,0,0,0,0,0,0,0,0,0,0,0,0,0,0,0,0,0,0,0,0,0,0,0,0,0,0,0,0,0,0,0,0,0,0,0,0,0,0,0,0,0,0,0,null,"Rondes confirmées",{"$f":"SUM(C101:BN101)","v":0},0,0,0,0,0,0,0,0,0,0,0,0,0,0,0,0,0,null,"Rondes confirmées",{"$f":"SUM(BR101:CI101)","v":0},"Rondes confirmées",{"$f":"SUM(CK101+BQ101)","v":0}]
[null,null,null,{"$f":"SUM((D99+D100)*D101)","v":0},0,0,0,0,0,0,0,0,0,0,0,0,0,0,0,0,0,0,0,0,0,0,0,0,0,0,0,0,0,0,0,0,0,0,0,0,0,0,0,0,0,0,0,0,0,0,0,0,0,0,0,0,0,0,0,0,0,0,0,0,0,0,null,"Rondes effectuées",{"$f":"COUNTIF(D99:BN99,\">0\")","v":0},{"$f":"SUM((BR99+BR100)*BR101)","v":0},{"$f":"SUM((BS99+BS100)*BS101)","v":0},0,0,0,0,0,0,0,0,0,0,0,0,0,0,0,null,"Rondes Effectuées",{"$f":"COUNTIF(BR99:CH99,\">0\")","v":0},"Rondes effectuées",{"$f":"SUM(CK102+BQ102)","v":0}]
[25,{"$f":"VLOOKUP(A103,'Numéro licences'!$H$4:$I$47,2)","v":"POCHET Jean-Dominique"},"Aller-Retour",null,null,null,null,null,null,null,null,null,null,null,null,null,null,null,null,null,null,null,null,null,null,null,null,null,null,null,null,null,null,null,null,null,null,null,null,null,null,null,null,null,null,null,null,null,null,null,null,null,null,null,null,null,null,null,null,null,null,null,null,null,null,null,{"$f":"SUM(D103:BN103)","v":0},"Km  renseignés",{"$f":"SUM(BO103+BO104)","v":0},null,null,null,null,null,null,null,null,null,null,null,null,null,null,null,null,null,{"$f":"SUM(BR103:CH103)","v":0},"Km  renseignés",{"$f":"SUM(CI103+CI104)","v":0},"Km  renseignés",{"$f":"SUM(BQ103+CK103)","v":0}]
[null,null,"Ronde",null,null,null,null,null,null,null,null,null,null,null,null,null,null,null,null,null,null,null,null,null,null,null,null,null,null,null,null,null,null,null,null,null,null,null,null,null,null,null,null,null,null,null,null,null,null,null,null,null,null,null,null,null,null,null,null,null,null,null,null,null,null,null,{"$f":"SUM(D104:BN104)","v":0},"Km confirmés",{"$f":"SUM(D106:BN106)","v":0},null,null,null,null,null,null,null,null,null,null,null,null,null,null,null,null,null,{"$f":"SUM(BR104:CH104)","v":0},"Km confirmés",{"$f":"SUM(BR106:CH106)","v":0},"Km confirmés",{"$f":"SUM(CK104+BQ104)","v":0}]
[null,null,null,0,0,0,0,0,0,0,0,0,0,0,0,0,0,0,0,0,0,0,0,0,0,0,0,0,0,0,0,0,0,0,0,0,0,0,0,0,0,0,0,0,0,0,0,0,0,0,0,0,0,0,0,0,0,0,0,0,0,0,0,0,0,0,null,"Rondes confirmées",{"$f":"SUM(C105:BN105)","v":0},0,0,0,0,0,0,0,0,0,0,0,0,0,0,0,0,0,null,"Rondes confirmées",{"$f":"SUM(BR105:CI105)","v":0},"Rondes confirmées",{"$f":"SUM(CK105+BQ105)","v":0}]
[null,null,null,{"$f":"SUM((D103+D104)*D105)","v":0},0,0,0,0,0,0,0,0,0,0,0,0,0,0,0,0,0,0,0,0,0,0,0,0,0,0,0,0,0,0,0,0,0,0,0,0,0,0,0,0,0,0,0,0,0,0,0,0,0,0,0,0,0,0,0,0,0,0,0,0,0,0,null,"Rondes effectuées",{"$f":"COUNTIF(D103:BN103,\">0\")","v":0},{"$f":"SUM((BR103+BR104)*BR105)","v":0},{"$f":"SUM((BS103+BS104)*BS105)","v":0},0,0,0,0,0,0,0,0,0,0,0,0,0,0,0,null,"Rondes Effectuées",{"$f":"COUNTIF(BR103:CH103,\">0\")","v":0},"Rondes effectuées",{"$f":"SUM(CK106+BQ106)","v":0}]
[26,{"$f":"VLOOKUP(A107,'Numéro licences'!$H$4:$I$47,2)","v":"POMPIER Philippe"},"Aller-Retour",null,null,null,null,null,null,null,null,null,null,null,null,null,null,null,null,null,null,null,null,null,null,null,null,null,null,null,null,null,null,null,null,null,null,null,null,null,null,null,null,null,null,null,null,null,null,null,null,null,null,null,null,null,null,null,null,null,null,null,null,null,null,null,{"$f":"SUM(D107:BN107)","v":0},"Km  renseignés",{"$f":"SUM(BO107+BO108)","v":0},null,null,null,null,null,null,null,null,null,null,null,null,null,null,null,null,null,{"$f":"SUM(BR107:CH107)","v":0},"Km  renseignés",{"$f":"SUM(CI107+CI108)","v":0},"Km  renseignés",{"$f":"SUM(BQ107+CK107)","v":0}]
[null,null,"Ronde",null,null,null,null,null,null,null,null,null,null,null,null,null,null,null,null,null,null,null,null,null,null,null,null,null,null,null,null,null,null,null,null,null,null,null,null,null,null,null,null,null,null,null,null,null,null,null,null,null,null,null,null,null,null,null,null,null,null,null,null,null,null,null,{"$f":"SUM(D108:BN108)","v":0},"Km confirmés",{"$f":"SUM(D110:BN110)","v":0},null,null,null,null,null,null,null,null,null,null,null,null,null,null,null,null,null,{"$f":"SUM(BR108:CH108)","v":0},"Km confirmés",{"$f":"SUM(BR110:CH110)","v":0},"Km confirmés",{"$f":"SUM(CK108+BQ108)","v":0}]
[null,null,null,0,0,0,0,0,0,0,0,0,0,0,0,0,0,0,0,0,0,0,0,0,0,0,0,0,0,0,0,0,0,0,0,0,0,0,0,0,0,0,0,0,0,0,0,0,0,0,0,0,0,0,0,0,0,0,0,0,0,0,0,0,0,0,null,"Rondes confirmées",{"$f":"SUM(C109:BN109)","v":0},0,0,0,0,0,0,0,0,0,0,0,0,0,0,0,0,0,null,"Rondes confirmées",{"$f":"SUM(BR109:CI109)","v":0},"Rondes confirmées",{"$f":"SUM(CK109+BQ109)","v":0}]
[null,null,null,{"$f":"SUM((D107+D108)*D109)","v":0},0,0,0,0,0,0,0,0,0,0,0,0,0,0,0,0,0,0,0,0,0,0,0,0,0,0,0,0,0,0,0,0,0,0,0,0,0,0,0,0,0,0,0,0,0,0,0,0,0,0,0,0,0,0,0,0,0,0,0,0,0,0,null,"Rondes effectuées",{"$f":"COUNTIF(D107:BN107,\">0\")","v":0},{"$f":"SUM((BR107+BR108)*BR109)","v":0},{"$f":"SUM((BS107+BS108)*BS109)","v":0},0,0,0,0,0,0,0,0,0,0,0,0,0,0,0,null,"Rondes Effectuées",{"$f":"COUNTIF(BR107:CH107,\">0\")","v":0},"Rondes effectuées",{"$f":"SUM(CK110+BQ110)","v":0}]
[27,{"$f":"VLOOKUP(A111,'Numéro licences'!$H$4:$I$47,2)","v":"RAMEAU Didier"},"Aller-Retour",null,null,null,null,null,null,null,null,null,null,null,null,null,null,null,null,null,null,null,null,null,null,null,null,null,null,null,null,null,null,null,null,null,null,null,null,null,null,null,null,null,null,null,null,null,null,null,null,null,null,null,null,null,null,null,null,null,null,null,null,null,null,null,{"$f":"SUM(D111:BN111)","v":0},"Km  renseignés",{"$f":"SUM(BO111+BO112)","v":0},null,null,null,null,null,null,null,null,null,null,null,null,null,null,null,null,null,{"$f":"SUM(BR111:CH111)","v":0},"Km  renseignés",{"$f":"SUM(CI111+CI112)","v":0},"Km  renseignés",{"$f":"SUM(BQ111+CK111)","v":0}]
[null,null,"Ronde",null,null,null,null,null,null,null,null,null,null,null,null,null,null,null,null,null,null,null,null,null,null,null,null,null,null,null,null,null,null,null,null,null,null,null,null,null,null,null,null,null,null,null,null,null,null,null,null,null,null,null,null,null,null,null,null,null,null,null,null,null,null,null,{"$f":"SUM(D112:BN112)","v":0},"Km confirmés",{"$f":"SUM(D114:BN114)","v":0},null,null,null,null,null,null,null,null,null,null,null,null,null,null,null,null,null,{"$f":"SUM(BR112:CH112)","v":0},"Km confirmés",{"$f":"SUM(BR114:CH114)","v":0},"Km confirmés",{"$f":"SUM(CK112+BQ112)","v":0}]
[null,null,null,0,0,0,0,0,0,0,0,0,0,0,0,0,0,0,0,0,0,0,0,0,0,0,0,0,0,0,0,0,0,0,0,0,0,0,0,0,0,0,0,0,0,0,0,0,0,0,0,0,0,0,0,0,0,0,0,0,0,0,0,0,0,0,null,"Rondes confirmées",{"$f":"SUM(C113:BN113)","v":0},0,0,0,0,0,0,0,0,0,0,0,0,0,0,0,0,0,null,"Rondes confirmées",{"$f":"SUM(BR113:CI113)","v":0},"Rondes confirmées",{"$f":"SUM(CK113+BQ113)","v":0}]
[null,null,null,{"$f":"SUM((D111+D112)*D113)","v":0},0,0,0,0,0,0,0,0,0,0,0,0,0,0,0,0,0,0,0,0,0,0,0,0,0,0,0,0,0,0,0,0,0,0,0,0,0,0,0,0,0,0,0,0,0,0,0,0,0,0,0,0,0,0,0,0,0,0,0,0,0,0,null,"Rondes effectuées",{"$f":"COUNTIF(D111:BN111,\">0\")","v":0},{"$f":"SUM((BR111+BR112)*BR113)","v":0},{"$f":"SUM((BS111+BS112)*BS113)","v":0},0,0,0,0,0,0,0,0,0,0,0,0,0,0,0,null,"Rondes Effectuées",{"$f":"COUNTIF(BR111:CH111,\">0\")","v":0},"Rondes effectuées",{"$f":"SUM(CK114+BQ114)","v":0}]
[28,{"$f":"VLOOKUP(A115,'Numéro licences'!$H$4:$I$47,2)","v":"SPITAELS Bernard"},"Aller-Retour",null,null,null,null,null,null,null,null,null,null,null,null,null,null,null,null,null,null,null,null,null,null,null,null,null,null,null,null,null,null,null,null,null,null,null,null,null,null,null,null,null,null,null,null,null,null,null,null,null,null,null,null,null,null,null,null,null,null,null,null,null,null,null,{"$f":"SUM(D115:BN115)","v":0},"Km  renseignés",{"$f":"SUM(BO115+BO116)","v":0},null,null,null,null,null,null,null,null,null,null,null,null,null,null,null,null,null,{"$f":"SUM(BR115:CH115)","v":0},"Km  renseignés",{"$f":"SUM(CI115+CI116)","v":0},"Km  renseignés",{"$f":"SUM(BQ115+CK115)","v":0}]
[null,null,"Ronde",null,null,null,null,null,null,null,null,null,null,null,null,null,null,null,null,null,null,null,null,null,null,null,null,null,null,null,null,null,null,null,null,null,null,null,null,null,null,null,null,null,null,null,null,null,null,null,null,null,null,null,null,null,null,null,null,null,null,null,null,null,null,null,{"$f":"SUM(D116:BN116)","v":0},"Km confirmés",{"$f":"SUM(D118:BN118)","v":0},null,null,null,null,null,null,null,null,null,null,null,null,null,null,null,null,null,{"$f":"SUM(BR116:CH116)","v":0},"Km confirmés",{"$f":"SUM(BR118:CH118)","v":0},"Km confirmés",{"$f":"SUM(CK116+BQ116)","v":0}]
[null,null,null,0,0,0,0,0,0,0,0,0,0,0,0,0,0,0,0,0,0,0,0,0,0,0,0,0,0,0,0,0,0,0,0,0,0,0,0,0,0,0,0,0,0,0,0,0,0,0,0,0,0,0,0,0,0,0,0,0,0,0,0,0,0,0,null,"Rondes confirmées",{"$f":"SUM(C117:BN117)","v":0},0,0,0,0,0,0,0,0,0,0,0,0,0,0,0,0,0,null,"Rondes confirmées",{"$f":"SUM(BR117:CI117)","v":0},"Rondes confirmées",{"$f":"SUM(CK117+BQ117)","v":0}]
[null,null,null,{"$f":"SUM((D115+D116)*D117)","v":0},0,0,0,0,0,0,0,0,0,0,0,0,0,0,0,0,0,0,0,0,0,0,0,0,0,0,0,0,0,0,0,0,0,0,0,0,0,0,0,0,0,0,0,0,0,0,0,0,0,0,0,0,0,0,0,0,0,0,0,0,0,0,null,"Rondes effectuées",{"$f":"COUNTIF(D115:BN115,\">0\")","v":0},{"$f":"SUM((BR115+BR116)*BR117)","v":0},{"$f":"SUM((BS115+BS116)*BS117)","v":0},0,0,0,0,0,0,0,0,0,0,0,0,0,0,0,null,"Rondes Effectuées",{"$f":"COUNTIF(BR115:CH115,\">0\")","v":0},"Rondes effectuées",{"$f":"SUM(CK118+BQ118)","v":0}]
[29,{"$f":"VLOOKUP(A119,'Numéro licences'!$H$4:$I$47,2)","v":"TERWAGNE Freddy"},"Aller-Retour",null,null,null,null,null,null,null,null,null,null,null,null,null,null,null,null,null,null,null,null,null,null,null,null,null,null,null,null,null,null,null,null,null,null,null,null,null,null,null,null,null,null,null,null,null,null,null,null,null,null,null,null,null,null,null,null,null,null,null,null,null,null,null,{"$f":"SUM(D119:BN119)","v":0},"Km  renseignés",{"$f":"SUM(BO119+BO120)","v":0},null,null,null,null,null,null,null,null,null,null,null,null,null,null,null,null,null,{"$f":"SUM(BR119:CH119)","v":0},"Km  renseignés",{"$f":"SUM(CI119+CI120)","v":0},"Km  renseignés",{"$f":"SUM(BQ119+CK119)","v":0}]
[null,null,"Ronde",null,null,null,null,null,null,null,null,null,null,null,null,null,null,null,null,null,null,null,null,null,null,null,null,null,null,null,null,null,null,null,null,null,null,null,null,null,null,null,null,null,null,null,null,null,null,null,null,null,null,null,null,null,null,null,null,null,null,null,null,null,null,null,{"$f":"SUM(D120:BN120)","v":0},"Km confirmés",{"$f":"SUM(D122:BN122)","v":0},null,null,null,null,null,null,null,null,null,null,null,null,null,null,null,null,null,{"$f":"SUM(BR120:CH120)","v":0},"Km confirmés",{"$f":"SUM(BR122:CH122)","v":0},"Km confirmés",{"$f":"SUM(CK120+BQ120)","v":0}]
[null,null,null,0,0,0,0,0,0,0,0,0,0,0,0,0,0,0,0,0,0,0,0,0,0,0,0,0,0,0,0,0,0,0,0,0,0,0,0,0,0,0,0,0,0,0,0,0,0,0,0,0,0,0,0,0,0,0,0,0,0,0,0,0,0,0,null,"Rondes confirmées",{"$f":"SUM(C121:BN121)","v":0},0,0,0,0,0,0,0,0,0,0,0,0,0,0,0,0,0,null,"Rondes confirmées",{"$f":"SUM(BR121:CI121)","v":0},"Rondes confirmées",{"$f":"SUM(CK121+BQ121)","v":0}]
[null,null,null,{"$f":"SUM((D119+D120)*D121)","v":0},0,0,0,0,0,0,0,0,0,0,0,0,0,0,0,0,0,0,0,0,0,0,0,0,0,0,0,0,0,0,0,0,0,0,0,0,0,0,0,0,0,0,0,0,0,0,0,0,0,0,0,0,0,0,0,0,0,0,0,0,0,0,null,"Rondes effectuées",{"$f":"COUNTIF(D119:BN119,\">0\")","v":0},{"$f":"SUM((BR119+BR120)*BR121)","v":0},{"$f":"SUM((BS119+BS120)*BS121)","v":0},0,0,0,0,0,0,0,0,0,0,0,0,0,0,0,null,"Rondes Effectuées",{"$f":"COUNTIF(BR119:CH119,\">0\")","v":0},"Rondes effectuées",{"$f":"SUM(CK122+BQ122)","v":0}]
[30,{"$f":"VLOOKUP(A123,'Numéro licences'!$H$4:$I$47,2)","v":"TERWAGNE Julien"},"Aller-Retour",null,null,null,null,null,null,null,null,null,null,null,null,null,null,null,null,null,null,null,null,null,null,null,null,null,null,null,null,null,null,null,null,null,null,null,null,null,null,null,null,null,null,null,null,null,null,null,null,null,null,null,null,null,null,null,null,null,null,null,null,null,null,null,{"$f":"SUM(D123:BN123)","v":0},"Km  renseignés",{"$f":"SUM(BO123+BO124)","v":0},null,null,null,null,null,null,null,null,null,null,null,null,null,null,null,null,null,{"$f":"SUM(BR123:CH123)","v":0},"Km  renseignés",{"$f":"SUM(CI123+CI124)","v":0},"Km  renseignés",{"$f":"SUM(BQ123+CK123)","v":0}]
[null,null,"Ronde",null,null,null,null,null,null,null,null,null,null,null,null,null,null,null,null,null,null,null,null,null,null,null,null,null,null,null,null,null,null,null,null,null,null,null,null,null,null,null,null,null,null,null,null,null,null,null,null,null,null,null,null,null,null,null,null,null,null,null,null,null,null,null,{"$f":"SUM(D124:BN124)","v":0},"Km confirmés",{"$f":"SUM(D126:BN126)","v":0},null,null,null,null,null,null,null,null,null,null,null,null,null,null,null,null,null,{"$f":"SUM(BR124:CH124)","v":0},"Km confirmés",{"$f":"SUM(BR126:CH126)","v":0},"Km confirmés",{"$f":"SUM(CK124+BQ124)","v":0}]
[null,null,null,0,0,0,0,0,0,0,0,0,0,0,0,0,0,0,0,0,0,0,0,0,0,0,0,0,0,0,0,0,0,0,0,0,0,0,0,0,0,0,0,0,0,0,0,0,0,0,0,0,0,0,0,0,0,0,0,0,0,0,0,0,0,0,null,"Rondes confirmées",{"$f":"SUM(C125:BN125)","v":0},0,0,0,0,0,0,0,0,0,0,0,0,0,0,0,0,0,null,"Rondes confirmées",{"$f":"SUM(BR125:CI125)","v":0},"Rondes confirmées",{"$f":"SUM(CK125+BQ125)","v":0}]
[null,null,null,{"$f":"SUM((D123+D124)*D125)","v":0},0,0,0,0,0,0,0,0,0,0,0,0,0,0,0,0,0,0,0,0,0,0,0,0,0,0,0,0,0,0,0,0,0,0,0,0,0,0,0,0,0,0,0,0,0,0,0,0,0,0,0,0,0,0,0,0,0,0,0,0,0,0,null,"Rondes effectuées",{"$f":"COUNTIF(D123:BN123,\">0\")","v":0},{"$f":"SUM((BR123+BR124)*BR125)","v":0},{"$f":"SUM((BS123+BS124)*BS125)","v":0},0,0,0,0,0,0,0,0,0,0,0,0,0,0,0,null,"Rondes Effectuées",{"$f":"COUNTIF(BR123:CH123,\">0\")","v":0},"Rondes effectuées",{"$f":"SUM(CK126+BQ126)","v":0}]
[31,{"$f":"VLOOKUP(A127,'Numéro licences'!$H$4:$I$47,2)","v":"THOMAS Isabelle"},"Aller-Retour",null,null,null,null,null,null,null,null,null,null,null,null,null,null,null,null,null,null,null,null,null,null,null,null,null,null,null,null,null,null,null,null,null,null,null,null,null,null,null,null,null,null,null,null,null,null,null,null,null,null,null,null,null,null,null,null,null,null,null,null,null,null,null,{"$f":"SUM(D127:BN127)","v":0},"Km  renseignés",{"$f":"SUM(BO127+BO128)","v":0},null,null,null,null,null,null,null,null,null,null,null,null,null,null,null,null,null,{"$f":"SUM(BR127:CH127)","v":0},"Km  renseignés",{"$f":"SUM(CI127+CI128)","v":0},"Km  renseignés",{"$f":"SUM(BQ127+CK127)","v":0}]
[null,null,"Ronde",null,null,null,null,null,null,null,null,null,null,null,null,null,null,null,null,null,null,null,null,null,null,null,null,null,null,null,null,null,null,null,null,null,null,null,null,null,null,null,null,null,null,null,null,null,null,null,null,null,null,null,null,null,null,null,null,null,null,null,null,null,null,null,{"$f":"SUM(D128:BN128)","v":0},"Km confirmés",{"$f":"SUM(D130:BN130)","v":0},null,null,null,null,null,null,null,null,null,null,null,null,null,null,null,null,null,{"$f":"SUM(BR128:CH128)","v":0},"Km confirmés",{"$f":"SUM(BR130:CH130)","v":0},"Km confirmés",{"$f":"SUM(CK128+BQ128)","v":0}]
[null,null,null,0,0,0,0,0,0,0,0,0,0,0,0,0,0,0,0,0,0,0,0,0,0,0,0,0,0,0,0,0,0,0,0,0,0,0,0,0,0,0,0,0,0,0,0,0,0,0,0,0,0,0,0,0,0,0,0,0,0,0,0,0,0,0,null,"Rondes confirmées",{"$f":"SUM(C129:BN129)","v":0},0,0,0,0,0,0,0,0,0,0,0,0,0,0,0,0,0,null,"Rondes confirmées",{"$f":"SUM(BR129:CI129)","v":0},"Rondes confirmées",{"$f":"SUM(CK129+BQ129)","v":0}]
[null,null,null,{"$f":"SUM((D127+D128)*D129)","v":0},0,0,0,0,0,0,0,0,0,0,0,0,0,0,0,0,0,0,0,0,0,0,0,0,0,0,0,0,0,0,0,0,0,0,0,0,0,0,0,0,0,0,0,0,0,0,0,0,0,0,0,0,0,0,0,0,0,0,0,0,0,0,null,"Rondes effectuées",{"$f":"COUNTIF(D127:BN127,\">0\")","v":0},{"$f":"SUM((BR127+BR128)*BR129)","v":0},{"$f":"SUM((BS127+BS128)*BS129)","v":0},0,0,0,0,0,0,0,0,0,0,0,0,0,0,0,null,"Rondes Effectuées",{"$f":"COUNTIF(BR127:CH127,\">0\")","v":0},"Rondes effectuées",{"$f":"SUM(CK130+BQ130)","v":0}]
[32,{"$f":"VLOOKUP(A131,'Numéro licences'!$H$4:$I$47,2)","v":"URBAIN Philippe"},"Aller-Retour",null,null,null,null,null,null,null,null,null,null,null,null,null,null,null,null,null,null,null,null,null,null,null,null,null,null,null,null,null,null,null,null,null,null,null,null,null,null,null,null,null,null,null,null,null,null,null,null,null,null,null,null,null,null,null,null,null,null,null,null,null,null,null,{"$f":"SUM(D131:BN131)","v":0},"Km  renseignés",{"$f":"SUM(BO131+BO132)","v":0},1160,null,null,null,null,null,null,null,null,null,null,null,null,null,null,null,null,{"$f":"SUM(BR131:CH131)","v":1160},"Km  renseignés",{"$f":"SUM(CI131+CI132)","v":1417},"Km  renseignés",{"$f":"SUM(BQ131+CK131)","v":1417}]
[null,null,"Ronde",null,null,null,null,null,null,null,null,null,null,null,null,null,null,null,null,null,null,null,null,null,null,null,null,null,null,null,null,null,null,null,null,null,null,null,null,null,null,null,null,null,null,null,null,null,null,null,null,null,null,null,null,null,null,null,null,null,null,null,null,null,null,null,{"$f":"SUM(D132:BN132)","v":0},"Km confirmés",{"$f":"SUM(D134:BN134)","v":0},257,null,null,null,null,null,null,null,null,null,null,null,null,null,null,null,null,{"$f":"SUM(BR132:CH132)","v":257},"Km confirmés",{"$f":"SUM(BR134:CH134)","v":1417},"Km confirmés",{"$f":"SUM(CK132+BQ132)","v":1417}]
[null,null,null,0,0,0,0,0,0,0,0,0,0,0,0,0,0,0,0,0,0,0,0,0,0,0,0,0,0,0,0,0,0,0,0,0,0,0,0,0,0,0,0,0,0,0,0,0,0,0,0,0,0,0,0,0,0,0,0,0,0,0,0,0,0,0,null,"Rondes confirmées",{"$f":"SUM(C133:BN133)","v":0},1,0,0,0,0,0,0,0,0,0,0,0,0,0,0,0,0,null,"Rondes confirmées",{"$f":"SUM(BR133:CI133)","v":1},"Rondes confirmées",{"$f":"SUM(CK133+BQ133)","v":1}]
[null,null,null,{"$f":"SUM((D131+D132)*D133)","v":0},0,0,0,0,0,0,0,0,0,0,0,0,0,0,0,0,0,0,0,0,0,0,0,0,0,0,0,0,0,0,0,0,0,0,0,0,0,0,0,0,0,0,0,0,0,0,0,0,0,0,0,0,0,0,0,0,0,0,0,0,0,0,null,"Rondes effectuées",{"$f":"COUNTIF(D131:BN131,\">0\")","v":0},{"$f":"SUM((BR131+BR132)*BR133)","v":1417},{"$f":"SUM((BS131+BS132)*BS133)","v":0},0,0,0,0,0,0,0,0,0,0,0,0,0,0,0,null,"Rondes Effectuées",{"$f":"COUNTIF(BR131:CH131,\">0\")","v":1},"Rondes effectuées",{"$f":"SUM(CK134+BQ134)","v":1}]
[33,{"$f":"VLOOKUP(A135,'Numéro licences'!$H$4:$I$47,2)","v":"VANBELLINGEN Jean-Claude"},"Aller-Retour",null,null,null,null,null,null,null,null,null,null,null,null,null,null,null,null,null,null,null,null,null,null,null,null,null,null,null,null,null,null,null,null,null,null,null,null,null,null,null,null,null,null,null,null,null,null,null,null,null,null,null,null,null,null,null,null,null,null,null,null,null,null,null,{"$f":"SUM(D135:BN135)","v":0},"Km  renseignés",{"$f":"SUM(BO135+BO136)","v":0},null,null,null,null,null,null,null,null,null,null,null,null,null,null,null,null,null,{"$f":"SUM(BR135:CH135)","v":0},"Km  renseignés",{"$f":"SUM(CI135+CI136)","v":0},"Km  renseignés",{"$f":"SUM(BQ135+CK135)","v":0}]
[null,null,"Ronde",null,null,null,null,null,null,null,null,null,null,null,null,null,null,null,null,null,null,null,null,null,null,null,null,null,null,null,null,null,null,null,null,null,null,null,null,null,null,null,null,null,null,null,null,null,null,null,null,null,null,null,null,null,null,null,null,null,null,null,null,null,null,null,{"$f":"SUM(D136:BN136)","v":0},"Km confirmés",{"$f":"SUM(D138:BN138)","v":0},null,null,null,null,null,null,null,null,null,null,null,null,null,null,null,null,null,{"$f":"SUM(BR136:CH136)","v":0},"Km confirmés",{"$f":"SUM(BR138:CH138)","v":0},"Km confirmés",{"$f":"SUM(CK136+BQ136)","v":0}]
[null,null,null,0,0,0,0,0,0,0,0,0,0,0,0,0,0,0,0,0,0,0,0,0,0,0,0,0,0,0,0,0,0,0,0,0,0,0,0,0,0,0,0,0,0,0,0,0,0,0,0,0,0,0,0,0,0,0,0,0,0,0,0,0,0,0,null,"Rondes confirmées",{"$f":"SUM(C137:BN137)","v":0},0,0,0,0,0,0,0,0,0,0,0,0,0,0,0,0,0,null,"Rondes confirmées",{"$f":"SUM(BR137:CI137)","v":0},"Rondes confirmées",{"$f":"SUM(CK137+BQ137)","v":0}]
[null,null,null,{"$f":"SUM((D135+D136)*D137)","v":0},0,0,0,0,0,0,0,0,0,0,0,0,0,0,0,0,0,0,0,0,0,0,0,0,0,0,0,0,0,0,0,0,0,0,0,0,0,0,0,0,0,0,0,0,0,0,0,0,0,0,0,0,0,0,0,0,0,0,0,0,0,0,null,"Rondes effectuées",{"$f":"COUNTIF(D135:BN135,\">0\")","v":0},{"$f":"SUM((BR135+BR136)*BR137)","v":0},{"$f":"SUM((BS135+BS136)*BS137)","v":0},0,0,0,0,0,0,0,0,0,0,0,0,0,0,0,null,"Rondes Effectuées",{"$f":"COUNTIF(BR135:CH135,\">0\")","v":0},"Rondes effectuées",{"$f":"SUM(CK138+BQ138)","v":0}]
[34,{"$f":"VLOOKUP(A139,'Numéro licences'!$H$4:$I$47,2)","v":"VANDEN BOSSCHE Vincent"},"Aller-Retour",null,null,null,null,null,null,null,null,null,null,null,null,null,null,null,null,null,null,null,null,null,null,null,null,null,null,null,null,null,null,null,null,null,null,null,null,null,null,null,null,null,null,null,null,null,null,null,null,null,null,null,null,null,null,null,null,null,null,null,null,null,null,null,{"$f":"SUM(D139:BN139)","v":0},"Km  renseignés",{"$f":"SUM(BO139+BO140)","v":0},null,null,null,null,null,null,null,null,null,null,null,null,null,null,null,null,null,{"$f":"SUM(BR139:CH139)","v":0},"Km  renseignés",{"$f":"SUM(CI139+CI140)","v":0},"Km  renseignés",{"$f":"SUM(BQ139+CK139)","v":0}]
[null,null,"Ronde",null,null,null,null,null,null,null,null,null,null,null,null,null,null,null,null,null,null,null,null,null,null,null,null,null,null,null,null,null,null,null,null,null,null,null,null,null,null,null,null,null,null,null,null,null,null,null,null,null,null,null,null,null,null,null,null,null,null,null,null,null,null,null,{"$f":"SUM(D140:BN140)","v":0},"Km confirmés",{"$f":"SUM(D142:BN142)","v":0},null,null,null,null,null,null,null,null,null,null,null,null,null,null,null,null,null,{"$f":"SUM(BR140:CH140)","v":0},"Km confirmés",{"$f":"SUM(BR142:CH142)","v":0},"Km confirmés",{"$f":"SUM(CK140+BQ140)","v":0}]
[null,null,null,0,0,0,0,0,0,0,0,0,0,0,0,0,0,0,0,0,0,0,0,0,0,0,0,0,0,0,0,0,0,0,0,0,0,0,0,0,0,0,0,0,0,0,0,0,0,0,0,0,0,0,0,0,0,0,0,0,0,0,0,0,0,0,null,"Rondes confirmées",{"$f":"SUM(C141:BN141)","v":0},0,0,0,0,0,0,0,0,0,0,0,0,0,0,0,0,0,null,"Rondes confirmées",{"$f":"SUM(BR141:CI141)","v":0},"Rondes confirmées",{"$f":"SUM(CK141+BQ141)","v":0}]
[null,null,null,{"$f":"SUM((D139+D140)*D141)","v":0},0,0,0,0,0,0,0,0,0,0,0,0,0,0,0,0,0,0,0,0,0,0,0,0,0,0,0,0,0,0,0,0,0,0,0,0,0,0,0,0,0,0,0,0,0,0,0,0,0,0,0,0,0,0,0,0,0,0,0,0,0,0,null,"Rondes effectuées",{"$f":"COUNTIF(D139:BN139,\">0\")","v":0},0,{"$f":"SUM((BS139+BS140)*BS141)","v":0},0,0,0,0,0,0,0,0,0,0,0,0,0,0,0,null,"Rondes Effectuées",{"$f":"COUNTIF(BR139:CH139,\">0\")","v":0},"Rondes effectuées",{"$f":"SUM(CK142+BQ142)","v":0}]
[35,{"$f":"VLOOKUP(A143,'Numéro licences'!$H$4:$I$47,2)","v":"VANDEN WAEYENBERGH Michel"},"Aller-Retour",null,null,null,null,null,null,null,null,null,null,null,null,null,null,null,null,null,null,null,null,null,null,null,null,null,null,null,null,null,null,null,null,null,null,null,null,null,null,null,null,null,null,null,null,null,null,null,null,null,null,null,null,null,null,null,null,null,null,null,null,null,null,null,{"$f":"SUM(D143:BN143)","v":0},"Km  renseignés",{"$f":"SUM(BO143+BO144)","v":0},null,null,null,null,null,null,null,null,null,null,null,null,null,null,null,null,null,{"$f":"SUM(BR143:CH143)","v":0},"Km  renseignés",{"$f":"SUM(CI143+CI144)","v":0},"Km  renseignés",{"$f":"SUM(BQ143+CK143)","v":0}]
[null,null,"Ronde",null,null,null,null,null,null,null,null,null,null,null,null,null,null,null,null,null,null,null,null,null,null,null,null,null,null,null,null,null,null,null,null,null,null,null,null,null,null,null,null,null,null,null,null,null,null,null,null,null,null,null,null,null,null,null,null,null,null,null,null,null,null,null,{"$f":"SUM(D144:BN144)","v":0},"Km confirmés",{"$f":"SUM(D146:BN146)","v":0},null,null,null,null,null,null,null,null,null,null,null,null,null,null,null,null,null,{"$f":"SUM(BR144:CH144)","v":0},"Km confirmés",{"$f":"SUM(BR146:CH146)","v":0},"Km confirmés",{"$f":"SUM(CK144+BQ144)","v":0}]
[null,null,null,0,0,0,0,0,0,0,0,0,0,0,0,0,0,0,0,0,0,0,0,0,0,0,0,0,0,0,0,0,0,0,0,0,0,0,0,0,0,0,0,0,0,0,0,0,0,0,0,0,0,0,0,0,0,0,0,0,0,0,0,0,0,0,null,"Rondes confirmées",{"$f":"SUM(C145:BN145)","v":0},0,0,0,0,0,0,0,0,0,0,0,0,0,0,0,0,0,null,"Rondes confirmées",{"$f":"SUM(BR145:CI145)","v":0},"Rondes confirmées",{"$f":"SUM(CK145+BQ145)","v":0}]
[null,null,null,{"$f":"SUM((D143+D144)*D145)","v":0},0,0,0,0,0,0,0,0,0,0,0,0,0,0,0,0,0,0,0,0,0,0,0,0,0,0,0,0,0,0,0,0,0,0,0,0,0,0,0,0,0,0,0,0,0,0,0,0,0,0,0,0,0,0,0,0,0,0,0,0,0,0,null,"Rondes effectuées",{"$f":"COUNTIF(D143:BN143,\">0\")","v":0},0,{"$f":"SUM((BS143+BS144)*BS145)","v":0},0,0,0,0,0,0,0,0,0,0,0,0,0,0,0,null,"Rondes Effectuées",{"$f":"COUNTIF(BR143:CH143,\">0\")","v":0},"Rondes effectuées",{"$f":"SUM(CK146+BQ146)","v":0}]
[36,{"$f":"VLOOKUP(A147,'Numéro licences'!$H$4:$I$47,2)","v":"VANSTEYVOORT André"},"Aller-Retour",null,null,null,null,null,null,null,null,null,null,null,null,null,null,null,null,null,null,null,null,null,null,null,null,null,null,null,null,null,null,null,null,null,null,null,null,null,null,null,null,null,null,null,null,null,null,null,null,null,null,null,null,null,null,null,null,null,null,null,null,null,null,null,{"$f":"SUM(D147:BN147)","v":0},"Km  renseignés",{"$f":"SUM(BO147+BO148)","v":0},null,null,null,null,null,null,null,null,null,null,null,null,null,null,null,null,null,{"$f":"SUM(BR147:CH147)","v":0},"Km  renseignés",{"$f":"SUM(CI147+CI148)","v":0},"Km  renseignés",{"$f":"SUM(BQ147+CK147)","v":0}]
[null,null,"Ronde",null,null,null,null,null,null,null,null,null,null,null,null,null,null,null,null,null,null,null,null,null,null,null,null,null,null,null,null,null,null,null,null,null,null,null,null,null,null,null,null,null,null,null,null,null,null,null,null,null,null,null,null,null,null,null,null,null,null,null,null,null,null,null,{"$f":"SUM(D148:BN148)","v":0},"Km confirmés",{"$f":"SUM(D150:BN150)","v":0},null,null,null,null,null,null,null,null,null,null,null,null,null,null,null,null,null,{"$f":"SUM(BR148:CH148)","v":0},"Km confirmés",{"$f":"SUM(BR150:CH150)","v":0},"Km confirmés",{"$f":"SUM(CK148+BQ148)","v":0}]
[null,null,null,0,0,0,0,0,0,0,0,0,0,0,0,0,0,0,0,0,0,0,0,0,0,0,0,0,0,0,0,0,0,0,0,0,0,0,0,0,0,0,0,0,0,0,0,0,0,0,0,0,0,0,0,0,0,0,0,0,0,0,0,0,0,0,null,"Rondes confirmées",{"$f":"SUM(C149:BN149)","v":0},0,0,0,0,0,0,0,0,0,0,0,0,0,0,0,0,0,null,"Rondes confirmées",{"$f":"SUM(BR149:CI149)","v":0},"Rondes confirmées",{"$f":"SUM(CK149+BQ149)","v":0}]
[null,null,null,{"$f":"SUM((D147+D148)*D149)","v":0},0,0,0,0,0,0,0,0,0,0,0,0,0,0,0,0,0,0,0,0,0,0,0,0,0,0,0,0,0,0,0,0,0,0,0,0,0,0,0,0,0,0,0,0,0,0,0,0,0,0,0,0,0,0,0,0,0,0,0,0,0,0,null,"Rondes effectuées",{"$f":"COUNTIF(D147:BN147,\">0\")","v":0},0,{"$f":"SUM((BS147+BS148)*BS149)","v":0},0,0,0,0,0,0,0,0,0,0,0,0,0,0,0,null,"Rondes Effectuées",{"$f":"COUNTIF(BR147:CH147,\">0\")","v":0},"Rondes effectuées",{"$f":"SUM(CK150+BQ150)","v":0}]
[37,{"$f":"VLOOKUP(A151,'Numéro licences'!$H$4:$I$47,2)","v":"WOUTERS Olivier"},"Aller-Retour",null,null,null,null,null,null,null,null,null,null,null,null,null,null,null,null,null,null,null,null,null,null,null,null,null,null,null,null,null,null,null,null,null,null,null,null,null,null,null,null,null,null,null,null,null,null,null,null,null,null,null,null,null,null,null,null,null,null,null,null,null,null,null,{"$f":"SUM(D151:BN151)","v":0},"Km  renseignés",{"$f":"SUM(BO151+BO152)","v":0},null,null,null,null,null,null,null,null,null,null,null,null,null,null,null,null,null,{"$f":"SUM(BR151:CH151)","v":0},"Km  renseignés",{"$f":"SUM(CI151+CI152)","v":0},"Km  renseignés",{"$f":"SUM(BQ151+CK151)","v":0}]
[null,null,"Ronde",null,null,null,null,null,null,null,null,null,null,null,null,null,null,null,null,null,null,null,null,null,null,null,null,null,null,null,null,null,null,null,null,null,null,null,null,null,null,null,null,null,null,null,null,null,null,null,null,null,null,null,null,null,null,null,null,null,null,null,null,null,null,null,{"$f":"SUM(D152:BN152)","v":0},"Km confirmés",{"$f":"SUM(D154:BN154)","v":0},null,null,null,null,null,null,null,null,null,null,null,null,null,null,null,null,null,{"$f":"SUM(BR152:CH152)","v":0},"Km confirmés",{"$f":"SUM(BR154:CH154)","v":0},"Km confirmés",{"$f":"SUM(CK152+BQ152)","v":0}]
[null,null,null,0,0,0,0,0,0,0,0,0,0,0,0,0,0,0,0,0,0,0,0,0,0,0,0,0,0,0,0,0,0,0,0,0,0,0,0,0,0,0,0,0,0,0,0,0,0,0,0,0,0,0,0,0,0,0,0,0,0,0,0,0,0,0,null,"Rondes confirmées",{"$f":"SUM(C153:BN153)","v":0},0,0,0,0,0,0,0,0,0,0,0,0,0,0,0,0,0,null,"Rondes confirmées",{"$f":"SUM(BR153:CI153)","v":0},"Rondes confirmées",{"$f":"SUM(CK153+BQ153)","v":0}]
[null,null,null,{"$f":"SUM((D151+D152)*D153)","v":0},0,0,0,0,0,0,0,0,0,0,0,0,0,0,0,0,0,0,0,0,0,0,0,0,0,0,0,0,0,0,0,0,0,0,0,0,0,0,0,0,0,0,0,0,0,0,0,0,0,0,0,0,0,0,0,0,0,0,0,0,0,0,null,"Rondes effectuées",{"$f":"COUNTIF(D151:BN151,\">0\")","v":0},0,{"$f":"SUM((BS151+BS152)*BS153)","v":0},0,0,0,0,0,0,0,0,0,0,0,0,0,0,0,null,"Rondes Effectuées",{"$f":"COUNTIF(BR151:CH151,\">0\")","v":0},"Rondes effectuées",{"$f":"SUM(CK154+BQ154)","v":0}]
[38,{"$f":"VLOOKUP(A155,'Numéro licences'!$H$4:$I$47,2)","v":"DEMETS Eric"},"Aller-Retour",null,null,null,null,null,null,null,null,null,null,null,null,null,null,null,null,null,null,null,null,null,null,null,null,null,null,null,null,null,null,null,null,null,null,null,null,null,null,null,null,null,null,null,null,null,null,null,null,null,null,null,null,null,null,null,null,null,null,null,null,null,null,null,{"$f":"SUM(D155:BN155)","v":0},"Km  renseignés",{"$f":"SUM(BO155+BO156)","v":0},null,null,null,null,null,null,null,null,null,null,null,null,null,null,null,null,null,{"$f":"SUM(BR155:CH155)","v":0},"Km  renseignés",{"$f":"SUM(CI155+CI156)","v":0},"Km  renseignés",{"$f":"SUM(BQ155+CK155)","v":0}]
[null,null,"Ronde",null,null,null,null,null,null,null,null,null,null,null,null,null,null,null,null,null,null,null,null,null,null,null,null,null,null,null,null,null,null,null,null,null,null,null,null,null,null,null,null,null,null,null,null,null,null,null,null,null,null,null,null,null,null,null,null,null,null,null,null,null,null,null,{"$f":"SUM(D156:BN156)","v":0},"Km confirmés",{"$f":"SUM(D158:BN158)","v":0},null,null,null,null,null,null,null,null,null,null,null,null,null,null,null,null,null,{"$f":"SUM(BR156:CH156)","v":0},"Km confirmés",{"$f":"SUM(BR158:CH158)","v":0},"Km confirmés",{"$f":"SUM(CK156+BQ156)","v":0}]
[null,null,null,0,0,0,0,0,0,0,0,0,0,0,0,0,0,0,0,0,0,0,0,0,0,0,0,0,0,0,0,0,0,0,0,0,0,0,0,0,0,0,0,0,0,0,0,0,0,0,0,0,0,0,0,0,0,0,0,0,0,0,0,0,0,0,null,"Rondes confirmées",{"$f":"SUM(C157:BN157)","v":0},0,0,0,0,0,0,0,0,0,0,0,0,0,0,0,0,0,null,"Rondes confirmées",{"$f":"SUM(BR157:CI157)","v":0},"Rondes confirmées",{"$f":"SUM(CK157+BQ157)","v":0}]
[null,null,null,{"$f":"SUM((D155+D156)*D157)","v":0},0,0,0,0,0,0,0,0,0,0,0,0,0,0,0,0,0,0,0,0,0,0,0,0,0,0,0,0,0,0,0,0,0,0,0,0,0,0,0,0,0,0,0,0,0,0,0,0,0,0,0,0,0,0,0,0,0,0,0,0,0,0,null,"Rondes effectuées",{"$f":"COUNTIF(D155:BN155,\">0\")","v":0},0,{"$f":"SUM((BS155+BS156)*BS157)","v":0},0,0,0,0,0,0,0,0,0,0,0,0,0,0,0,null,"Rondes Effectuées",{"$f":"COUNTIF(BR155:CH155,\">0\")","v":0},"Rondes effectuées",{"$f":"SUM(CK158+BQ158)","v":0}]
[39,{"$f":"VLOOKUP(A159,'Numéro licences'!$H$4:$I$47,2)","v":"DECELLE Hubert"},"Aller-Retour",null,null,null,null,null,null,null,null,null,null,null,null,null,null,null,null,null,null,null,null,null,null,null,null,null,null,null,null,null,null,null,null,null,null,null,null,null,null,null,null,null,null,null,null,null,null,null,null,null,null,null,null,null,null,null,null,null,null,null,null,null,null,null,{"$f":"SUM(D159:BN159)","v":0},"Km  renseignés",{"$f":"SUM(BO159+BO160)","v":0},null,null,null,null,null,null,null,null,null,null,null,null,null,null,null,null,null,{"$f":"SUM(BR159:CH159)","v":0},"Km  renseignés",{"$f":"SUM(CI159+CI160)","v":0},"Km  renseignés",{"$f":"SUM(BQ159+CK159)","v":0}]
[null,null,"Ronde",null,null,null,null,null,null,null,null,null,null,null,null,null,null,null,null,null,null,null,null,null,null,null,null,null,null,null,null,null,null,null,null,null,null,null,null,null,null,null,null,null,null,null,null,null,null,null,null,null,null,null,null,null,null,null,null,null,null,null,null,null,null,null,{"$f":"SUM(D160:BN160)","v":0},"Km confirmés",{"$f":"SUM(D162:BN162)","v":0},null,null,null,null,null,null,null,null,null,null,null,null,null,null,null,null,null,{"$f":"SUM(BR160:CH160)","v":0},"Km confirmés",{"$f":"SUM(BR162:CH162)","v":0},"Km confirmés",{"$f":"SUM(CK160+BQ160)","v":0}]
[null,null,null,0,0,0,0,0,0,0,0,0,0,0,0,0,0,0,0,0,0,0,0,0,0,0,0,0,0,0,0,0,0,0,0,0,0,0,0,0,0,0,0,0,0,0,0,0,0,0,0,0,0,0,0,0,0,0,0,0,0,0,0,0,0,0,null,"Rondes confirmées",{"$f":"SUM(C161:BN161)","v":0},0,0,0,0,0,0,0,0,0,0,0,0,0,0,0,0,0,null,"Rondes confirmées",{"$f":"SUM(BR161:CI161)","v":0},"Rondes confirmées",{"$f":"SUM(CK161+BQ161)","v":0}]
[null,null,null,{"$f":"SUM((D159+D160)*D161)","v":0},0,0,0,0,0,0,0,0,0,0,0,0,0,0,0,0,0,0,0,0,0,0,0,0,0,0,0,0,0,0,0,0,0,0,0,0,0,0,0,0,0,0,0,0,0,0,0,0,0,0,0,0,0,0,0,0,0,0,0,0,0,0,null,"Rondes effectuées",{"$f":"COUNTIF(D159:BN159,\">0\")","v":0},0,{"$f":"SUM((BS159+BS160)*BS161)","v":0},0,0,0,0,0,0,0,0,0,0,0,0,0,0,0,null,"Rondes Effectuées",{"$f":"COUNTIF(BR159:CH159,\">0\")","v":0},"Rondes effectuées",{"$f":"SUM(CK162+BQ162)","v":0}]
[40,{"$f":"VLOOKUP(A163,'Numéro licences'!$H$4:$I$47,2)","v":0},"Aller-Retour",null,null,null,null,null,null,null,null,null,null,null,null,null,null,null,null,null,null,null,null,null,null,null,null,null,null,null,null,null,null,null,null,null,null,null,null,null,null,null,null,null,null,null,null,null,null,null,null,null,null,null,null,null,null,null,null,null,null,null,null,null,null,null,{"$f":"SUM(D163:BN163)","v":0},"Km  renseignés",{"$f":"SUM(BO163+BO164)","v":0},null,null,null,null,null,null,null,null,null,null,null,null,null,null,null,null,null,{"$f":"SUM(BR163:CH163)","v":0},"Km  renseignés",{"$f":"SUM(CI163+CI164)","v":0},"Km  renseignés",{"$f":"SUM(BQ163+CK163)","v":0}]
[null,null,"Ronde",null,null,null,null,null,null,null,null,null,null,null,null,null,null,null,null,null,null,null,null,null,null,null,null,null,null,null,null,null,null,null,null,null,null,null,null,null,null,null,null,null,null,null,null,null,null,null,null,null,null,null,null,null,null,null,null,null,null,null,null,null,null,null,{"$f":"SUM(D164:BN164)","v":0},"Km confirmés",{"$f":"SUM(D166:BN166)","v":0},null,null,null,null,null,null,null,null,null,null,null,null,null,null,null,null,null,{"$f":"SUM(BR164:CH164)","v":0},"Km confirmés",{"$f":"SUM(BR166:CH166)","v":0},"Km confirmés",{"$f":"SUM(CK164+BQ164)","v":0}]
[null,null,null,0,0,0,0,0,0,0,0,0,0,0,0,0,0,0,0,0,0,0,0,0,0,0,0,0,0,0,0,0,0,0,0,0,0,0,0,0,0,0,0,0,0,0,0,0,0,0,0,0,0,0,0,0,0,0,0,0,0,0,0,0,0,0,null,"Rondes confirmées",{"$f":"SUM(C165:BN165)","v":0},0,0,0,0,0,0,0,0,0,0,0,0,0,0,0,0,0,null,"Rondes confirmées",{"$f":"SUM(BR165:CI165)","v":0},"Rondes confirmées",{"$f":"SUM(CK165+BQ165)","v":0}]
[null,null,null,{"$f":"SUM((D163+D164)*D165)","v":0},0,0,0,0,0,0,0,0,0,0,0,0,0,0,0,0,0,0,0,0,0,0,0,0,0,0,0,0,0,0,0,0,0,0,0,0,0,0,0,0,0,0,0,0,0,0,0,0,0,0,0,0,0,0,0,0,0,0,0,0,0,0,null,"Rondes effectuées",{"$f":"COUNTIF(D163:BN163,\">0\")","v":0},0,{"$f":"SUM((BS163+BS164)*BS165)","v":0},0,0,0,0,0,0,0,0,0,0,0,0,0,0,0,null,"Rondes Effectuées",{"$f":"COUNTIF(BR163:CH163,\">0\")","v":0},"Rondes effectuées",{"$f":"SUM(CK166+BQ166)","v":0}]
[41,{"$f":"VLOOKUP(A167,'Numéro licences'!$H$4:$I$47,2)","v":0},"Aller-Retour",null,null,null,null,null,null,null,null,null,null,null,null,null,null,null,null,null,null,null,null,null,null,null,null,null,null,null,null,null,null,null,null,null,null,null,null,null,null,null,null,null,null,null,null,null,null,null,null,null,null,null,null,null,null,null,null,null,null,null,null,null,null,null,{"$f":"SUM(D167:BN167)","v":0},"Km  renseignés",{"$f":"SUM(BO167+BO168)","v":0},null,null,null,null,null,null,null,null,null,null,null,null,null,null,null,null,null,{"$f":"SUM(BR167:CH167)","v":0},"Km  renseignés",{"$f":"SUM(CI167+CI168)","v":0},"Km  renseignés",{"$f":"SUM(BQ167+CK167)","v":0}]
[null,null,"Ronde",null,null,null,null,null,null,null,null,null,null,null,null,null,null,null,null,null,null,null,null,null,null,null,null,null,null,null,null,null,null,null,null,null,null,null,null,null,null,null,null,null,null,null,null,null,null,null,null,null,null,null,null,null,null,null,null,null,null,null,null,null,null,null,{"$f":"SUM(D168:BN168)","v":0},"Km confirmés",{"$f":"SUM(D170:BN170)","v":0},null,null,null,null,null,null,null,null,null,null,null,null,null,null,null,null,null,{"$f":"SUM(BR168:CH168)","v":0},"Km confirmés",{"$f":"SUM(BR170:CH170)","v":0},"Km confirmés",{"$f":"SUM(CK168+BQ168)","v":0}]
[null,null,null,0,0,0,0,0,0,0,0,0,0,0,0,0,0,0,0,0,0,0,0,0,0,0,0,0,0,0,0,0,0,0,0,0,0,0,0,0,0,0,0,0,0,0,0,0,0,0,0,0,0,0,0,0,0,0,0,0,0,0,0,0,0,0,null,"Rondes confirmées",{"$f":"SUM(C169:BN169)","v":0},0,0,0,0,0,0,0,0,0,0,0,0,0,0,0,0,0,null,"Rondes confirmées",{"$f":"SUM(BR169:CI169)","v":0},"Rondes confirmées",{"$f":"SUM(CK169+BQ169)","v":0}]
[null,null,null,{"$f":"SUM((D167+D168)*D169)","v":0},0,0,0,0,0,0,0,0,0,0,0,0,0,0,0,0,0,0,0,0,0,0,0,0,0,0,0,0,0,0,0,0,0,0,0,0,0,0,0,0,0,0,0,0,0,0,0,0,0,0,0,0,0,0,0,0,0,0,0,0,0,0,null,"Rondes effectuées",{"$f":"COUNTIF(D167:BN167,\">0\")","v":0},0,{"$f":"SUM((BS167+BS168)*BS169)","v":0},0,0,0,0,0,0,0,0,0,0,0,0,0,0,0,null,"Rondes Effectuées",{"$f":"COUNTIF(BR167:CH167,\">0\")","v":0},"Rondes effectuées",{"$f":"SUM(CK170+BQ170)","v":0}]
[42,{"$f":"VLOOKUP(A171,'Numéro licences'!$H$4:$I$47,2)","v":0},"Aller-Retour",null,null,null,null,null,null,null,null,null,null,null,null,null,null,null,null,null,null,null,null,null,null,null,null,null,null,null,null,null,null,null,null,null,null,null,null,null,null,null,null,null,null,null,null,null,null,null,null,null,null,null,null,null,null,null,null,null,null,null,null,null,null,null,{"$f":"SUM(D171:BN171)","v":0},"Km  renseignés",{"$f":"SUM(BO171+BO172)","v":0},null,null,null,null,null,null,null,null,null,null,null,null,null,null,null,null,null,{"$f":"SUM(BR171:CH171)","v":0},"Km  renseignés",{"$f":"SUM(CI171+CI172)","v":0},"Km  renseignés",{"$f":"SUM(BQ171+CK171)","v":0}]
[null,null,"Ronde",null,null,null,null,null,null,null,null,null,null,null,null,null,null,null,null,null,null,null,null,null,null,null,null,null,null,null,null,null,null,null,null,null,null,null,null,null,null,null,null,null,null,null,null,null,null,null,null,null,null,null,null,null,null,null,null,null,null,null,null,null,null,null,{"$f":"SUM(D172:BN172)","v":0},"Km confirmés",{"$f":"SUM(D174:BN174)","v":0},null,null,null,null,null,null,null,null,null,null,null,null,null,null,null,null,null,{"$f":"SUM(BR172:CH172)","v":0},"Km confirmés",{"$f":"SUM(BR174:CH174)","v":0},"Km confirmés",{"$f":"SUM(CK172+BQ172)","v":0}]
[null,null,null,0,0,0,0,0,0,0,0,0,0,0,0,0,0,0,0,0,0,0,0,0,0,0,0,0,0,0,0,0,0,0,0,0,0,0,0,0,0,0,0,0,0,0,0,0,0,0,0,0,0,0,0,0,0,0,0,0,0,0,0,0,0,0,null,"Rondes confirmées",{"$f":"SUM(C173:BN173)","v":0},0,0,0,0,0,0,0,0,0,0,0,0,0,0,0,0,0,null,"Rondes confirmées",{"$f":"SUM(BR173:CI173)","v":0},"Rondes confirmées",{"$f":"SUM(CK173+BQ173)","v":0}]
[null,null,null,{"$f":"SUM((D171+D172)*D173)","v":0},0,0,0,0,0,0,0,0,0,0,0,0,0,0,0,0,0,0,0,0,0,0,0,0,0,0,0,0,0,0,0,0,0,0,0,0,0,0,0,0,0,0,0,0,0,0,0,0,0,0,0,0,0,0,0,0,0,0,0,0,0,0,null,"Rondes effectuées",{"$f":"COUNTIF(D171:BN171,\">0\")","v":0},0,{"$f":"SUM((BS171+BS172)*BS173)","v":0},0,0,0,0,0,0,0,0,0,0,0,0,0,0,0,null,"Rondes Effectuées",{"$f":"COUNTIF(BR171:CH171,\">0\")","v":0},"Rondes effectuées",{"$f":"SUM(CK174+BQ174)","v":0}]
[43,{"$f":"VLOOKUP(A175,'Numéro licences'!$H$4:$I$47,2)","v":0},"Aller-Retour",null,null,null,null,null,null,null,null,null,null,null,null,null,null,null,null,null,null,null,null,null,null,null,null,null,null,null,null,null,null,null,null,null,null,null,null,null,null,null,null,null,null,null,null,null,null,null,null,null,null,null,null,null,null,null,null,null,null,null,null,null,null,null,{"$f":"SUM(D175:BN175)","v":0},"Km  renseignés",{"$f":"SUM(BO175+BO176)","v":0},null,null,null,null,null,null,null,null,null,null,null,null,null,null,null,null,null,{"$f":"SUM(BR175:CH175)","v":0},"Km  renseignés",{"$f":"SUM(CI175+CI176)","v":0},"Km  renseignés",{"$f":"SUM(BQ175+CK175)","v":0}]
[null,null,"Ronde",null,null,null,null,null,null,null,null,null,null,null,null,null,null,null,null,null,null,null,null,null,null,null,null,null,null,null,null,null,null,null,null,null,null,null,null,null,null,null,null,null,null,null,null,null,null,null,null,null,null,null,null,null,null,null,null,null,null,null,null,null,null,null,{"$f":"SUM(D176:BN176)","v":0},"Km confirmés",{"$f":"SUM(D178:BN178)","v":0},null,null,null,null,null,null,null,null,null,null,null,null,null,null,null,null,null,{"$f":"SUM(BR176:CH176)","v":0},"Km confirmés",{"$f":"SUM(BR178:CH178)","v":0},"Km confirmés",{"$f":"SUM(CK176+BQ176)","v":0}]
[null,null,null,0,0,0,0,0,0,0,0,0,0,0,0,0,0,0,0,0,0,0,0,0,0,0,0,0,0,0,0,0,0,0,0,0,0,0,0,0,0,0,0,0,0,0,0,0,0,0,0,0,0,0,0,0,0,0,0,0,0,0,0,0,0,0,null,"Rondes confirmées",{"$f":"SUM(C177:BN177)","v":0},0,0,0,0,0,0,0,0,0,0,0,0,0,0,0,0,0,null,"Rondes confirmées",{"$f":"SUM(BR177:CI177)","v":0},"Rondes confirmées",{"$f":"SUM(CK177+BQ177)","v":0}]
[null,null,null,{"$f":"SUM((D175+D176)*D177)","v":0},0,0,0,0,0,0,0,0,0,0,0,0,0,0,0,0,0,0,0,0,0,0,0,0,0,0,0,0,0,0,0,0,0,0,0,0,0,0,0,0,0,0,0,0,0,0,0,0,0,0,0,0,0,0,0,0,0,0,0,0,0,0,null,"Rondes effectuées",{"$f":"COUNTIF(D175:BN175,\">0\")","v":0},0,{"$f":"SUM((BS175+BS176)*BS177)","v":0},0,0,0,0,0,0,0,0,0,0,0,0,0,0,0,null,"Rondes Effectuées",{"$f":"COUNTIF(BR175:CH175,\">0\")","v":0},"Rondes effectuées",{"$f":"SUM(CK178+BQ178)","v":0}]
[44,{"$f":"VLOOKUP(A179,'Numéro licences'!$H$4:$I$47,2)","v":0},"Aller-Retour",null,null,null,null,null,null,null,null,null,null,null,null,null,null,null,null,null,null,null,null,null,null,null,null,null,null,null,null,null,null,null,null,null,null,null,null,null,null,null,null,null,null,null,null,null,null,null,null,null,null,null,null,null,null,null,null,null,null,null,null,null,null,null,{"$f":"SUM(D179:BN179)","v":0},"Km  renseignés",{"$f":"SUM(BO179+BO180)","v":0},null,null,null,null,null,null,null,null,null,null,null,null,null,null,null,null,null,{"$f":"SUM(BR179:CH179)","v":0},"Km  renseignés",{"$f":"SUM(CI179+CI180)","v":0},"Km  renseignés",{"$f":"SUM(BQ179+CK179)","v":0}]
[null,null,"Ronde",null,null,null,null,null,null,null,null,null,null,null,null,null,null,null,null,null,null,null,null,null,null,null,null,null,null,null,null,null,null,null,null,null,null,null,null,null,null,null,null,null,null,null,null,null,null,null,null,null,null,null,null,null,null,null,null,null,null,null,null,null,null,null,{"$f":"SUM(D180:BN180)","v":0},"Km confirmés",{"$f":"SUM(D182:BN182)","v":0},null,null,null,null,null,null,null,null,null,null,null,null,null,null,null,null,null,{"$f":"SUM(BR180:CH180)","v":0},"Km confirmés",{"$f":"SUM(BR182:CH182)","v":0},"Km confirmés",{"$f":"SUM(CK180+BQ180)","v":0}]
[null,null,null,0,0,0,0,0,0,0,0,0,0,0,0,0,0,0,0,0,0,0,0,0,0,0,0,0,0,0,0,0,0,0,0,0,0,0,0,0,0,0,0,0,0,0,0,0,0,0,0,0,0,0,0,0,0,0,0,0,0,0,0,0,0,0,null,"Rondes confirmées",{"$f":"SUM(C181:BN181)","v":0},0,0,0,0,0,0,0,0,0,0,0,0,0,0,0,0,0,null,"Rondes confirmées",{"$f":"SUM(BR181:CI181)","v":0},"Rondes confirmées",{"$f":"SUM(CK181+BQ181)","v":0}]
[null,null,null,{"$f":"SUM((D179+D180)*D181)","v":0},0,0,0,0,0,0,0,0,0,0,0,0,0,0,0,0,0,0,0,0,0,0,0,0,0,0,0,0,0,0,0,0,0,0,0,0,0,0,0,0,0,0,0,0,0,0,0,0,0,0,0,0,0,0,0,0,0,0,0,0,0,0,null,"Rondes effectuées",{"$f":"COUNTIF(D179:BN179,\">0\")","v":0},0,{"$f":"SUM((BS179+BS180)*BS181)","v":0},0,0,0,0,0,0,0,0,0,0,0,0,0,0,0,null,"Rondes Effectuées",{"$f":"COUNTIF(BR179:CH179,\">0\")","v":0},"Rondes effectuées",{"$f":"SUM(CK182+BQ182)","v":0}]
[45,{"$f":"VLOOKUP(A183,'Numéro licences'!$H$4:$I$47,2)","v":0},"Aller-Retour",null,null,null,null,null,null,null,null,null,null,null,null,null,null,null,null,null,null,null,null,null,null,null,null,null,null,null,null,null,null,null,null,null,null,null,null,null,null,null,null,null,null,null,null,null,null,null,null,null,null,null,null,null,null,null,null,null,null,null,null,null,null,null,{"$f":"SUM(D183:BN183)","v":0},"Km  renseignés",{"$f":"SUM(BO183+BO184)","v":0},null,null,null,null,null,null,null,null,null,null,null,null,null,null,null,null,null,{"$f":"SUM(BR183:CH183)","v":0},"Km  renseignés",{"$f":"SUM(CI183+CI184)","v":0},"Km  renseignés",{"$f":"SUM(BQ183+CK183)","v":0}]
[null,null,"Ronde",null,null,null,null,null,null,null,null,null,null,null,null,null,null,null,null,null,null,null,null,null,null,null,null,null,null,null,null,null,null,null,null,null,null,null,null,null,null,null,null,null,null,null,null,null,null,null,null,null,null,null,null,null,null,null,null,null,null,null,null,null,null,null,{"$f":"SUM(D184:BN184)","v":0},"Km confirmés",{"$f":"SUM(D186:BN186)","v":0},null,null,null,null,null,null,null,null,null,null,null,null,null,null,null,null,null,{"$f":"SUM(BR184:CH184)","v":0},"Km confirmés",{"$f":"SUM(BR186:CH186)","v":0},"Km confirmés",{"$f":"SUM(CK184+BQ184)","v":0}]
[null,null,null,0,0,0,0,0,0,0,0,0,0,0,0,0,0,0,0,0,0,0,0,0,0,0,0,0,0,0,0,0,0,0,0,0,0,0,0,0,0,0,0,0,0,0,0,0,0,0,0,0,0,0,0,0,0,0,0,0,0,0,0,0,0,0,null,"Rondes confirmées",{"$f":"SUM(C185:BN185)","v":0},0,0,0,0,0,0,0,0,0,0,0,0,0,0,0,0,0,null,"Rondes confirmées",{"$f":"SUM(BR185:CI185)","v":0},"Rondes confirmées",{"$f":"SUM(CK185+BQ185)","v":0}]
[null,null,null,{"$f":"SUM((D183+D184)*D185)","v":0},0,0,0,0,0,0,0,0,0,0,0,0,0,0,0,0,0,0,0,0,0,0,0,0,0,0,0,0,0,0,0,0,0,0,0,0,0,0,0,0,0,0,0,0,0,0,0,0,0,0,0,0,0,0,0,0,0,0,0,0,0,0,null,"Rondes effectuées",{"$f":"COUNTIF(D183:BN183,\">0\")","v":0},0,{"$f":"SUM((BS183+BS184)*BS185)","v":0},0,0,0,0,0,0,0,0,0,0,0,0,0,0,0,null,"Rondes Effectuées",{"$f":"COUNTIF(BR183:CH183,\">0\")","v":0},"Rondes effectuées",{"$f":"SUM(CK186+BQ186)","v":0}]
[46,{"$f":"VLOOKUP(A187,'Numéro licences'!$H$4:$I$47,2)","v":0},"Aller-Retour",null,null,null,null,null,null,null,null,null,null,null,null,null,null,null,null,null,null,null,null,null,null,null,null,null,null,null,null,null,null,null,null,null,null,null,null,null,null,null,null,null,null,null,null,null,null,null,null,null,null,null,null,null,null,null,null,null,null,null,null,null,null,null,{"$f":"SUM(D187:BN187)","v":0},"Km  renseignés",{"$f":"SUM(BO187+BO188)","v":0},null,null,null,null,null,null,null,null,null,null,null,null,null,null,null,null,null,{"$f":"SUM(BR187:CH187)","v":0},"Km  renseignés",{"$f":"SUM(CI187+CI188)","v":0},"Km  renseignés",{"$f":"SUM(BQ187+CK187)","v":0}]
[null,null,"Ronde",null,null,null,null,null,null,null,null,null,null,null,null,null,null,null,null,null,null,null,null,null,null,null,null,null,null,null,null,null,null,null,null,null,null,null,null,null,null,null,null,null,null,null,null,null,null,null,null,null,null,null,null,null,null,null,null,null,null,null,null,null,null,null,{"$f":"SUM(D188:BN188)","v":0},"Km confirmés",{"$f":"SUM(D190:BN190)","v":0},null,null,null,null,null,null,null,null,null,null,null,null,null,null,null,null,null,{"$f":"SUM(BR188:CH188)","v":0},"Km confirmés",{"$f":"SUM(BR190:CH190)","v":0},"Km confirmés",{"$f":"SUM(CK188+BQ188)","v":0}]
[null,null,null,0,0,0,0,0,0,0,0,0,0,0,0,0,0,0,0,0,0,0,0,0,0,0,0,0,0,0,0,0,0,0,0,0,0,0,0,0,0,0,0,0,0,0,0,0,0,0,0,0,0,0,0,0,0,0,0,0,0,0,0,0,0,0,null,"Rondes confirmées",{"$f":"SUM(C189:BN189)","v":0},0,0,0,0,0,0,0,0,0,0,0,0,0,0,0,0,0,null,"Rondes confirmées",{"$f":"SUM(BR189:CI189)","v":0},"Rondes confirmées",{"$f":"SUM(CK189+BQ189)","v":0}]
[null,null,null,{"$f":"SUM((D187+D188)*D189)","v":0},0,0,0,0,0,0,0,0,0,0,0,0,0,0,0,0,0,0,0,0,0,0,0,0,0,0,0,0,0,0,0,0,0,0,0,0,0,0,0,0,0,0,0,0,0,0,0,0,0,0,0,0,0,0,0,0,0,0,0,0,0,0,null,"Rondes effectuées",{"$f":"COUNTIF(D187:BN187,\">0\")","v":0},0,{"$f":"SUM((BS187+BS188)*BS189)","v":0},0,0,0,0,0,0,0,0,0,0,0,0,0,0,0,null,"Rondes Effectuées",{"$f":"COUNTIF(BR187:CH187,\">0\")","v":0},"Rondes effectuées",{"$f":"SUM(CK190+BQ190)","v":0}]
[null,null,"Nat.Pirates-Hors/FMB"]
[null,null,"Inconnu ou non-confirmé"]
[]
[null,null,"Concentres",{"$f":"COUNTIF(D7:D190,D4)","v":0},{"$f":"COUNTIF(E7:E190,E4)","v":0},0,0,0,0,0,92,0,92,0,92,0,0,0,92,0,92,0,0,92,0,0,92,0,92,92,92,92,92,92,0,0,92,92,92,0,92,0,0,92,92,92,92,92,92,92,92,0,0,0,92,92,92,92,null,null,null,null,0,0,0,92,{"$f":"SUM(D194:BN194)","v":2760},"Concentres",null,78,2,92,{"$f":"COUNTIF(BU7:BU190,BU4)","v":92},92,92,92,92,92,92,92,92,92,92,92,92,92,{"$f":"SUM(BR194:CH194)","v":1460},"Concentres",null,"Concentres",{"$f":"SUM(CI194+BO194)","v":4220}]
[null,null,"Rondes",{"$f":"COUNTIF(D8:D191,D5)","v":0},{"$f":"COUNTIF(E8:E191,E5)","v":0},0,0,0,0,0,92,0,0,0,92,0,0,0,92,0,92,0,0,92,0,0,0,0,92,92,92,92,92,92,0,0,92,92,92,0,0,0,0,92,92,92,92,92,92,92,92,0,0,0,92,92,92,92,null,null,null,null,0,0,0,92,{"$f":"SUM(D195:BN195)","v":2484},"Rondes",null,7,90,92,{"$f":"COUNTIF(BU8:BU191,BU5)","v":92},92,92,92,92,92,92,92,92,92,92,92,92,92,{"$f":"SUM(BR195:CH195)","v":1477},"Rondes",null,"Rondes",{"$f":"SUM(CI195+BO195)","v":3961}]
[]
[]
[]
[]
[null,"Colonne1"]
[1,"BALLION Pierre"]
[{"$f":"SUM(A201+1)","v":2},"BERDOYES Yannick"]
[{"$f":"SUM(A202+1)","v":3},"CLAISSE Jean-Luc"]
[4,"DAVIN Philippe"]
[5,"DE BONDT Philippe"]
[6,"DE SCHEPPERS Jean-Claude"]
[7,"DECELLE Hubert"]
[8,"DONY Marc"]
[9,"FAVRESSSE René"]
[10,"FONTAINE Guy"]
[11,"GADEYNE Claude"]
[12,"GOOSSENS Joël"]
[13,"LAMBOTTE Didier"]
[14,"LEFEVRE Didier"]
[15,"LEROY Michel"]
[16,"LONDOT Philippe"]
[17,"MALLIEN Philippe"]
[18,"MILET Benoit"]
[19,"NIHOUL Dany"]
[20,"PARMENTIER Dominique"]
[21,"POMPIER Philippe"]
[22,"RICHARD Didier"]
[23,"ROUSSEAU Eric"]
[24,"SERGI Gérard"]
[25,"SMETS Rudy"]
[26,"STRYPSTEIN Nicolas"]
[27,"VANBELLINGEN Jean-Claude"]
[28,"VANDERVELDEN Robert"]
[29]
[30]
[31]
[32]
[33]
[34]
[35]
[36]
[37]
[38]
[39]
[40]
[41]
[42]
[43]
[{"$f":"SUM(A243+1)","v":44}]
[45]
[46]

{"sheet":"Passagers Inter","index":7,"n_rows":178,"n_cols":97,"rows_kept":178,"cut":false,"hidden":false,"merged":[[102,1,105,1],[106,1,109,1],[110,1,113,1],[114,1,117,1],[118,1,121,1],[82,1,85,1],[86,1,89,1],[90,1,93,1],[94,1,97,1],[98,1,101,1],[62,1,65,1],[66,1,69,1],[70,1,73,1],[74,1,77,1],[78,1,81,1],[0,70,0,88],[81,94,81,96],[6,1,9,1],[10,1,13,1],[14,1,17,1],[18,1,21,1],[22,1,25,1],[26,1,29,1],[30,1,33,1],[34,1,37,1],[38,1,41,1],[42,1,45,1],[46,1,49,1],[50,1,53,1],[54,1,57,1],[58,1,61,1]]}
[null,null,null,1,{"$f":"SUM(D1+1)","v":2},{"$f":"SUM(E1+1)","v":3},4,5,6,7,8,9,10,11,12,13,14,15,16,17,18,19,20,21,22,23,24,25,26,27,28,29,30,31,32,33,34,35,36,37,38,39,40,41,42,43,44,45,46,47,48,49,50,51,52,53,54,55,{"$f":"SUM(BF1+1)","v":56},{"$f":"SUM(BG1+1)","v":57},{"$f":"SUM(BH1+1)","v":58},{"$f":"SUM(BI1+1)","v":59},{"$f":"SUM(BJ1+1)","v":60},{"$f":"SUM(BK1+1)","v":61},{"$f":"SUM(BL1+1)","v":62},{"$f":"SUM(BM1+1)","v":63},null,null,null,null,"Hors FMB"]
[null,null,null,null,null,null,null,null,null,null,null,null,null,null,null,null,null,null,null,null,null,null,null,null,null,null,null,null,null,null,null,null,null,null,null,null,null,null,null,null,null,null,null,null,null,null,null,null,null,null,null,null,null,null,null,null,null,null,null,null,null,null,null,null,null,null,null,null,null,"2021-09-02"]
[null,null,null,null,null,null,null,null,null,null,null,null,null,null,null,null,null,null,null,null,null,null,null,null,null,null,null,null,null,null,null,null,null,null,null,null,null,null,null,null,null,null,null,null,null,null,null,null,null,null,null,null,null,null,null,null,null,null,null,null,null,null,null,null,null,null,null,null,null,"Sortie Club - Grande Rivière"]
[null,"Aller-Retour",null,null,null,null,null,null,null,null,null,null,null,null,null,null,null,null,null,null,null,null,null,null,null,null,null,null,null,null,null,null,null,null,null,null,null,null,null,null,null,null,null,null,null,null,null,null,null,null,null,null,null,null,null,null,null,null,null,null,null,null,null,null,null,null,null,null,null,null,null,null,null,null,null,-1,-1,-1,-1,-1,-1,-1,-1,-1,-1,-1]
[null,"Ronde",null,null,null,null,null,null,null,null,null,null,null,null,null,null,null,null,null,null,null,null,null,null,null,null,-1,null,null,-1,null,null,null,null,null,null,null,null,null,null,null,null,null,null,null,null,null,null,null,null,null,null,null,null,null,null,null,null,null,null,null,null,null,null,null,null,null,null,null,257,null,null,null,null,null,-1,-1,-1,-1,-1,-1,-1,-1,-1,-1,-1]
[null,null,null,null,null,null,null,null,null,null,null,null,null,null,null,null,null,null,null,null,null,null,null,null,null,null,null,null,null,null,null,null,null,null,null,null,null,null,null,null,null,null,null,null,null,null,null,null,null,null,null,null,null,null,null,null,null,null,null,null,null,null,null,null,null,null,"Sous-Total\nFMB",null,"Total FMB",null,null,null,null,null,null,null,null,null,null,null,null,null,null,null,null,null,"Sous-Totaux\nPirates",null,"Total Pirates",null,"TOTAL",null,null,null,"FMB","Hors FMB","Total"]
[1,{"$f":"VLOOKUP(A7,'Numéro licences'!$A$4:$B$32,2)","v":"BRIATTE Joëlle"},"Aller-Retour",null,null,null,null,null,null,null,null,null,null,null,null,null,null,null,null,null,null,null,null,null,null,null,null,null,null,null,null,null,null,null,null,null,null,null,null,null,null,null,null,null,null,null,null,null,null,null,null,null,null,null,null,null,null,null,null,null,null,null,null,null,null,null,{"$f":"SUM(D7:BN7)","v":0},"Km  renseignés",{"$f":"SUM(BO7+BO8)","v":0},null,null,null,null,null,null,null,null,null,null,null,null,null,null,null,null,null,{"$f":"SUM(BR7:CH7)","v":0},"Km  renseignés",{"$f":"SUM(CI7+CI8)","v":0},"Km  renseignés",{"$f":"SUM(BQ7+CK7)","v":0},null,1,{"$f":"VLOOKUP(CO7,A7:B187,2)","v":"BRIATTE Joëlle"},{"$f":"SUM(BQ7)","v":0},{"$f":"SUM(CK7)","v":0},{"$f":"SUM(CQ7+CR7)","v":0}]
[null,null,"Ronde",null,null,null,null,null,null,null,null,null,null,null,null,null,null,null,null,null,null,null,null,null,null,null,null,null,null,null,null,null,null,null,null,null,null,null,null,null,null,null,null,null,null,null,null,null,null,null,null,null,null,null,null,null,null,null,null,null,null,null,null,null,null,null,{"$f":"SUM(D8:BN8)","v":0},"Km confirmés",{"$f":"SUM(D10:BN10)","v":0},null,null,null,null,null,null,null,null,null,null,null,null,null,null,null,null,null,{"$f":"SUM(BR8:CH8)","v":0},"Km confirmés",{"$f":"SUM(BR10:CH10)","v":0},"Km confirmés",{"$f":"SUM(CK8+BQ8)","v":0},null,2,{"$f":"VLOOKUP(CO8,A7:B187,2)","v":"DEL FABBRO Laurence"},{"$f":"SUM(BQ11)","v":0},{"$f":"SUM(CK11)","v":1379},{"$f":"SUM(CQ8+CR8)","v":1379}]
[null,null,null,0,0,0,0,0,0,0,0,0,0,0,0,0,0,0,0,0,0,0,0,0,0,0,0,0,0,0,0,0,0,0,0,0,0,0,0,0,0,0,0,0,0,0,0,0,0,0,0,0,0,0,0,0,0,0,0,0,0,0,0,0,0,0,null,"Rondes confirmées",{"$f":"SUM(C9:BN9)","v":0},0,0,0,0,0,0,0,0,0,0,0,0,0,0,0,0,0,null,"Rondes confirmées",{"$f":"SUM(BR9:CI9)","v":0},"Rondes confirmées",{"$f":"SUM(CK9+BQ9)","v":0},null,3,{"$f":"VLOOKUP(CO9,A7:B187,2)","v":"ERVEN France"},{"$f":"SUM(BQ15)","v":0},{"$f":"SUM(CK15)","v":0},{"$f":"SUM(CQ9+CR9)","v":0}]
[null,null,null,{"$f":"SUM((D7+D8)*D9)","v":0},{"$f":"SUM((E7+E8)*E9)","v":0},0,0,0,0,0,0,0,0,0,0,0,0,0,0,0,0,0,0,0,0,0,0,0,0,0,0,0,0,0,0,0,0,0,0,0,0,0,0,0,0,0,0,0,0,0,0,0,0,0,0,0,0,0,0,0,{"$f":"SUM((BI7+BI8)*BI9)","v":0},0,0,0,0,0,null,"Rondes effectuées",{"$f":"COUNTIF(D7:BN7,\">0\")","v":0},{"$f":"SUM((BR7+BR8)*BR9)","v":0},0,0,0,0,0,0,0,0,0,0,0,0,0,0,0,0,null,"Rondes Effectuées",{"$f":"COUNTIF(BR7:CH7,\">0\")","v":0},"Rondes effectuées",{"$f":"SUM(CK10+BQ10)","v":0},null,4,{"$f":"VLOOKUP(CO10,A7:B187,2)","v":"FIEVET Nathalie"},{"$f":"SUM(BQ19)","v":0},{"$f":"SUM(CK19)","v":0},0]
[2,{"$f":"VLOOKUP(A11,'Numéro licences'!$A$4:$B$32,2)","v":"DEL FABBRO Laurence"},"Aller-Retour",null,null,null,null,null,null,null,null,null,null,null,null,null,null,null,null,null,null,null,null,null,null,null,null,null,null,null,null,null,null,null,null,null,null,null,null,null,null,null,null,null,null,null,null,null,null,null,null,null,null,null,null,null,null,null,null,null,null,null,null,null,null,null,{"$f":"SUM(D11:BN11)","v":0},"Km  renseignés",{"$f":"SUM(BO11+BO12)","v":0},1122,null,null,null,null,null,null,null,null,null,null,null,null,null,null,null,null,{"$f":"SUM(BR11:CH11)","v":1122},"Km  renseignés",{"$f":"SUM(CI11+CI12)","v":1379},"Km  renseignés",{"$f":"SUM(BQ11+CK11)","v":1379},null,5,{"$f":"VLOOKUP(CO11,A7:B187,2)","v":"GIAUX Annie"},{"$f":"SUM(BQ23)","v":0},{"$f":"SUM(CK23)","v":0},0]
[null,null,"Ronde",null,null,null,null,null,null,null,null,null,null,null,null,null,null,null,null,null,null,null,null,null,null,null,null,null,null,null,null,null,null,null,null,null,null,null,null,null,null,null,null,null,null,null,null,null,null,null,null,null,null,null,null,null,null,null,null,null,null,null,null,null,null,null,{"$f":"SUM(D12:BN12)","v":0},"Km confirmés",{"$f":"SUM(D14:BN14)","v":0},257,null,null,null,null,null,null,null,null,null,null,null,null,null,null,null,null,{"$f":"SUM(BR12:CH12)","v":257},"Km confirmés",{"$f":"SUM(BR14:CH14)","v":1379},"Km confirmés",{"$f":"SUM(CK12+BQ12)","v":1379},null,6,{"$f":"VLOOKUP(CO12,A7:B187,2)","v":"GOFFIN Guillaume"},{"$f":"SUM(BQ27)","v":0},{"$f":"SUM(CK27)","v":0},0]
[null,null,null,0,0,0,0,0,0,0,0,0,0,0,0,0,0,0,0,0,0,0,0,0,0,0,0,0,0,0,0,0,0,0,0,0,0,0,0,0,0,0,0,0,0,0,0,0,0,0,0,0,0,0,0,0,0,0,0,0,0,0,0,0,0,0,null,"Rondes confirmées",{"$f":"SUM(C13:BN13)","v":0},1,0,0,0,0,0,0,0,0,0,0,0,0,0,0,0,0,null,"Rondes confirmées",{"$f":"SUM(BR13:CI13)","v":1},"Rondes confirmées",{"$f":"SUM(CK13+BQ13)","v":1},null,7,{"$f":"VLOOKUP(CO13,A7:B187,2)","v":"GREGORICS Kathy"},{"$f":"SUM(BQ31)","v":0},{"$f":"SUM(CK31)","v":1462},1462]
[null,null,null,{"$f":"SUM((D11+D12)*D13)","v":0},0,0,0,0,0,0,0,0,0,0,0,0,0,0,0,0,0,0,0,0,0,0,0,0,0,0,0,0,0,0,0,0,0,0,0,0,0,0,0,0,0,0,0,0,0,0,0,0,0,0,0,0,0,0,0,0,{"$f":"SUM((BI11+BI12)*BI13)","v":0},0,0,0,0,0,null,"Rondes effectuées",{"$f":"COUNTIF(D11:BN11,\">0\")","v":0},{"$f":"SUM((BR11+BR12)*BR13)","v":1379},0,0,0,0,0,0,0,0,0,0,0,0,0,0,0,0,null,"Rondes Effectuées",{"$f":"COUNTIF(BR11:CH11,\">0\")","v":1},"Rondes effectuées",{"$f":"SUM(CK14+BQ14)","v":1},null,8,{"$f":"VLOOKUP(CO14,A7:B187,2)","v":"GRIGNET Audrey"},{"$f":"SUM(BQ35)","v":0},{"$f":"SUM(CK35)","v":0},0]
[3,{"$f":"VLOOKUP(A15,'Numéro licences'!$A$4:$B$32,2)","v":"ERVEN France"},"Aller-Retour",null,null,null,null,null,null,null,null,null,null,null,null,null,null,null,null,null,null,null,null,null,null,null,null,null,null,null,null,null,null,null,null,null,null,null,null,null,null,null,null,null,null,null,null,null,null,null,null,null,null,null,null,null,null,null,null,null,null,null,null,null,null,null,{"$f":"SUM(D15:BN15)","v":0},"Km  renseignés",{"$f":"SUM(BO15+BO16)","v":0},null,null,null,null,null,null,null,null,null,null,null,null,null,null,null,null,null,{"$f":"SUM(BR15:CH15)","v":0},"Km  renseignés",{"$f":"SUM(CI15+CI16)","v":0},"Km  renseignés",{"$f":"SUM(BQ15+CK15)","v":0},null,9,{"$f":"VLOOKUP(CO15,A7:B187,2)","v":"LAMBILLON Anne"},{"$f":"SUM(BQ39)","v":0},{"$f":"SUM(CK39)","v":0},0]
[null,null,"Ronde",null,null,null,null,null,null,null,null,null,null,null,null,null,null,null,null,null,null,null,null,null,null,null,null,null,null,null,null,null,null,null,null,null,null,null,null,null,null,null,null,null,null,null,null,null,null,null,null,null,null,null,null,null,null,null,null,null,null,null,null,null,null,null,{"$f":"SUM(D16:BN16)","v":0},"Km confirmés",{"$f":"SUM(D18:BN18)","v":0},null,null,null,null,null,null,null,null,null,null,null,null,null,null,null,null,null,{"$f":"SUM(BR16:CH16)","v":0},"Km confirmés",{"$f":"SUM(BR18:CH18)","v":0},"Km confirmés",{"$f":"SUM(CK16+BQ16)","v":0},null,10,{"$f":"VLOOKUP(CO16,A7:B187,2)","v":"LAMIROY Anne"},{"$f":"SUM(BQ43)","v":0},{"$f":"SUM(CK43)","v":532},532]
[null,null,null,0,0,0,0,0,0,0,0,0,0,0,0,0,0,0,0,0,0,0,0,0,0,0,0,0,0,0,0,0,0,0,0,0,0,0,0,0,0,0,0,0,0,0,0,0,0,0,0,0,0,0,0,0,0,0,0,0,0,0,0,0,0,0,null,"Rondes confirmées",{"$f":"SUM(C17:BN17)","v":0},0,0,0,0,0,0,0,0,0,0,0,0,0,0,0,0,0,null,"Rondes confirmées",{"$f":"SUM(BR17:CI17)","v":0},"Rondes confirmées",{"$f":"SUM(CK17+BQ17)","v":0},null,11,{"$f":"VLOOKUP(CO17,A7:B187,2)","v":"LEROY Laure"},{"$f":"SUM(BQ47)","v":0},{"$f":"SUM(CK47)","v":0},0]
[null,null,null,{"$f":"SUM((D15+D16)*D17)","v":0},0,0,0,0,0,0,0,0,0,0,0,0,0,0,0,0,0,0,0,0,0,0,0,0,0,0,0,0,0,0,0,0,0,0,0,0,0,0,0,0,0,0,0,0,0,0,0,0,0,0,0,0,0,0,0,0,{"$f":"SUM((BI15+BI16)*BI17)","v":0},0,0,0,0,0,null,"Rondes effectuées",{"$f":"COUNTIF(D15:BN15,\">0\")","v":0},{"$f":"SUM((BR15+BR16)*BR17)","v":0},0,0,0,0,0,0,0,0,0,0,0,0,0,0,0,0,null,"Rondes Effectuées",{"$f":"COUNTIF(BR15:CH15,\">0\")","v":0},"Rondes effectuées",{"$f":"SUM(CK18+BQ18)","v":0},null,12,{"$f":"VLOOKUP(CO18,A7:B187,2)","v":"NICLOUX Christine"},{"$f":"SUM(BQ51)","v":0},{"$f":"SUM(CK51)","v":0},0]
[4,{"$f":"VLOOKUP(A19,'Numéro licences'!$A$4:$B$32,2)","v":"FIEVET Nathalie"},"Aller-Retour",null,null,null,null,null,null,null,null,null,null,null,null,null,null,null,null,null,null,null,null,null,null,null,null,null,null,null,null,null,null,null,null,null,null,null,null,null,null,null,null,null,null,null,null,null,null,null,null,null,null,null,null,null,null,null,null,null,null,null,null,null,null,null,{"$f":"SUM(D19:BN19)","v":0},"Km  renseignés",{"$f":"SUM(BO19+BO20)","v":0},null,null,null,null,null,null,null,null,null,null,null,null,null,null,null,null,null,{"$f":"SUM(BR19:CH19)","v":0},"Km  renseignés",{"$f":"SUM(CI19+CI20)","v":0},"Km  renseignés",{"$f":"SUM(BQ19+CK19)","v":0},null,13,{"$f":"VLOOKUP(CO19,A7:B187,2)","v":"PONT Patricia"},{"$f":"SUM(BQ55)","v":0},{"$f":"SUM(CK55)","v":0},0]
[null,null,"Ronde",null,null,null,null,null,null,null,null,null,null,null,null,null,null,null,null,null,null,null,null,null,null,null,null,null,null,null,null,null,null,null,null,null,null,null,null,null,null,null,null,null,null,null,null,null,null,null,null,null,null,null,null,null,null,null,null,null,null,null,null,null,null,null,{"$f":"SUM(D20:BN20)","v":0},"Km confirmés",{"$f":"SUM(D22:BN22)","v":0},null,null,null,null,null,null,null,null,null,null,null,null,null,null,null,null,null,{"$f":"SUM(BR20:CH20)","v":0},"Km confirmés",{"$f":"SUM(BR22:CH22)","v":0},"Km confirmés",{"$f":"SUM(CK20+BQ20)","v":0},null,14,{"$f":"VLOOKUP(CO20,A7:B187,2)","v":"THOMAS Isabelle"},{"$f":"SUM(BQ59)","v":0},{"$f":"SUM(CK59)","v":0},0]
[null,null,null,0,0,0,0,0,0,0,0,0,0,0,0,0,0,0,0,0,0,0,0,0,0,0,0,0,0,0,0,0,0,0,0,0,0,0,0,0,0,0,0,0,0,0,0,0,0,0,0,0,0,0,0,0,0,0,0,0,0,0,0,0,0,0,null,"Rondes confirmées",{"$f":"SUM(C21:BN21)","v":0},0,0,0,0,0,0,0,0,0,0,0,0,0,0,0,0,0,null,"Rondes confirmées",{"$f":"SUM(BR21:CI21)","v":0},"Rondes confirmées",{"$f":"SUM(CK21+BQ21)","v":0},null,15,{"$f":"VLOOKUP(CO21,A7:B187,2)","v":0},{"$f":"SUM(BQ63)","v":0},{"$f":"SUM(CK63)","v":0},0]
[null,null,null,{"$f":"SUM((D19+D20)*D21)","v":0},0,0,0,0,0,0,0,0,0,0,0,0,0,0,0,0,0,0,0,0,0,0,0,0,0,0,0,0,0,0,0,0,0,0,0,0,0,0,0,0,0,0,0,0,0,0,0,0,0,0,0,0,0,0,0,0,{"$f":"SUM((BI19+BI20)*BI21)","v":0},0,0,0,0,0,null,"Rondes effectuées",{"$f":"COUNTIF(D19:BN19,\">0\")","v":0},{"$f":"SUM((BR19+BR20)*BR21)","v":0},0,0,0,0,0,0,0,0,0,0,0,0,0,0,0,0,null,"Rondes Effectuées",{"$f":"COUNTIF(BR19:CH19,\">0\")","v":0},"Rondes effectuées",{"$f":"SUM(CK22+BQ22)","v":0},null,16,{"$f":"VLOOKUP(CO22,A7:B187,2)","v":0},{"$f":"SUM(BQ67)","v":0},{"$f":"SUM(CK67)","v":0},0]
[5,{"$f":"VLOOKUP(A23,'Numéro licences'!$A$4:$B$32,2)","v":"GIAUX Annie"},"Aller-Retour",null,null,null,null,null,null,null,null,null,null,null,null,null,null,null,null,null,null,null,null,null,null,null,null,null,null,null,null,null,null,null,null,null,null,null,null,null,null,null,null,null,null,null,null,null,null,null,null,null,null,null,null,null,null,null,null,null,null,null,null,null,null,null,{"$f":"SUM(D23:BN23)","v":0},"Km  renseignés",{"$f":"SUM(BO23+BO24)","v":0},null,null,null,null,null,null,null,null,null,null,null,null,null,null,null,null,null,{"$f":"SUM(BR23:CH23)","v":0},"Km  renseignés",{"$f":"SUM(CI23+CI24)","v":0},"Km  renseignés",{"$f":"SUM(BQ23+CK23)","v":0},null,17,{"$f":"VLOOKUP(CO23,A7:B187,2)","v":0},{"$f":"SUM(BQ71)","v":0},{"$f":"SUM(CK71)","v":0},0]
[null,null,"Ronde",null,null,null,null,null,null,null,null,null,null,null,null,null,null,null,null,null,null,null,null,null,null,null,null,null,null,null,null,null,null,null,null,null,null,null,null,null,null,null,null,null,null,null,null,null,null,null,null,null,null,null,null,null,null,null,null,null,null,null,null,null,null,null,{"$f":"SUM(D24:BN24)","v":0},"Km confirmés",{"$f":"SUM(D26:BN26)","v":0},null,null,null,null,null,null,null,null,null,null,null,null,null,null,null,null,null,{"$f":"SUM(BR24:CH24)","v":0},"Km confirmés",{"$f":"SUM(BR26:CH26)","v":0},"Km confirmés",{"$f":"SUM(CK24+BQ24)","v":0},null,18,{"$f":"VLOOKUP(CO24,A7:B187,2)","v":0},{"$f":"SUM(BQ75)","v":0},{"$f":"SUM(CK75)","v":0},0]
[null,null,null,0,0,0,0,0,0,0,0,0,0,0,0,0,0,0,0,0,0,0,0,0,0,0,0,0,0,0,0,0,0,0,0,0,0,0,0,0,0,0,0,0,0,0,0,0,0,0,0,0,0,0,0,0,0,0,0,0,0,0,0,0,0,0,null,"Rondes confirmées",{"$f":"SUM(C25:BN25)","v":0},0,0,0,0,0,0,0,0,0,0,0,0,0,0,0,0,0,null,"Rondes confirmées",{"$f":"SUM(BR25:CI25)","v":0},"Rondes confirmées",{"$f":"SUM(CK25+BQ25)","v":0},null,19,{"$f":"VLOOKUP(CO25,A7:B187,2)","v":0},{"$f":"SUM(BQ79)","v":0},{"$f":"SUM(CK79)","v":0},0]
[null,null,null,{"$f":"SUM((D23+D24)*D25)","v":0},0,0,0,0,0,0,0,0,0,0,0,0,0,0,0,0,0,0,0,0,0,0,0,0,0,0,0,0,0,0,0,0,0,0,0,0,0,0,0,0,0,0,0,0,0,0,0,0,0,0,0,0,0,0,0,0,{"$f":"SUM((BI23+BI24)*BI25)","v":0},0,0,0,0,0,null,"Rondes effectuées",{"$f":"COUNTIF(D23:BN23,\">0\")","v":0},{"$f":"SUM((BR23+BR24)*BR25)","v":0},0,0,0,0,0,0,0,0,0,0,0,0,0,0,0,0,null,"Rondes Effectuées",{"$f":"COUNTIF(BR23:CH23,\">0\")","v":0},"Rondes effectuées",{"$f":"SUM(CK26+BQ26)","v":0},null,20,{"$f":"VLOOKUP(CO26,A7:B187,2)","v":0},{"$f":"SUM(BQ83)","v":0},{"$f":"SUM(CK83)","v":0},0]
[6,{"$f":"VLOOKUP(A27,'Numéro licences'!$A$4:$B$32,2)","v":"GOFFIN Guillaume"},"Aller-Retour",null,null,null,null,null,null,null,null,null,null,null,null,null,null,null,null,null,null,null,null,null,null,null,null,null,null,null,null,null,null,null,null,null,null,null,null,null,null,null,null,null,null,null,null,null,null,null,null,null,null,null,null,null,null,null,null,null,null,null,null,null,null,null,{"$f":"SUM(D27:BN27)","v":0},"Km  renseignés",{"$f":"SUM(BO27+BO28)","v":0},null,null,null,null,null,null,null,null,null,null,null,null,null,null,null,null,null,{"$f":"SUM(BR27:CH27)","v":0},"Km  renseignés",{"$f":"SUM(CI27+CI28)","v":0},"Km  renseignés",{"$f":"SUM(BQ27+CK27)","v":0},null,21,{"$f":"VLOOKUP(CO27,A7:B187,2)","v":0},{"$f":"SUM(BQ87)","v":0},{"$f":"SUM(CK87)","v":0},0]
[null,null,"Ronde",null,null,null,null,null,null,null,null,null,null,null,null,null,null,null,null,null,null,null,null,null,null,null,null,null,null,null,null,null,null,null,null,null,null,null,null,null,null,null,null,null,null,null,null,null,null,null,null,null,null,null,null,null,null,null,null,null,null,null,null,null,null,null,{"$f":"SUM(D28:BN28)","v":0},"Km confirmés",{"$f":"SUM(D30:BN30)","v":0},null,null,null,null,null,null,null,null,null,null,null,null,null,null,null,null,null,{"$f":"SUM(BR28:CH28)","v":0},"Km confirmés",{"$f":"SUM(BR30:CH30)","v":0},"Km confirmés",{"$f":"SUM(CK28+BQ28)","v":0},null,22,{"$f":"VLOOKUP(CO28,A7:B187,2)","v":0},{"$f":"SUM(BQ91)","v":0},{"$f":"SUM(CK91)","v":0},0]
[null,null,null,0,0,0,0,0,0,0,0,0,0,0,0,0,0,0,0,0,0,0,0,0,0,0,0,0,0,0,0,0,0,0,0,0,0,0,0,0,0,0,0,0,0,0,0,0,0,0,0,0,0,0,0,0,0,0,0,0,0,0,0,0,0,0,null,"Rondes confirmées",{"$f":"SUM(C29:BN29)","v":0},0,0,0,0,0,0,0,0,0,0,0,0,0,0,0,0,0,null,"Rondes confirmées",{"$f":"SUM(BR29:CI29)","v":0},"Rondes confirmées",{"$f":"SUM(CK29+BQ29)","v":0},null,23,{"$f":"VLOOKUP(CO29,A7:B187,2)","v":0},{"$f":"SUM(BQ95)","v":0},{"$f":"SUM(CK95)","v":0},0]
[null,null,null,{"$f":"SUM((D27+D28)*D29)","v":0},0,0,0,0,0,0,0,0,0,0,0,0,0,0,0,0,0,0,0,0,0,0,0,0,0,0,0,0,0,0,0,0,0,0,0,0,0,0,0,0,0,0,0,0,0,0,0,0,0,0,0,0,0,0,0,0,{"$f":"SUM((BI27+BI28)*BI29)","v":0},0,0,0,0,0,null,"Rondes effectuées",{"$f":"COUNTIF(D27:BN27,\">0\")","v":0},{"$f":"SUM((BR27+BR28)*BR29)","v":0},0,0,0,0,0,0,0,0,0,0,0,0,0,0,0,0,null,"Rondes Effectuées",{"$f":"COUNTIF(BR27:CH27,\">0\")","v":0},"Rondes effectuées",{"$f":"SUM(CK30+BQ30)","v":0},null,24,{"$f":"VLOOKUP(CO30,A7:B187,2)","v":0},{"$f":"SUM(BQ99)","v":0},{"$f":"SUM(CK99)","v":0},0]
[7,{"$f":"VLOOKUP(A31,'Numéro licences'!$A$4:$B$32,2)","v":"GREGORICS Kathy"},"Aller-Retour",null,null,null,null,null,null,null,null,null,null,null,null,null,null,null,null,null,null,null,null,null,null,null,null,null,null,null,null,null,null,null,null,null,null,null,null,null,null,null,null,null,null,null,null,null,null,null,null,null,null,null,null,null,null,null,null,null,null,null,null,null,null,null,{"$f":"SUM(D31:BN31)","v":0},"Km  renseignés",{"$f":"SUM(BO31+BO32)","v":0},1205,null,null,null,null,null,null,null,null,null,null,null,null,null,null,null,null,{"$f":"SUM(BR31:CH31)","v":1205},"Km  renseignés",{"$f":"SUM(CI31+CI32)","v":1462},"Km  renseignés",{"$f":"SUM(BQ31+CK31)","v":1462},null,25,{"$f":"VLOOKUP(CO31,A7:B187,2)","v":0},{"$f":"SUM(BQ103)","v":0},{"$f":"SUM(CK103)","v":0},0]
[null,null,"Ronde",null,null,null,null,null,null,null,null,null,null,null,null,null,null,null,null,null,null,null,null,null,null,null,null,null,null,null,null,null,null,null,null,null,null,null,null,null,null,null,null,null,null,null,null,null,null,null,null,null,null,null,null,null,null,null,null,null,null,null,null,null,null,null,{"$f":"SUM(D32:BN32)","v":0},"Km confirmés",{"$f":"SUM(D34:BN34)","v":0},257,null,null,null,null,null,null,null,null,null,null,null,null,null,null,null,null,{"$f":"SUM(BR32:CH32)","v":257},"Km confirmés",{"$f":"SUM(BR34:CH34)","v":1462},"Km confirmés",{"$f":"SUM(CK32+BQ32)","v":1462},null,26,{"$f":"VLOOKUP(CO32,A7:B187,2)","v":0},{"$f":"SUM(BQ107)","v":0},{"$f":"SUM(CK107)","v":0},0]
[null,null,null,0,0,0,0,0,0,0,0,0,0,0,0,0,0,0,0,0,0,0,0,0,0,0,0,0,0,0,0,0,0,0,0,0,0,0,0,0,0,0,0,0,0,0,0,0,0,0,0,0,0,0,0,0,0,0,0,0,0,0,0,0,0,0,null,"Rondes confirmées",{"$f":"SUM(C33:BN33)","v":0},1,0,0,0,0,0,0,0,0,0,0,0,0,0,0,0,0,null,"Rondes confirmées",{"$f":"SUM(BR33:CI33)","v":1},"Rondes confirmées",{"$f":"SUM(CK33+BQ33)","v":1},null,27,{"$f":"VLOOKUP(CO33,A7:B187,2)","v":0},{"$f":"SUM(BQ111)","v":0},{"$f":"SUM(CK111)","v":0},0]
[null,null,null,{"$f":"SUM((D31+D32)*D33)","v":0},0,0,0,0,0,0,0,0,0,0,0,0,0,0,0,0,0,0,0,0,0,0,0,0,0,0,0,0,0,0,0,0,0,0,0,0,0,0,0,0,0,0,0,0,0,0,0,0,0,0,0,0,0,0,0,0,{"$f":"SUM((BI31+BI32)*BI33)","v":0},0,0,0,0,0,null,"Rondes effectuées",{"$f":"COUNTIF(D31:BN31,\">0\")","v":0},{"$f":"SUM((BR31+BR32)*BR33)","v":1462},0,0,0,0,0,0,0,0,0,0,0,0,0,0,0,0,null,"Rondes Effectuées",{"$f":"COUNTIF(BR31:CH31,\">0\")","v":1},"Rondes effectuées",{"$f":"SUM(CK34+BQ34)","v":1},null,28,{"$f":"VLOOKUP(CO34,A7:B187,2)","v":0},{"$f":"SUM(BQ115)","v":0},{"$f":"SUM(CK115)","v":0},0]
[8,{"$f":"VLOOKUP(A35,'Numéro licences'!$A$4:$B$32,2)","v":"GRIGNET Audrey"},"Aller-Retour",null,null,null,null,null,null,null,null,null,null,null,null,null,null,null,null,null,null,null,null,null,null,null,null,null,null,null,null,null,null,null,null,null,null,null,null,null,null,null,null,null,null,null,null,null,null,null,null,null,null,null,null,null,null,null,null,null,null,null,null,null,null,null,{"$f":"SUM(D35:BN35)","v":0},"Km  renseignés",{"$f":"SUM(BO35+BO36)","v":0},null,null,null,null,null,null,null,null,null,null,null,null,null,null,null,null,null,{"$f":"SUM(BR35:CH35)","v":0},"Km  renseignés",{"$f":"SUM(CI35+CI36)","v":0},"Km  renseignés",{"$f":"SUM(BQ35+CK35)","v":0},null,29,{"$f":"VLOOKUP(CO35,A7:B187,2)","v":0},{"$f":"SUM(BQ119)","v":0},{"$f":"SUM(CK119)","v":0},0]
[null,null,"Ronde",null,null,null,null,null,null,null,null,null,null,null,null,null,null,null,null,null,null,null,null,null,null,null,null,null,null,null,null,null,null,null,null,null,null,null,null,null,null,null,null,null,null,null,null,null,null,null,null,null,null,null,null,null,null,null,null,null,null,null,null,null,null,null,{"$f":"SUM(D36:BN36)","v":0},"Km confirmés",{"$f":"SUM(D38:BN38)","v":0},null,null,null,null,null,null,null,null,null,null,null,null,null,null,null,null,null,{"$f":"SUM(BR36:CH36)","v":0},"Km confirmés",{"$f":"SUM(BR38:CH38)","v":0},"Km confirmés",{"$f":"SUM(CK36+BQ36)","v":0}]
[null,null,null,0,0,0,0,0,0,0,0,0,0,0,0,0,0,0,0,0,0,0,0,0,0,0,0,0,0,0,0,0,0,0,0,0,0,0,0,0,0,0,0,0,0,0,0,0,0,0,0,0,0,0,0,0,0,0,0,0,0,0,0,0,0,0,null,"Rondes confirmées",{"$f":"SUM(C37:BN37)","v":0},0,0,0,0,0,0,0,0,0,0,0,0,0,0,0,0,0,null,"Rondes confirmées",{"$f":"SUM(BR37:CI37)","v":0},"Rondes confirmées",{"$f":"SUM(CK37+BQ37)","v":0}]
[null,null,null,{"$f":"SUM((D35+D36)*D37)","v":0},0,0,0,0,0,0,0,0,0,0,0,0,0,0,0,0,0,0,0,0,0,0,0,0,0,0,0,0,0,0,0,0,0,0,0,0,0,0,0,0,0,0,0,0,0,0,0,0,0,0,0,0,0,0,0,0,{"$f":"SUM((BI35+BI36)*BI37)","v":0},0,0,0,0,0,null,"Rondes effectuées",{"$f":"COUNTIF(D35:BN35,\">0\")","v":0},{"$f":"SUM((BR35+BR36)*BR37)","v":0},0,0,0,0,0,0,0,0,0,0,0,0,0,0,0,0,null,"Rondes Effectuées",{"$f":"COUNTIF(BR35:CH35,\">0\")","v":0},"Rondes effectuées",{"$f":"SUM(CK38+BQ38)","v":0}]
[9,{"$f":"VLOOKUP(A39,'Numéro licences'!$A$4:$B$32,2)","v":"LAMBILLON Anne"},"Aller-Retour",null,null,null,null,null,null,null,null,null,null,null,null,null,null,null,null,null,null,null,null,null,null,null,null,null,null,null,null,null,null,null,null,null,null,null,null,null,null,null,null,null,null,null,null,null,null,null,null,null,null,null,null,null,null,null,null,null,null,null,null,null,null,null,{"$f":"SUM(D39:BN39)","v":0},"Km  renseignés",{"$f":"SUM(BO39+BO40)","v":0},null,null,null,null,null,null,null,null,null,null,null,null,null,null,null,null,null,{"$f":"SUM(BR39:CH39)","v":0},"Km  renseignés",{"$f":"SUM(CI39+CI40)","v":0},"Km  renseignés",{"$f":"SUM(BQ39+CK39)","v":0}]
[null,null,"Ronde",null,null,null,null,null,null,null,null,null,null,null,null,null,null,null,null,null,null,null,null,null,null,null,null,null,null,null,null,null,null,null,null,null,null,null,null,null,null,null,null,null,null,null,null,null,null,null,null,null,null,null,null,null,null,null,null,null,null,null,null,null,null,null,{"$f":"SUM(D40:BN40)","v":0},"Km confirmés",{"$f":"SUM(D42:BN42)","v":0},null,null,null,null,null,null,null,null,null,null,null,null,null,null,null,null,null,{"$f":"SUM(BR40:CH40)","v":0},"Km confirmés",{"$f":"SUM(BR42:CH42)","v":0},"Km confirmés",{"$f":"SUM(CK40+BQ40)","v":0}]
[null,null,null,0,0,0,0,0,0,0,0,0,0,0,0,0,0,0,0,0,0,0,0,0,0,0,0,0,0,0,0,0,0,0,0,0,0,0,0,0,0,0,0,0,0,0,0,0,0,0,0,0,0,0,0,0,0,0,0,0,0,0,0,0,0,0,null,"Rondes confirmées",{"$f":"SUM(C41:BN41)","v":0},0,0,0,0,0,0,0,0,0,0,0,0,0,0,0,0,0,null,"Rondes confirmées",{"$f":"SUM(BR41:CI41)","v":0},"Rondes confirmées",{"$f":"SUM(CK41+BQ41)","v":0},null,null,null,{"$f":"SUM(CQ8:CQ35)","v":0},{"$f":"SUM(CR8:CR35)","v":3373},{"$f":"SUM(CS7:CS35)","v":3373}]
[null,null,null,{"$f":"SUM((D39+D40)*D41)","v":0},0,0,0,0,0,0,0,0,0,0,0,0,0,0,0,0,0,0,0,0,0,0,0,0,0,0,0,0,0,0,0,0,0,0,0,0,0,0,0,0,0,0,0,0,0,0,0,0,0,0,0,0,0,0,0,0,{"$f":"SUM((BI39+BI40)*BI41)","v":0},0,0,0,0,0,null,"Rondes effectuées",{"$f":"COUNTIF(D39:BN39,\">0\")","v":0},{"$f":"SUM((BR39+BR40)*BR41)","v":0},0,0,0,0,0,0,0,0,0,0,0,0,0,0,0,0,null,"Rondes Effectuées",{"$f":"COUNTIF(BR39:CH39,\">0\")","v":0},"Rondes effectuées",{"$f":"SUM(CK42+BQ42)","v":0},null,null,null,{"$f":"SUM(CQ41/CS41)","v":0},{"$f":"SUM(CR41/CS41)","v":1}]
[10,{"$f":"VLOOKUP(A43,'Numéro licences'!$A$4:$B$32,2)","v":"LAMIROY Anne"},"Aller-Retour",null,null,null,null,null,null,null,null,null,null,null,null,null,null,null,null,null,null,null,null,null,null,null,null,null,null,null,null,null,null,null,null,null,null,null,null,null,null,null,null,null,null,null,null,null,null,null,null,null,null,null,null,null,null,null,null,null,null,null,null,null,null,null,{"$f":"SUM(D43:BN43)","v":0},"Km  renseignés",{"$f":"SUM(BO43+BO44)","v":0},275,null,null,null,null,null,null,null,null,null,null,null,null,null,null,null,null,{"$f":"SUM(BR43:CH43)","v":275},"Km  renseignés",{"$f":"SUM(CI43+CI44)","v":532},"Km  renseignés",{"$f":"SUM(BQ43+CK43)","v":532},null,null,null,"FMB","Hors FMB"]
[null,null,"Ronde",null,null,null,null,null,null,null,null,null,null,null,null,null,null,null,null,null,null,null,null,null,null,null,null,null,null,null,null,null,null,null,null,null,null,null,null,null,null,null,null,null,null,null,null,null,null,null,null,null,null,null,null,null,null,null,null,null,null,null,null,null,null,null,{"$f":"SUM(D44:BN44)","v":0},"Km confirmés",{"$f":"SUM(D46:BN46)","v":0},257,null,null,null,null,null,null,null,null,null,null,null,null,null,null,null,null,{"$f":"SUM(BR44:CH44)","v":257},"Km confirmés",{"$f":"SUM(BR46:CH46)","v":532},"Km confirmés",{"$f":"SUM(CK44+BQ44)","v":532}]
[null,null,null,0,0,0,0,0,0,0,0,0,0,0,0,0,0,0,0,0,0,0,0,0,0,0,0,0,0,0,0,0,0,0,0,0,0,0,0,0,0,0,0,0,0,0,0,0,0,0,0,0,0,0,0,0,0,0,0,0,0,0,0,0,0,0,null,"Rondes confirmées",{"$f":"SUM(C45:BN45)","v":0},1,0,0,0,0,0,0,0,0,0,0,0,0,0,0,0,0,null,"Rondes confirmées",{"$f":"SUM(BR45:CI45)","v":1},"Rondes confirmées",{"$f":"SUM(CK45+BQ45)","v":1}]
[null,null,null,{"$f":"SUM((D43+D44)*D45)","v":0},0,0,0,0,0,0,0,0,0,0,0,0,0,0,0,0,0,0,0,0,0,0,0,0,0,0,0,0,0,0,0,0,0,0,0,0,0,0,0,0,0,0,0,0,0,0,0,0,0,0,0,0,0,0,0,0,{"$f":"SUM((BI43+BI44)*BI45)","v":0},0,0,0,0,0,null,"Rondes effectuées",{"$f":"COUNTIF(D43:BN43,\">0\")","v":0},{"$f":"SUM((BR43+BR44)*BR45)","v":532},0,0,0,0,0,0,0,0,0,0,0,0,0,0,0,0,null,"Rondes Effectuées",{"$f":"COUNTIF(BR43:CH43,\">0\")","v":1},"Rondes effectuées",{"$f":"SUM(CK46+BQ46)","v":1}]
[11,{"$f":"VLOOKUP(A47,'Numéro licences'!$A$4:$B$32,2)","v":"LEROY Laure"},"Aller-Retour",null,null,null,null,null,null,null,null,null,null,null,null,null,null,null,null,null,null,null,null,null,null,null,null,null,null,null,null,null,null,null,null,null,null,null,null,null,null,null,null,null,null,null,null,null,null,null,null,null,null,null,null,null,null,null,null,null,null,null,null,null,null,null,{"$f":"SUM(D47:BN47)","v":0},"Km  renseignés",{"$f":"SUM(BO47+BO48)","v":0},null,null,null,null,null,null,null,null,null,null,null,null,null,null,null,null,null,{"$f":"SUM(BR47:CH47)","v":0},"Km  renseignés",{"$f":"SUM(CI47+CI48)","v":0},"Km  renseignés",{"$f":"SUM(BQ47+CK47)","v":0}]
[null,null,"Ronde",null,null,null,null,null,null,null,null,null,null,null,null,null,null,null,null,null,null,null,null,null,null,null,null,null,null,null,null,null,null,null,null,null,null,null,null,null,null,null,null,null,null,null,null,null,null,null,null,null,null,null,null,null,null,null,null,null,null,null,null,null,null,null,{"$f":"SUM(D48:BN48)","v":0},"Km confirmés",{"$f":"SUM(D50:BN50)","v":0},null,null,null,null,null,null,null,null,null,null,null,null,null,null,null,null,null,{"$f":"SUM(BR48:CH48)","v":0},"Km confirmés",{"$f":"SUM(BR50:CH50)","v":0},"Km confirmés",{"$f":"SUM(CK48+BQ48)","v":0}]
[null,null,null,0,0,0,0,0,0,0,0,0,0,0,0,0,0,0,0,0,0,0,0,0,0,0,0,0,0,0,0,0,0,0,0,0,0,0,0,0,0,0,0,0,0,0,0,0,0,0,0,0,0,0,0,0,0,0,0,0,0,0,0,0,0,0,null,"Rondes confirmées",{"$f":"SUM(C49:BN49)","v":0},0,0,0,0,0,0,0,0,0,0,0,0,0,0,0,0,0,null,"Rondes confirmées",{"$f":"SUM(BR49:CI49)","v":0},"Rondes confirmées",{"$f":"SUM(CK49+BQ49)","v":0}]
[null,null,null,{"$f":"SUM((D47+D48)*D49)","v":0},0,0,0,0,0,0,0,0,0,0,0,0,0,0,0,0,0,0,0,0,0,0,0,0,0,0,0,0,0,0,0,0,0,0,0,0,0,0,0,0,0,0,0,0,0,0,0,0,0,0,0,0,0,0,0,0,{"$f":"SUM((BI47+BI48)*BI49)","v":0},0,0,0,0,0,null,"Rondes effectuées",{"$f":"COUNTIF(D47:BN47,\">0\")","v":0},{"$f":"SUM((BR47+BR48)*BR49)","v":0},0,0,0,0,0,0,0,0,0,0,0,0,0,0,0,0,null,"Rondes Effectuées",{"$f":"COUNTIF(BR47:CH47,\">0\")","v":0},"Rondes effectuées",{"$f":"SUM(CK50+BQ50)","v":0}]
[12,{"$f":"VLOOKUP(A51,'Numéro licences'!$A$4:$B$32,2)","v":"NICLOUX Christine"},"Aller-Retour",null,null,null,null,null,null,null,null,null,null,null,null,null,null,null,null,null,null,null,null,null,null,null,null,null,null,null,null,null,null,null,null,null,null,null,null,null,null,null,null,null,null,null,null,null,null,null,null,null,null,null,null,null,null,null,null,null,null,null,null,null,null,null,{"$f":"SUM(D51:BN51)","v":0},"Km  renseignés",{"$f":"SUM(BO51+BO52)","v":0},null,null,null,null,null,null,null,null,null,null,null,null,null,null,null,null,null,{"$f":"SUM(BR51:CH51)","v":0},"Km  renseignés",{"$f":"SUM(CI51+CI52)","v":0},"Km  renseignés",{"$f":"SUM(BQ51+CK51)","v":0}]
[null,null,"Ronde",null,null,null,null,null,null,null,null,null,null,null,null,null,null,null,null,null,null,null,null,null,null,null,null,null,null,null,null,null,null,null,null,null,null,null,null,null,null,null,null,null,null,null,null,null,null,null,null,null,null,null,null,null,null,null,null,null,null,null,null,null,null,null,{"$f":"SUM(D52:BN52)","v":0},"Km confirmés",{"$f":"SUM(D54:BN54)","v":0},null,null,null,null,null,null,null,null,null,null,null,null,null,null,null,null,null,{"$f":"SUM(BR52:CH52)","v":0},"Km confirmés",{"$f":"SUM(BR54:CH54)","v":0},"Km confirmés",{"$f":"SUM(CK52+BQ52)","v":0}]
[null,null,null,0,0,0,0,0,0,0,0,0,0,0,0,0,0,0,0,0,0,0,0,0,0,0,0,0,0,0,0,0,0,0,0,0,0,0,0,0,0,0,0,0,0,0,0,0,0,0,0,0,0,0,0,0,0,0,0,0,0,0,0,0,0,0,null,"Rondes confirmées",{"$f":"SUM(C53:BN53)","v":0},0,0,0,0,0,0,0,0,0,0,0,0,0,0,0,0,0,null,"Rondes confirmées",{"$f":"SUM(BR53:CI53)","v":0},"Rondes confirmées",{"$f":"SUM(CK53+BQ53)","v":0}]
[null,null,null,{"$f":"SUM((D51+D52)*D53)","v":0},0,0,0,0,0,0,0,0,0,0,0,0,0,0,0,0,0,0,0,0,0,0,0,0,0,0,0,0,0,0,0,0,0,0,0,0,0,0,0,0,0,0,0,0,0,0,0,0,0,0,0,0,0,0,0,0,{"$f":"SUM((BI51+BI52)*BI53)","v":0},0,0,0,0,0,null,"Rondes effectuées",{"$f":"COUNTIF(D51:BN51,\">0\")","v":0},{"$f":"SUM((BR51+BR52)*BR53)","v":0},0,0,0,0,0,0,0,0,0,0,0,0,0,0,0,0,null,"Rondes Effectuées",{"$f":"COUNTIF(BR51:CH51,\">0\")","v":0},"Rondes effectuées",{"$f":"SUM(CK54+BQ54)","v":0}]
[13,{"$f":"VLOOKUP(A55,'Numéro licences'!$A$4:$B$32,2)","v":"PONT Patricia"},"Aller-Retour",null,null,null,null,null,null,null,null,null,null,null,null,null,null,null,null,null,null,null,null,null,null,null,null,null,null,null,null,null,null,null,null,null,null,null,null,null,null,null,null,null,null,null,null,null,null,null,null,null,null,null,null,null,null,null,null,null,null,null,null,null,null,null,{"$f":"SUM(D55:BN55)","v":0},"Km  renseignés",{"$f":"SUM(BO55+BO56)","v":0},null,null,null,null,null,null,null,null,null,null,null,null,null,null,null,null,null,{"$f":"SUM(BR55:CH55)","v":0},"Km  renseignés",{"$f":"SUM(CI55+CI56)","v":0},"Km  renseignés",{"$f":"SUM(BQ55+CK55)","v":0}]
[null,null,"Ronde",null,null,null,null,null,null,null,null,null,null,null,null,null,null,null,null,null,null,null,null,null,null,null,null,null,null,null,null,null,null,null,null,null,null,null,null,null,null,null,null,null,null,null,null,null,null,null,null,null,null,null,null,null,null,null,null,null,null,null,null,null,null,null,{"$f":"SUM(D56:BN56)","v":0},"Km confirmés",{"$f":"SUM(D58:BN58)","v":0},null,null,null,null,null,null,null,null,null,null,null,null,null,null,null,null,null,{"$f":"SUM(BR56:CH56)","v":0},"Km confirmés",{"$f":"SUM(BR58:CH58)","v":0},"Km confirmés",{"$f":"SUM(CK56+BQ56)","v":0}]
[null,null,null,0,0,0,0,0,0,0,0,0,0,0,0,0,0,0,0,0,0,0,0,0,0,0,0,0,0,0,0,0,0,0,0,0,0,0,0,0,0,0,0,0,0,0,0,0,0,0,0,0,0,0,0,0,0,0,0,0,0,0,0,0,0,0,null,"Rondes confirmées",{"$f":"SUM(C57:BN57)","v":0},0,0,0,0,0,0,0,0,0,0,0,0,0,0,0,0,0,null,"Rondes confirmées",{"$f":"SUM(BR57:CI57)","v":0},"Rondes confirmées",{"$f":"SUM(CK57+BQ57)","v":0}]
[null,null,null,{"$f":"SUM((D55+D56)*D57)","v":0},0,0,0,0,0,0,0,0,0,0,0,0,0,0,0,0,0,0,0,0,0,0,0,0,0,0,0,0,0,0,0,0,0,0,0,0,0,0,0,0,0,0,0,0,0,0,0,0,0,0,0,0,0,0,0,0,{"$f":"SUM((BI55+BI56)*BI57)","v":0},0,0,0,0,0,null,"Rondes effectuées",{"$f":"COUNTIF(D55:BN55,\">0\")","v":0},{"$f":"SUM((BR55+BR56)*BR57)","v":0},0,0,0,0,0,0,0,0,0,0,0,0,0,0,0,0,null,"Rondes Effectuées",{"$f":"COUNTIF(BR55:CH55,\">0\")","v":0},"Rondes effectuées",{"$f":"SUM(CK58+BQ58)","v":0}]
[14,{"$f":"VLOOKUP(A59,'Numéro licences'!$A$4:$B$32,2)","v":"THOMAS Isabelle"},"Aller-Retour",null,null,null,null,null,null,null,null,null,null,null,null,null,null,null,null,null,null,null,null,null,null,null,null,null,null,null,null,null,null,null,null,null,null,null,null,null,null,null,null,null,null,null,null,null,null,null,null,null,null,null,null,null,null,null,null,null,null,null,null,null,null,null,{"$f":"SUM(D59:BN59)","v":0},"Km  renseignés",{"$f":"SUM(BO59+BO60)","v":0},null,null,null,null,null,null,null,null,null,null,null,null,null,null,null,null,null,{"$f":"SUM(BR59:CH59)","v":0},"Km  renseignés",{"$f":"SUM(CI59+CI60)","v":0},"Km  renseignés",{"$f":"SUM(BQ59+CK59)","v":0}]
[null,null,"Ronde",null,null,null,null,null,null,null,null,null,null,null,null,null,null,null,null,null,null,null,null,null,null,null,null,null,null,null,null,null,null,null,null,null,null,null,null,null,null,null,null,null,null,null,null,null,null,null,null,null,null,null,null,null,null,null,null,null,null,null,null,null,null,null,{"$f":"SUM(D60:BN60)","v":0},"Km confirmés",{"$f":"SUM(D62:BN62)","v":0},null,null,null,null,null,null,null,null,null,null,null,null,null,null,null,null,null,{"$f":"SUM(BR60:CH60)","v":0},"Km confirmés",{"$f":"SUM(BR62:CH62)","v":0},"Km confirmés",{"$f":"SUM(CK60+BQ60)","v":0}]
[null,null,null,0,0,0,0,0,0,0,0,0,0,0,0,0,0,0,0,0,0,0,0,0,0,0,0,0,0,0,0,0,0,0,0,0,0,0,0,0,0,0,0,0,0,0,0,0,0,0,0,0,0,0,0,0,0,0,0,0,0,0,0,0,0,0,null,"Rondes confirmées",{"$f":"SUM(C61:BN61)","v":0},0,0,0,0,0,0,0,0,0,0,0,0,0,0,0,0,0,null,"Rondes confirmées",{"$f":"SUM(BR61:CI61)","v":0},"Rondes confirmées",{"$f":"SUM(CK61+BQ61)","v":0}]
[null,null,null,{"$f":"SUM((D59+D60)*D61)","v":0},0,0,0,0,0,0,0,0,0,0,0,0,0,0,0,0,0,0,0,0,0,0,0,0,0,0,0,0,0,0,0,0,0,0,0,0,0,0,0,0,0,0,0,0,0,0,0,0,0,0,0,0,0,0,0,0,{"$f":"SUM((BI59+BI60)*BI61)","v":0},0,0,0,0,0,null,"Rondes effectuées",{"$f":"COUNTIF(D59:BN59,\">0\")","v":0},{"$f":"SUM((BR59+BR60)*BR61)","v":0},0,0,0,0,0,0,0,0,0,0,0,0,0,0,0,0,null,"Rondes Effectuées",{"$f":"COUNTIF(BR59:CH59,\">0\")","v":0},"Rondes effectuées",{"$f":"SUM(CK62+BQ62)","v":0}]
[15,{"$f":"VLOOKUP(A63,'Numéro licences'!$A$4:$B$32,2)","v":0},"Aller-Retour",null,null,null,null,null,null,null,null,null,null,null,null,null,null,null,null,null,null,null,null,null,null,null,null,null,null,null,null,null,null,null,null,null,null,null,null,null,null,null,null,null,null,null,null,null,null,null,null,null,null,null,null,null,null,null,null,null,null,null,null,null,null,null,{"$f":"SUM(D63:BN63)","v":0},"Km  renseignés",{"$f":"SUM(BO63+BO64)","v":0},null,null,null,null,null,null,null,null,null,null,null,null,null,null,null,null,null,{"$f":"SUM(BR63:CH63)","v":0},"Km  renseignés",{"$f":"SUM(CI63+CI64)","v":0},"Km  renseignés",{"$f":"SUM(BQ63+CK63)","v":0}]
[null,null,"Ronde",null,null,null,null,null,null,null,null,null,null,null,null,null,null,null,null,null,null,null,null,null,null,null,null,null,null,null,null,null,null,null,null,null,null,null,null,null,null,null,null,null,null,null,null,null,null,null,null,null,null,null,null,null,null,null,null,null,null,null,null,null,null,null,{"$f":"SUM(D64:BN64)","v":0},"Km confirmés",{"$f":"SUM(D66:BN66)","v":0},null,null,null,null,null,null,null,null,null,null,null,null,null,null,null,null,null,{"$f":"SUM(BR64:CH64)","v":0},"Km confirmés",{"$f":"SUM(BR66:CH66)","v":0},"Km confirmés",{"$f":"SUM(CK64+BQ64)","v":0}]
[null,null,null,0,0,0,0,0,0,0,0,0,0,0,0,0,0,0,0,0,0,0,0,0,0,0,0,0,0,0,0,0,0,0,0,0,0,0,0,0,0,0,0,0,0,0,0,0,0,0,0,0,0,0,0,0,0,0,0,0,0,0,0,0,0,0,null,"Rondes confirmées",{"$f":"SUM(C65:BN65)","v":0},0,0,0,0,0,0,0,0,0,0,0,0,0,0,0,0,0,null,"Rondes confirmées",{"$f":"SUM(BR65:CI65)","v":0},"Rondes confirmées",{"$f":"SUM(CK65+BQ65)","v":0}]
[null,null,null,{"$f":"SUM((D63+D64)*D65)","v":0},0,0,0,0,0,0,0,0,0,0,0,0,0,0,0,0,0,0,0,0,0,0,0,0,0,0,0,0,0,0,0,0,0,0,0,0,0,0,0,0,0,0,0,0,0,0,0,0,0,0,0,0,0,0,0,0,{"$f":"SUM((BI63+BI64)*BI65)","v":0},0,0,0,0,0,null,"Rondes effectuées",{"$f":"COUNTIF(D63:BN63,\">0\")","v":0},{"$f":"SUM((BR63+BR64)*BR65)","v":0},0,0,0,0,0,0,0,0,0,0,0,0,0,0,0,0,null,"Rondes Effectuées",{"$f":"COUNTIF(BR63:CH63,\">0\")","v":0},"Rondes effectuées",{"$f":"SUM(CK66+BQ66)","v":0}]
[16,{"$f":"VLOOKUP(A67,'Numéro licences'!$A$4:$B$32,2)","v":0},"Aller-Retour",null,null,null,null,null,null,null,null,null,null,null,null,null,null,null,null,null,null,null,null,null,null,null,null,null,null,null,null,null,null,null,null,null,null,null,null,null,null,null,null,null,null,null,null,null,null,null,null,null,null,null,null,null,null,null,null,null,null,null,null,null,null,null,{"$f":"SUM(D67:BN67)","v":0},"Km  renseignés",{"$f":"SUM(BO67+BO68)","v":0},null,null,null,null,null,null,null,null,null,null,null,null,null,null,null,null,null,{"$f":"SUM(BR67:CH67)","v":0},"Km  renseignés",{"$f":"SUM(CI67+CI68)","v":0},"Km  renseignés",{"$f":"SUM(BQ67+CK67)","v":0}]
[null,null,"Ronde",null,null,null,null,null,null,null,null,null,null,null,null,null,null,null,null,null,null,null,null,null,null,null,null,null,null,null,null,null,null,null,null,null,null,null,null,null,null,null,null,null,null,null,null,null,null,null,null,null,null,null,null,null,null,null,null,null,null,null,null,null,null,null,{"$f":"SUM(D68:BN68)","v":0},"Km confirmés",{"$f":"SUM(D70:BN70)","v":0},null,null,null,null,null,null,null,null,null,null,null,null,null,null,null,null,null,{"$f":"SUM(BR68:CH68)","v":0},"Km confirmés",{"$f":"SUM(BR70:CH70)","v":0},"Km confirmés",{"$f":"SUM(CK68+BQ68)","v":0}]
[null,null,null,0,0,0,0,0,0,0,0,0,0,0,0,0,0,0,0,0,0,0,0,0,0,0,0,0,0,0,0,0,0,0,0,0,0,0,0,0,0,0,0,0,0,0,0,0,0,0,0,0,0,0,0,0,0,0,0,0,0,0,0,0,0,0,null,"Rondes confirmées",{"$f":"SUM(C69:BN69)","v":0},0,0,0,0,0,0,0,0,0,0,0,0,0,0,0,0,0,null,"Rondes confirmées",{"$f":"SUM(BR69:CI69)","v":0},"Rondes confirmées",{"$f":"SUM(CK69+BQ69)","v":0}]
[null,null,null,{"$f":"SUM((D67+D68)*D69)","v":0},0,0,0,0,0,0,0,0,0,0,0,0,0,0,0,0,0,0,0,0,0,0,0,0,0,0,0,0,0,0,0,0,0,0,0,0,0,0,0,0,0,0,0,0,0,0,0,0,0,0,0,0,0,0,0,0,{"$f":"SUM((BI67+BI68)*BI69)","v":0},0,0,0,0,0,null,"Rondes effectuées",{"$f":"COUNTIF(D67:BN67,\">0\")","v":0},{"$f":"SUM((BR67+BR68)*BR69)","v":0},0,0,0,0,0,0,0,0,0,0,0,0,0,0,0,0,null,"Rondes Effectuées",{"$f":"COUNTIF(BR67:CH67,\">0\")","v":0},"Rondes effectuées",{"$f":"SUM(CK70+BQ70)","v":0}]
[17,{"$f":"VLOOKUP(A71,'Numéro licences'!$A$4:$B$32,2)","v":0},"Aller-Retour",null,null,null,null,null,null,null,null,null,null,null,null,null,null,null,null,null,null,null,null,null,null,null,null,null,null,null,null,null,null,null,null,null,null,null,null,null,null,null,null,null,null,null,null,null,null,null,null,null,null,null,null,null,null,null,null,null,null,null,null,null,null,null,{"$f":"SUM(D71:BN71)","v":0},"Km  renseignés",{"$f":"SUM(BO71+BO72)","v":0},null,null,null,null,null,null,null,null,null,null,null,null,null,null,null,null,null,{"$f":"SUM(BR71:CH71)","v":0},"Km  renseignés",{"$f":"SUM(CI71+CI72)","v":0},"Km  renseignés",{"$f":"SUM(BQ71+CK71)","v":0}]
[null,null,"Ronde",null,null,null,null,null,null,null,null,null,null,null,null,null,null,null,null,null,null,null,null,null,null,null,null,null,null,null,null,null,null,null,null,null,null,null,null,null,null,null,null,null,null,null,null,null,null,null,null,null,null,null,null,null,null,null,null,null,null,null,null,null,null,null,{"$f":"SUM(D72:BN72)","v":0},"Km confirmés",{"$f":"SUM(D74:BN74)","v":0},null,null,null,null,null,null,null,null,null,null,null,null,null,null,null,null,null,{"$f":"SUM(BR72:CH72)","v":0},"Km confirmés",{"$f":"SUM(BR74:CH74)","v":0},"Km confirmés",{"$f":"SUM(CK72+BQ72)","v":0}]
[null,null,null,0,0,0,0,0,0,0,0,0,0,0,0,0,0,0,0,0,0,0,0,0,0,0,0,0,0,0,0,0,0,0,0,0,0,0,0,0,0,0,0,0,0,0,0,0,0,0,0,0,0,0,0,0,0,0,0,0,0,0,0,0,0,0,null,"Rondes confirmées",{"$f":"SUM(C73:BN73)","v":0},0,0,0,0,0,0,0,0,0,0,0,0,0,0,0,0,0,null,"Rondes confirmées",{"$f":"SUM(BR73:CI73)","v":0},"Rondes confirmées",{"$f":"SUM(CK73+BQ73)","v":0}]
[null,null,null,{"$f":"SUM((D71+D72)*D73)","v":0},0,0,0,0,0,0,0,0,0,0,0,0,0,0,0,0,0,0,0,0,0,0,0,0,0,0,0,0,0,0,0,0,0,0,0,0,0,0,0,0,0,0,0,0,0,0,0,0,0,0,0,0,0,0,0,0,{"$f":"SUM((BI71+BI72)*BI73)","v":0},0,0,0,0,0,null,"Rondes effectuées",{"$f":"COUNTIF(D71:BN71,\">0\")","v":0},{"$f":"SUM((BR71+BR72)*BR73)","v":0},0,0,0,0,0,0,0,0,0,0,0,0,0,0,0,0,null,"Rondes Effectuées",{"$f":"COUNTIF(BR71:CH71,\">0\")","v":0},"Rondes effectuées",{"$f":"SUM(CK74+BQ74)","v":0}]
[18,{"$f":"VLOOKUP(A75,'Numéro licences'!$A$4:$B$32,2)","v":0},"Aller-Retour",null,null,null,null,null,null,null,null,null,null,null,null,null,null,null,null,null,null,null,null,null,null,null,null,null,null,null,null,null,null,null,null,null,null,null,null,null,null,null,null,null,null,null,null,null,null,null,null,null,null,null,null,null,null,null,null,null,null,null,null,null,null,null,{"$f":"SUM(D75:BN75)","v":0},"Km  renseignés",{"$f":"SUM(BO75+BO76)","v":0},null,null,null,null,null,null,null,null,null,null,null,null,null,null,null,null,null,{"$f":"SUM(BR75:CH75)","v":0},"Km  renseignés",{"$f":"SUM(CI75+CI76)","v":0},"Km  renseignés",{"$f":"SUM(BQ75+CK75)","v":0}]
[null,null,"Ronde",null,null,null,null,null,null,null,null,null,null,null,null,null,null,null,null,null,null,null,null,null,null,null,null,null,null,null,null,null,null,null,null,null,null,null,null,null,null,null,null,null,null,null,null,null,null,null,null,null,null,null,null,null,null,null,null,null,null,null,null,null,null,null,{"$f":"SUM(D76:BN76)","v":0},"Km confirmés",{"$f":"SUM(D78:BN78)","v":0},null,null,null,null,null,null,null,null,null,null,null,null,null,null,null,null,null,{"$f":"SUM(BR76:CH76)","v":0},"Km confirmés",{"$f":"SUM(BR78:CH78)","v":0},"Km confirmés",{"$f":"SUM(CK76+BQ76)","v":0}]
[null,null,null,0,0,0,0,0,0,0,0,0,0,0,0,0,0,0,0,0,0,0,0,0,0,0,0,0,0,0,0,0,0,0,0,0,0,0,0,0,0,0,0,0,0,0,0,0,0,0,0,0,0,0,0,0,0,0,0,0,0,0,0,0,0,0,null,"Rondes confirmées",{"$f":"SUM(C77:BN77)","v":0},0,0,0,0,0,0,0,0,0,0,0,0,0,0,0,0,0,null,"Rondes confirmées",{"$f":"SUM(BR77:CI77)","v":0},"Rondes confirmées",{"$f":"SUM(CK77+BQ77)","v":0}]
[null,null,null,{"$f":"SUM((D75+D76)*D77)","v":0},0,0,0,0,0,0,0,0,0,0,0,0,0,0,0,0,0,0,0,0,0,0,0,0,0,0,0,0,0,0,0,0,0,0,0,0,0,0,0,0,0,0,0,0,0,0,0,0,0,0,0,0,0,0,0,0,{"$f":"SUM((BI75+BI76)*BI77)","v":0},0,0,0,0,0,null,"Rondes effectuées",{"$f":"COUNTIF(D75:BN75,\">0\")","v":0},{"$f":"SUM((BR75+BR76)*BR77)","v":0},0,0,0,0,0,0,0,0,0,0,0,0,0,0,0,0,null,"Rondes Effectuées",{"$f":"COUNTIF(BR75:CH75,\">0\")","v":0},"Rondes effectuées",{"$f":"SUM(CK78+BQ78)","v":0}]
[19,{"$f":"VLOOKUP(A79,'Numéro licences'!$A$4:$B$32,2)","v":0},"Aller-Retour",null,null,null,null,null,null,null,null,null,null,null,null,null,null,null,null,null,null,null,null,null,null,null,null,null,null,null,null,null,null,null,null,null,null,null,null,null,null,null,null,null,null,null,null,null,null,null,null,null,null,null,null,null,null,null,null,null,null,null,null,null,null,null,{"$f":"SUM(D79:BN79)","v":0},"Km  renseignés",{"$f":"SUM(BO79+BO80)","v":0},null,null,null,null,null,null,null,null,null,null,null,null,null,null,null,null,null,{"$f":"SUM(BR79:CH79)","v":0},"Km  renseignés",{"$f":"SUM(CI79+CI80)","v":0},"Km  renseignés",{"$f":"SUM(BQ79+CK79)","v":0}]
[null,null,"Ronde",null,null,null,null,null,null,null,null,null,null,null,null,null,null,null,null,null,null,null,null,null,null,null,null,null,null,null,null,null,null,null,null,null,null,null,null,null,null,null,null,null,null,null,null,null,null,null,null,null,null,null,null,null,null,null,null,null,null,null,null,null,null,null,{"$f":"SUM(D80:BN80)","v":0},"Km confirmés",{"$f":"SUM(D82:BN82)","v":0},null,null,null,null,null,null,null,null,null,null,null,null,null,null,null,null,null,{"$f":"SUM(BR80:CH80)","v":0},"Km confirmés",{"$f":"SUM(BR82:CH82)","v":0},"Km confirmés",{"$f":"SUM(CK80+BQ80)","v":0}]
[null,null,null,0,0,0,0,0,0,0,0,0,0,0,0,0,0,0,0,0,0,0,0,0,0,0,0,0,0,0,0,0,0,0,0,0,0,0,0,0,0,0,0,0,0,0,0,0,0,0,0,0,0,0,0,0,0,0,0,0,0,0,0,0,0,0,null,"Rondes confirmées",{"$f":"SUM(C81:BN81)","v":0},0,0,0,0,0,0,0,0,0,0,0,0,0,0,0,0,0,null,"Rondes confirmées",{"$f":"SUM(BR81:CI81)","v":0},"Rondes confirmées",{"$f":"SUM(CK81+BQ81)","v":0}]
[null,null,null,{"$f":"SUM((D79+D80)*D81)","v":0},0,0,0,0,0,0,0,0,0,0,0,0,0,0,0,0,0,0,0,0,0,0,0,0,0,0,0,0,0,0,0,0,0,0,0,0,0,0,0,0,0,0,0,0,0,0,0,0,0,0,0,0,0,0,0,0,{"$f":"SUM((BI79+BI80)*BI81)","v":0},0,0,0,0,0,null,"Rondes effectuées",{"$f":"COUNTIF(D79:BN79,\">0\")","v":0},{"$f":"SUM((BR79+BR80)*BR81)","v":0},0,0,0,0,0,0,0,0,0,0,0,0,0,0,0,0,null,"Rondes Effectuées",{"$f":"COUNTIF(BR79:CH79,\">0\")","v":0},"Rondes effectuées",{"$f":"SUM(CK82+BQ82)","v":0}]
[20,{"$f":"VLOOKUP(A83,'Numéro licences'!$A$4:$B$32,2)","v":0},"Aller-Retour",null,null,null,null,null,null,null,null,null,null,null,null,null,null,null,null,null,null,null,null,null,null,null,null,null,null,null,null,null,null,null,null,null,null,null,null,null,null,null,null,null,null,null,null,null,null,null,null,null,null,null,null,null,null,null,null,null,null,null,null,null,null,null,{"$f":"SUM(D83:BN83)","v":0},"Km  renseignés",{"$f":"SUM(BO83+BO84)","v":0},null,null,null,null,null,null,null,null,null,null,null,null,null,null,null,null,null,{"$f":"SUM(BR83:CH83)","v":0},"Km  renseignés",{"$f":"SUM(CI83+CI84)","v":0},"Km  renseignés",{"$f":"SUM(BQ83+CK83)","v":0}]
[null,null,"Ronde",null,null,null,null,null,null,null,null,null,null,null,null,null,null,null,null,null,null,null,null,null,null,null,null,null,null,null,null,null,null,null,null,null,null,null,null,null,null,null,null,null,null,null,null,null,null,null,null,null,null,null,null,null,null,null,null,null,null,null,null,null,null,null,{"$f":"SUM(D84:BN84)","v":0},"Km confirmés",{"$f":"SUM(D86:BN86)","v":0},null,null,null,null,null,null,null,null,null,null,null,null,null,null,null,null,null,{"$f":"SUM(BR84:CH84)","v":0},"Km confirmés",{"$f":"SUM(BR86:CH86)","v":0},"Km confirmés",{"$f":"SUM(CK84+BQ84)","v":0}]
[null,null,null,0,0,0,0,0,0,0,0,0,0,0,0,0,0,0,0,0,0,0,0,0,0,0,0,0,0,0,0,0,0,0,0,0,0,0,0,0,0,0,0,0,0,0,0,0,0,0,0,0,0,0,0,0,0,0,0,0,0,0,0,0,0,0,null,"Rondes confirmées",{"$f":"SUM(C85:BN85)","v":0},0,0,0,0,0,0,0,0,0,0,0,0,0,0,0,0,0,null,"Rondes confirmées",{"$f":"SUM(BR85:CI85)","v":0},"Rondes confirmées",{"$f":"SUM(CK85+BQ85)","v":0}]
[null,null,null,{"$f":"SUM((D83+D84)*D85)","v":0},0,0,0,0,0,0,0,0,0,0,0,0,0,0,0,0,0,0,0,0,0,0,0,0,0,0,0,0,0,0,0,0,0,0,0,0,0,0,0,0,0,0,0,0,0,0,0,0,0,0,0,0,0,0,0,0,{"$f":"SUM((BI83+BI84)*BI85)","v":0},0,0,0,0,0,null,"Rondes effectuées",{"$f":"COUNTIF(D83:BN83,\">0\")","v":0},{"$f":"SUM((BR83+BR84)*BR85)","v":0},0,0,0,0,0,0,0,0,0,0,0,0,0,0,0,0,null,"Rondes Effectuées",{"$f":"COUNTIF(BR83:CH83,\">0\")","v":0},"Rondes effectuées",{"$f":"SUM(CK86+BQ86)","v":0}]
[21,{"$f":"VLOOKUP(A87,'Numéro licences'!$A$4:$B$32,2)","v":0},"Aller-Retour",null,null,null,null,null,null,null,null,null,null,null,null,null,null,null,null,null,null,null,null,null,null,null,null,null,null,null,null,null,null,null,null,null,null,null,null,null,null,null,null,null,null,null,null,null,null,null,null,null,null,null,null,null,null,null,null,null,null,null,null,null,null,null,{"$f":"SUM(D87:BN87)","v":0},"Km  renseignés",{"$f":"SUM(BO87+BO88)","v":0},null,null,null,null,null,null,null,null,null,null,null,null,null,null,null,null,null,{"$f":"SUM(BR87:CH87)","v":0},"Km  renseignés",{"$f":"SUM(CI87+CI88)","v":0},"Km  renseignés",{"$f":"SUM(BQ87+CK87)","v":0}]
[null,null,"Ronde",null,null,null,null,null,null,null,null,null,null,null,null,null,null,null,null,null,null,null,null,null,null,null,null,null,null,null,null,null,null,null,null,null,null,null,null,null,null,null,null,null,null,null,null,null,null,null,null,null,null,null,null,null,null,null,null,null,null,null,null,null,null,null,{"$f":"SUM(D88:BN88)","v":0},"Km confirmés",{"$f":"SUM(D90:BN90)","v":0},null,null,null,null,null,null,null,null,null,null,null,null,null,null,null,null,null,{"$f":"SUM(BR88:CH88)","v":0},"Km confirmés",{"$f":"SUM(BR90:CH90)","v":0},"Km confirmés",{"$f":"SUM(CK88+BQ88)","v":0}]
[null,null,null,0,0,0,0,0,0,0,0,0,0,0,0,0,0,0,0,0,0,0,0,0,0,0,0,0,0,0,0,0,0,0,0,0,0,0,0,0,0,0,0,0,0,0,0,0,0,0,0,0,0,0,0,0,0,0,0,0,0,0,0,0,0,0,null,"Rondes confirmées",{"$f":"SUM(C89:BN89)","v":0},0,0,0,0,0,0,0,0,0,0,0,0,0,0,0,0,0,null,"Rondes confirmées",{"$f":"SUM(BR89:CI89)","v":0},"Rondes confirmées",{"$f":"SUM(CK89+BQ89)","v":0}]
[null,null,null,{"$f":"SUM((D87+D88)*D89)","v":0},0,0,0,0,0,0,0,0,0,0,0,0,0,0,0,0,0,0,0,0,0,0,0,0,0,0,0,0,0,0,0,0,0,0,0,0,0,0,0,0,0,0,0,0,0,0,0,0,0,0,0,0,0,0,0,0,{"$f":"SUM((BI87+BI88)*BI89)","v":0},0,0,0,0,0,null,"Rondes effectuées",{"$f":"COUNTIF(D87:BN87,\">0\")","v":0},{"$f":"SUM((BR87+BR88)*BR89)","v":0},0,0,0,0,0,0,0,0,0,0,0,0,0,0,0,0,null,"Rondes Effectuées",{"$f":"COUNTIF(BR87:CH87,\">0\")","v":0},"Rondes effectuées",{"$f":"SUM(CK90+BQ90)","v":0}]
[22,{"$f":"VLOOKUP(A91,'Numéro licences'!$A$4:$B$32,2)","v":0},"Aller-Retour",null,null,null,null,null,null,null,null,null,null,null,null,null,null,null,null,null,null,null,null,null,null,null,null,null,null,null,null,null,null,null,null,null,null,null,null,null,null,null,null,null,null,null,null,null,null,null,null,null,null,null,null,null,null,null,null,null,null,null,null,null,null,null,{"$f":"SUM(D91:BN91)","v":0},"Km  renseignés",{"$f":"SUM(BO91+BO92)","v":0},null,null,null,null,null,null,null,null,null,null,null,null,null,null,null,null,null,{"$f":"SUM(BR91:CH91)","v":0},"Km  renseignés",{"$f":"SUM(CI91+CI92)","v":0},"Km  renseignés",{"$f":"SUM(BQ91+CK91)","v":0}]
[null,null,"Ronde",null,null,null,null,null,null,null,null,null,null,null,null,null,null,null,null,null,null,null,null,null,null,null,null,null,null,null,null,null,null,null,null,null,null,null,null,null,null,null,null,null,null,null,null,null,null,null,null,null,null,null,null,null,null,null,null,null,null,null,null,null,null,null,{"$f":"SUM(D92:BN92)","v":0},"Km confirmés",{"$f":"SUM(D94:BN94)","v":0},null,null,null,null,null,null,null,null,null,null,null,null,null,null,null,null,null,{"$f":"SUM(BR92:CH92)","v":0},"Km confirmés",{"$f":"SUM(BR94:CH94)","v":0},"Km confirmés",{"$f":"SUM(CK92+BQ92)","v":0}]
[null,null,null,0,0,0,0,0,0,0,0,0,0,0,0,0,0,0,0,0,0,0,0,0,0,0,0,0,0,0,0,0,0,0,0,0,0,0,0,0,0,0,0,0,0,0,0,0,0,0,0,0,0,0,0,0,0,0,0,0,0,0,0,0,0,0,null,"Rondes confirmées",{"$f":"SUM(C93:BN93)","v":0},0,0,0,0,0,0,0,0,0,0,0,0,0,0,0,0,0,null,"Rondes confirmées",{"$f":"SUM(BR93:CI93)","v":0},"Rondes confirmées",{"$f":"SUM(CK93+BQ93)","v":0}]
[null,null,null,{"$f":"SUM((D91+D92)*D93)","v":0},0,0,0,0,0,0,0,0,0,0,0,0,0,0,0,0,0,0,0,0,0,0,0,0,0,0,0,0,0,0,0,0,0,0,0,0,0,0,0,0,0,0,0,0,0,0,0,0,0,0,0,0,0,0,0,0,{"$f":"SUM((BI91+BI92)*BI93)","v":0},0,0,0,0,0,null,"Rondes effectuées",{"$f":"COUNTIF(D91:BN91,\">0\")","v":0},{"$f":"SUM((BR91+BR92)*BR93)","v":0},0,0,0,0,0,0,0,0,0,0,0,0,0,0,0,0,null,"Rondes Effectuées",{"$f":"COUNTIF(BR91:CH91,\">0\")","v":0},"Rondes effectuées",{"$f":"SUM(CK94+BQ94)","v":0}]
[23,{"$f":"VLOOKUP(A95,'Numéro licences'!$A$4:$B$32,2)","v":0},"Aller-Retour",null,null,null,null,null,null,null,null,null,null,null,null,null,null,null,null,null,null,null,null,null,null,null,null,null,null,null,null,null,null,null,null,null,null,null,null,null,null,null,null,null,null,null,null,null,null,null,null,null,null,null,null,null,null,null,null,null,null,null,null,null,null,null,{"$f":"SUM(D95:BN95)","v":0},"Km  renseignés",{"$f":"SUM(BO95+BO96)","v":0},null,null,null,null,null,null,null,null,null,null,null,null,null,null,null,null,null,{"$f":"SUM(BR95:CH95)","v":0},"Km  renseignés",{"$f":"SUM(CI95+CI96)","v":0},"Km  renseignés",{"$f":"SUM(BQ95+CK95)","v":0}]
[null,null,"Ronde",null,null,null,null,null,null,null,null,null,null,null,null,null,null,null,null,null,null,null,null,null,null,null,null,null,null,null,null,null,null,null,null,null,null,null,null,null,null,null,null,null,null,null,null,null,null,null,null,null,null,null,null,null,null,null,null,null,null,null,null,null,null,null,{"$f":"SUM(D96:BN96)","v":0},"Km confirmés",{"$f":"SUM(D98:BN98)","v":0},null,null,null,null,null,null,null,null,null,null,null,null,null,null,null,null,null,{"$f":"SUM(BR96:CH96)","v":0},"Km confirmés",{"$f":"SUM(BR98:CH98)","v":0},"Km confirmés",{"$f":"SUM(CK96+BQ96)","v":0}]
[null,null,null,0,0,0,0,0,0,0,0,0,0,0,0,0,0,0,0,0,0,0,0,0,0,0,0,0,0,0,0,0,0,0,0,0,0,0,0,0,0,0,0,0,0,0,0,0,0,0,0,0,0,0,0,0,0,0,0,0,0,0,0,0,0,0,null,"Rondes confirmées",{"$f":"SUM(C97:BN97)","v":0},0,0,0,0,0,0,0,0,0,0,0,0,0,0,0,0,0,null,"Rondes confirmées",{"$f":"SUM(BR97:CI97)","v":0},"Rondes confirmées",{"$f":"SUM(CK97+BQ97)","v":0}]
[null,null,null,{"$f":"SUM((D95+D96)*D97)","v":0},0,0,0,0,0,0,0,0,0,0,0,0,0,0,0,0,0,0,0,0,0,0,0,0,0,0,0,0,0,0,0,0,0,0,0,0,0,0,0,0,0,0,0,0,0,0,0,0,0,0,0,0,0,0,0,0,{"$f":"SUM((BI95+BI96)*BI97)","v":0},0,0,0,0,0,null,"Rondes effectuées",{"$f":"COUNTIF(D95:BN95,\">0\")","v":0},{"$f":"SUM((BR95+BR96)*BR97)","v":0},0,0,0,0,0,0,0,0,0,0,0,0,0,0,0,0,null,"Rondes Effectuées",{"$f":"COUNTIF(BR95:CH95,\">0\")","v":0},"Rondes effectuées",{"$f":"SUM(CK98+BQ98)","v":0}]
[24,{"$f":"VLOOKUP(A99,'Numéro licences'!$A$4:$B$32,2)","v":0},"Aller-Retour",null,null,null,null,null,null,null,null,null,null,null,null,null,null,null,null,null,null,null,null,null,null,null,null,null,null,null,null,null,null,null,null,null,null,null,null,null,null,null,null,null,null,null,null,null,null,null,null,null,null,null,null,null,null,null,null,null,null,null,null,null,null,null,{"$f":"SUM(D99:BN99)","v":0},"Km  renseignés",{"$f":"SUM(BO99+BO100)","v":0},null,null,null,null,null,null,null,null,null,null,null,null,null,null,null,null,null,{"$f":"SUM(BR99:CH99)","v":0},"Km  renseignés",{"$f":"SUM(CI99+CI100)","v":0},"Km  renseignés",{"$f":"SUM(BQ99+CK99)","v":0}]
[null,null,"Ronde",null,null,null,null,null,null,null,null,null,null,null,null,null,null,null,null,null,null,null,null,null,null,null,null,null,null,null,null,null,null,null,null,null,null,null,null,null,null,null,null,null,null,null,null,null,null,null,null,null,null,null,null,null,null,null,null,null,null,null,null,null,null,null,{"$f":"SUM(D100:BN100)","v":0},"Km confirmés",{"$f":"SUM(D102:BN102)","v":0},null,null,null,null,null,null,null,null,null,null,null,null,null,null,null,null,null,{"$f":"SUM(BR100:CH100)","v":0},"Km confirmés",{"$f":"SUM(BR102:CH102)","v":0},"Km confirmés",{"$f":"SUM(CK100+BQ100)","v":0}]
[null,null,null,0,0,0,0,0,0,0,0,0,0,0,0,0,0,0,0,0,0,0,0,0,0,0,0,0,0,0,0,0,0,0,0,0,0,0,0,0,0,0,0,0,0,0,0,0,0,0,0,0,0,0,0,0,0,0,0,0,0,0,0,0,0,0,null,"Rondes confirmées",{"$f":"SUM(C101:BN101)","v":0},0,0,0,0,0,0,0,0,0,0,0,0,0,0,0,0,0,null,"Rondes confirmées",{"$f":"SUM(BR101:CI101)","v":0},"Rondes confirmées",{"$f":"SUM(CK101+BQ101)","v":0}]
[null,null,null,{"$f":"SUM((D99+D100)*D101)","v":0},0,0,0,0,0,0,0,0,0,0,0,0,0,0,0,0,0,0,0,0,0,0,0,0,0,0,0,0,0,0,0,0,0,0,0,0,0,0,0,0,0,0,0,0,0,0,0,0,0,0,0,0,0,0,0,0,{"$f":"SUM((BI99+BI100)*BI101)","v":0},0,0,0,0,0,null,"Rondes effectuées",{"$f":"COUNTIF(D99:BN99,\">0\")","v":0},{"$f":"SUM((BR99+BR100)*BR101)","v":0},0,0,0,0,0,0,0,0,0,0,0,0,0,0,0,0,null,"Rondes Effectuées",{"$f":"COUNTIF(BR99:CH99,\">0\")","v":0},"Rondes effectuées",{"$f":"SUM(CK102+BQ102)","v":0}]
[25,{"$f":"VLOOKUP(A103,'Numéro licences'!$A$4:$B$32,2)","v":0},"Aller-Retour",null,null,null,null,null,null,null,null,null,null,null,null,null,null,null,null,null,null,null,null,null,null,null,null,null,null,null,null,null,null,null,null,null,null,null,null,null,null,null,null,null,null,null,null,null,null,null,null,null,null,null,null,null,null,null,null,null,null,null,null,null,null,null,{"$f":"SUM(D103:BN103)","v":0},"Km  renseignés",{"$f":"SUM(BO103+BO104)","v":0},null,null,null,null,null,null,null,null,null,null,null,null,null,null,null,null,null,{"$f":"SUM(BR103:CH103)","v":0},"Km  renseignés",{"$f":"SUM(CI103+CI104)","v":0},"Km  renseignés",{"$f":"SUM(BQ103+CK103)","v":0}]
[null,null,"Ronde",null,null,null,null,null,null,null,null,null,null,null,null,null,null,null,null,null,null,null,null,null,null,null,null,null,null,null,null,null,null,null,null,null,null,null,null,null,null,null,null,null,null,null,null,null,null,null,null,null,null,null,null,null,null,null,null,null,null,null,null,null,null,null,{"$f":"SUM(D104:BN104)","v":0},"Km confirmés",{"$f":"SUM(D106:BN106)","v":0},null,null,null,null,null,null,null,null,null,null,null,null,null,null,null,null,null,{"$f":"SUM(BR104:CH104)","v":0},"Km confirmés",{"$f":"SUM(BR106:CH106)","v":0},"Km confirmés",{"$f":"SUM(CK104+BQ104)","v":0}]
[null,null,null,0,0,0,0,0,0,0,0,0,0,0,0,0,0,0,0,0,0,0,0,0,0,0,0,0,0,0,0,0,0,0,0,0,0,0,0,0,0,0,0,0,0,0,0,0,0,0,0,0,0,0,0,0,0,0,0,0,0,0,0,0,0,0,null,"Rondes confirmées",{"$f":"SUM(C105:BN105)","v":0},0,0,0,0,0,0,0,0,0,0,0,0,0,0,0,0,0,null,"Rondes confirmées",{"$f":"SUM(BR105:CI105)","v":0},"Rondes confirmées",{"$f":"SUM(CK105+BQ105)","v":0}]
[null,null,null,{"$f":"SUM((D103+D104)*D105)","v":0},0,0,0,0,0,0,0,0,0,0,0,0,0,0,0,0,0,0,0,0,0,0,0,0,0,0,0,0,0,0,0,0,0,0,0,0,0,0,0,0,0,0,0,0,0,0,0,0,0,0,0,0,0,0,0,0,{"$f":"SUM((BI103+BI104)*BI105)","v":0},0,0,0,0,0,null,"Rondes effectuées",{"$f":"COUNTIF(D103:BN103,\">0\")","v":0},{"$f":"SUM((BR103+BR104)*BR105)","v":0},0,0,0,0,0,0,0,0,0,0,0,0,0,0,0,0,null,"Rondes Effectuées",{"$f":"COUNTIF(BR103:CH103,\">0\")","v":0},"Rondes effectuées",{"$f":"SUM(CK106+BQ106)","v":0}]
[26,{"$f":"VLOOKUP(A107,'Numéro licences'!$A$4:$B$32,2)","v":0},"Aller-Retour",null,null,null,null,null,null,null,null,null,null,null,null,null,null,null,null,null,null,null,null,null,null,null,null,null,null,null,null,null,null,null,null,null,null,null,null,null,null,null,null,null,null,null,null,null,null,null,null,null,null,null,null,null,null,null,null,null,null,null,null,null,null,null,{"$f":"SUM(D107:BN107)","v":0},"Km  renseignés",{"$f":"SUM(BO107+BO108)","v":0},null,null,null,null,null,null,null,null,null,null,null,null,null,null,null,null,null,{"$f":"SUM(BR107:CH107)","v":0},"Km  renseignés",{"$f":"SUM(CI107+CI108)","v":0},"Km  renseignés",{"$f":"SUM(BQ107+CK107)","v":0}]
[null,null,"Ronde",null,null,null,null,null,null,null,null,null,null,null,null,null,null,null,null,null,null,null,null,null,null,null,null,null,null,null,null,null,null,null,null,null,null,null,null,null,null,null,null,null,null,null,null,null,null,null,null,null,null,null,null,null,null,null,null,null,null,null,null,null,null,null,{"$f":"SUM(D108:BN108)","v":0},"Km confirmés",{"$f":"SUM(D110:BN110)","v":0},null,null,null,null,null,null,null,null,null,null,null,null,null,null,null,null,null,{"$f":"SUM(BR108:CH108)","v":0},"Km confirmés",{"$f":"SUM(BR110:CH110)","v":0},"Km confirmés",{"$f":"SUM(CK108+BQ108)","v":0}]
[null,null,null,0,0,0,0,0,0,0,0,0,0,0,0,0,0,0,0,0,0,0,0,0,0,0,0,0,0,0,0,0,0,0,0,0,0,0,0,0,0,0,0,0,0,0,0,0,0,0,0,0,0,0,0,0,0,0,0,0,0,0,0,0,0,0,null,"Rondes confirmées",{"$f":"SUM(C109:BN109)","v":0},0,0,0,0,0,0,0,0,0,0,0,0,0,0,0,0,0,null,"Rondes confirmées",{"$f":"SUM(BR109:CI109)","v":0},"Rondes confirmées",{"$f":"SUM(CK109+BQ109)","v":0}]
[null,null,null,{"$f":"SUM((D107+D108)*D109)","v":0},0,0,0,0,0,0,0,0,0,0,0,0,0,0,0,0,0,0,0,0,0,0,0,0,0,0,0,0,0,0,0,0,0,0,0,0,0,0,0,0,0,0,0,0,0,0,0,0,0,0,0,0,0,0,0,0,{"$f":"SUM((BI107+BI108)*BI109)","v":0},0,0,0,0,0,null,"Rondes effectuées",{"$f":"COUNTIF(D107:BN107,\">0\")","v":0},{"$f":"SUM((BR107+BR108)*BR109)","v":0},0,0,0,0,0,0,0,0,0,0,0,0,0,0,0,0,null,"Rondes Effectuées",{"$f":"COUNTIF(BR107:CH107,\">0\")","v":0},"Rondes effectuées",{"$f":"SUM(CK110+BQ110)","v":0}]
[27,{"$f":"VLOOKUP(A111,'Numéro licences'!$A$4:$B$32,2)","v":0},"Aller-Retour",null,null,null,null,null,null,null,null,null,null,null,null,null,null,null,null,null,null,null,null,null,null,null,null,null,null,null,null,null,null,null,null,null,null,null,null,null,null,null,null,null,null,null,null,null,null,null,null,null,null,null,null,null,null,null,null,null,null,null,null,null,null,null,{"$f":"SUM(D111:BN111)","v":0},"Km  renseignés",{"$f":"SUM(BO111+BO112)","v":0},null,null,null,null,null,null,null,null,null,null,null,null,null,null,null,null,null,{"$f":"SUM(BR111:CH111)","v":0},"Km  renseignés",{"$f":"SUM(CI111+CI112)","v":0},"Km  renseignés",{"$f":"SUM(BQ111+CK111)","v":0}]
[null,null,"Ronde",null,null,null,null,null,null,null,null,null,null,null,null,null,null,null,null,null,null,null,null,null,null,null,null,null,null,null,null,null,null,null,null,null,null,null,null,null,null,null,null,null,null,null,null,null,null,null,null,null,null,null,null,null,null,null,null,null,null,null,null,null,null,null,{"$f":"SUM(D112:BN112)","v":0},"Km confirmés",{"$f":"SUM(D114:BN114)","v":0},null,null,null,null,null,null,null,null,null,null,null,null,null,null,null,null,null,{"$f":"SUM(BR112:CH112)","v":0},"Km confirmés",{"$f":"SUM(BR114:CH114)","v":0},"Km confirmés",{"$f":"SUM(CK112+BQ112)","v":0}]
[null,null,null,0,0,0,0,0,0,0,0,0,0,0,0,0,0,0,0,0,0,0,0,0,0,0,0,0,0,0,0,0,0,0,0,0,0,0,0,0,0,0,0,0,0,0,0,0,0,0,0,0,0,0,0,0,0,0,0,0,0,0,0,0,0,0,null,"Rondes confirmées",{"$f":"SUM(C113:BN113)","v":0},0,0,0,0,0,0,0,0,0,0,0,0,0,0,0,0,0,null,"Rondes confirmées",{"$f":"SUM(BR113:CI113)","v":0},"Rondes confirmées",{"$f":"SUM(CK113+BQ113)","v":0}]
[null,null,null,{"$f":"SUM((D111+D112)*D113)","v":0},0,0,0,0,0,0,0,0,0,0,0,0,0,0,0,0,0,0,0,0,0,0,0,0,0,0,0,0,0,0,0,0,0,0,0,0,0,0,0,0,0,0,0,0,0,0,0,0,0,0,0,0,0,0,0,0,{"$f":"SUM((BI111+BI112)*BI113)","v":0},0,0,0,0,0,null,"Rondes effectuées",{"$f":"COUNTIF(D111:BN111,\">0\")","v":0},{"$f":"SUM((BR111+BR112)*BR113)","v":0},0,0,0,0,0,0,0,0,0,0,0,0,0,0,0,0,null,"Rondes Effectuées",{"$f":"COUNTIF(BR111:CH111,\">0\")","v":0},"Rondes effectuées",{"$f":"SUM(CK114+BQ114)","v":0}]
[28,{"$f":"VLOOKUP(A115,'Numéro licences'!$A$4:$B$32,2)","v":0},"Aller-Retour",null,null,null,null,null,null,null,null,null,null,null,null,null,null,null,null,null,null,null,null,null,null,null,null,null,null,null,null,null,null,null,null,null,null,null,null,null,null,null,null,null,null,null,null,null,null,null,null,null,null,null,null,null,null,null,null,null,null,null,null,null,null,null,{"$f":"SUM(D115:BN115)","v":0},"Km  renseignés",{"$f":"SUM(BO115+BO116)","v":0},null,null,null,null,null,null,null,null,null,null,null,null,null,null,null,null,null,{"$f":"SUM(BR115:CH115)","v":0},"Km  renseignés",{"$f":"SUM(CI115+CI116)","v":0},"Km  renseignés",{"$f":"SUM(BQ115+CK115)","v":0}]
[null,null,"Ronde",null,null,null,null,null,null,null,null,null,null,null,null,null,null,null,null,null,null,null,null,null,null,null,null,null,null,null,null,null,null,null,null,null,null,null,null,null,null,null,null,null,null,null,null,null,null,null,null,null,null,null,null,null,null,null,null,null,null,null,null,null,null,null,{"$f":"SUM(D116:BN116)","v":0},"Km confirmés",{"$f":"SUM(D118:BN118)","v":0},null,null,null,null,null,null,null,null,null,null,null,null,null,null,null,null,null,{"$f":"SUM(BR116:CH116)","v":0},"Km confirmés",{"$f":"SUM(BR118:CH118)","v":0},"Km confirmés",{"$f":"SUM(CK116+BQ116)","v":0}]
[null,null,null,0,0,0,0,0,0,0,0,0,0,0,0,0,0,0,0,0,0,0,0,0,0,0,0,0,0,0,0,0,0,0,0,0,0,0,0,0,0,0,0,0,0,0,0,0,0,0,0,0,0,0,0,0,0,0,0,0,0,0,0,0,0,0,null,"Rondes confirmées",{"$f":"SUM(C117:BN117)","v":0},0,0,0,0,0,0,0,0,0,0,0,0,0,0,0,0,0,null,"Rondes confirmées",{"$f":"SUM(BR117:CI117)","v":0},"Rondes confirmées",{"$f":"SUM(CK117+BQ117)","v":0}]
[null,null,null,{"$f":"SUM((D115+D116)*D117)","v":0},0,0,0,0,0,0,0,0,0,0,0,0,0,0,0,0,0,0,0,0,0,0,0,0,0,0,0,0,0,0,0,0,0,0,0,0,0,0,0,0,0,0,0,0,0,0,0,0,0,0,0,0,0,0,0,0,{"$f":"SUM((BI115+BI116)*BI117)","v":0},0,0,0,0,0,null,"Rondes effectuées",{"$f":"COUNTIF(D115:BN115,\">0\")","v":0},{"$f":"SUM((BR115+BR116)*BR117)","v":0},0,0,0,0,0,0,0,0,0,0,0,0,0,0,0,0,null,"Rondes Effectuées",{"$f":"COUNTIF(BR115:CH115,\">0\")","v":0},"Rondes effectuées",{"$f":"SUM(CK118+BQ118)","v":0}]
[29,{"$f":"VLOOKUP(A119,'Numéro licences'!$A$4:$B$32,2)","v":0},"Aller-Retour",null,null,null,null,null,null,null,null,null,null,null,null,null,null,null,null,null,null,null,null,null,null,null,null,null,null,null,null,null,null,null,null,null,null,null,null,null,null,null,null,null,null,null,null,null,null,null,null,null,null,null,null,null,null,null,null,null,null,null,null,null,null,null,{"$f":"SUM(D119:BN119)","v":0},"Km  renseignés",{"$f":"SUM(BO119+BO120)","v":0},null,null,null,null,null,null,null,null,null,null,null,null,null,null,null,null,null,{"$f":"SUM(BR119:CH119)","v":0},"Km  renseignés",{"$f":"SUM(CI119+CI120)","v":0},"Km  renseignés",{"$f":"SUM(BQ119+CK119)","v":0}]
[null,null,"Ronde",null,null,null,null,null,null,null,null,null,null,null,null,null,null,null,null,null,null,null,null,null,null,null,null,null,null,null,null,null,null,null,null,null,null,null,null,null,null,null,null,null,null,null,null,null,null,null,null,null,null,null,null,null,null,null,null,null,null,null,null,null,null,null,{"$f":"SUM(D120:BN120)","v":0},"Km confirmés",{"$f":"SUM(D122:BN122)","v":0},null,null,null,null,null,null,null,null,null,null,null,null,null,null,null,null,null,{"$f":"SUM(BR120:CH120)","v":0},"Km confirmés",{"$f":"SUM(BR122:CH122)","v":0},"Km confirmés",{"$f":"SUM(CK120+BQ120)","v":0}]
[null,null,null,0,0,0,0,0,0,0,0,0,0,0,0,0,0,0,0,0,0,0,0,0,0,0,0,0,0,0,0,0,0,0,0,0,0,0,0,0,0,0,0,0,0,0,0,0,0,0,0,0,0,0,0,0,0,0,0,0,0,0,0,0,0,0,null,"Rondes confirmées",{"$f":"SUM(C121:BN121)","v":0},0,0,0,0,0,0,0,0,0,0,0,0,0,0,0,0,0,null,"Rondes confirmées",{"$f":"SUM(BR121:CI121)","v":0},"Rondes confirmées",{"$f":"SUM(CK121+BQ121)","v":0}]
[null,null,null,{"$f":"SUM((D119+D120)*D121)","v":0},0,0,0,0,0,0,0,0,0,0,0,0,0,0,0,0,0,0,0,0,0,0,0,0,0,0,0,0,0,0,0,0,0,0,0,0,0,0,0,0,0,0,0,0,0,0,0,0,0,0,0,0,0,0,0,0,{"$f":"SUM((BI119+BI120)*BI121)","v":0},0,0,0,0,0,null,"Rondes effectuées",{"$f":"COUNTIF(D119:BN119,\">0\")","v":0},{"$f":"SUM((BR119+BR120)*BR121)","v":0},0,0,0,0,0,0,0,0,0,0,0,0,0,0,0,0,null,"Rondes Effectuées",{"$f":"COUNTIF(BR119:CH119,\">0\")","v":0},"Rondes effectuées",{"$f":"SUM(CK122+BQ122)","v":0}]
[null,null,"Nat.Pirates-Hors/FMB"]
[null,null,"Inconnu ou non-confirmé"]
[]
[null,null,"Concentres",{"$f":"COUNTIF(D7:D122,D4)","v":58},58,58,58,58,58,58,58,58,58,58,58,58,58,58,58,58,58,58,58,58,58,58,58,58,58,58,58,58,58,58,58,{"$f":"COUNTIF(AJ7:AJ122,AJ4)","v":58},58,58,58,58,58,58,58,58,58,58,58,58,58,58,58,58,58,58,58,58,58,58,58,58,{"$f":"COUNTIF(BI7:BI122,BI4)","v":58},58,58,58,58,58,{"$f":"SUM(D126:BN126)","v":3654},"Concentres",null,{"$f":"COUNTIF(BR7:BR122,BR4)","v":52},58,58,58,58,58,0,0,0,0,0,0,0,0,0,0,0,{"$f":"SUM(BR126:CH126)","v":342},null,null,"Concentres",{"$f":"SUM(CI126+BO126)","v":3996}]
[null,null,"Rondes",{"$f":"COUNTIF(D8:D123,D5)","v":58},58,58,58,58,58,58,58,58,58,58,58,58,58,58,58,58,58,58,58,58,58,58,0,58,58,0,58,58,58,58,58,{"$f":"COUNTIF(AJ8:AJ123,AJ5)","v":58},58,58,58,58,58,58,58,58,58,58,58,58,58,58,58,58,58,58,58,58,58,58,58,58,{"$f":"COUNTIF(BI8:BI123,BI5)","v":58},58,58,58,58,58,{"$f":"SUM(D127:BN127)","v":3538},"Rondes",null,{"$f":"COUNTIF(BR8:BR123,BR5)","v":3},58,58,58,58,58,0,0,0,0,0,0,0,0,0,0,0,{"$f":"SUM(BR127:CH127)","v":293},null,null,"Rondes",{"$f":"SUM(CI127+BO127)","v":3831}]
[]
[]
[]
[]
[null,"Colonne1"]
[1,"ALAIMO Rosa"]
[{"$f":"SUM(A133+1)","v":2},"BRIDOUX Jacqueline"]
[{"$f":"SUM(A134+1)","v":3},"COSYNS Carine"]
[4,"DEHAUT Stéphane"]
[5,"GREGORICS Kathy"]
[6,"INGELS Chantal"]
[7,"LAMBILLON Anne"]
[8,"LAMIROY Anne"]
[9,"LEQUEUX Anne"]
[10,"LEROY Laure"]
[11,"PRESTI Rose"]
[12]
[13]
[14]
[15]
[16]
[17]
[18]
[19]
[20]
[21]
[22]
[23]
[24]
[25]
[26]
[27]
[28]
[29]
[30]
[31]
[32]
[33]
[34]
[35]
[36]
[37]
[38]
[39]
[40]
[41]
[42]
[43]
[{"$f":"SUM(A175+1)","v":44}]
[45]
[46]

{"sheet":"Résumés","index":8,"n_rows":197,"n_cols":8,"rows_kept":197,"cut":false,"hidden":true,"merged":[[0,1,0,4],[57,1,57,4],[139,1,139,4],[83,1,83,4]]}
[null,"NATIONAL PILOTES"]
[null,null,"FMB","Hors FMB","Total","Conf.","Conc.","Hors"]
[1]
[{"$f":"SUM(A3+1)","v":2}]
[{"$f":"SUM(A4+1)","v":3}]
[4]
[5]
[6]
[7]
[8]
[9]
[10]
[11]
[12]
[13]
[14]
[15]
[16]
[17]
[18]
[19]
[20]
[21]
[22]
[23]
[24]
[25]
[26]
[{"$f":"SUM(A28+1)","v":27}]
[28]
[29]
[30]
[31]
[32]
[33]
[34]
[35]
[36]
[37]
[38]
[{"$f":"SUM(A40+1)","v":39}]
[40]
[41]
[42]
[43]
[44]
[45]
[46]
[47]
[48]
[49]
[50]
[51]
[null,null,{"$f":"SUM(C3:C53)","v":0},{"$f":"SUM(D3:D53)","v":0},{"$f":"SUM(E3:E53)","v":0}]
[null,null,{"$f":"SUM(C54/E54*100)","v":{"$error":"#DIV/0!"}},{"$f":"SUM(D54/E54*100)","v":{"$error":"#DIV/0!"}}]
[]
[]
[null,"INTERNATIONAL PILOTES"]
[null,null,"FMB","Hors FMB","Total","Conf.","Conc.","Hors"]
[1]
[2]
[3]
[4]
[5]
[6]
[7]
[8]
[9]
[10]
[11]
[12]
[13]
[14]
[15]
[16]
[17]
[18]
[19]
[20]
[21]
[null,null,{"$f":"SUM(C60:C80)","v":0},{"$f":"SUM(D60:D80)","v":0},{"$f":"SUM(E60:E80)","v":0}]
[null,null,{"$f":"SUM(C81/E81*100)","v":{"$error":"#DIV/0!"}},{"$f":"SUM(D81/E81*100)","v":{"$error":"#DIV/0!"}}]
[]
[null,"SCRATCH PILOTES"]
[null,null,"FMB","Hors-FMB","Total","Conf.","Conc.","Hors"]
[1]
[{"$f":"SUM(A86+1)","v":2}]
[{"$f":"SUM(A87+1)","v":3}]
[4]
[5]
[6]
[7]
[8]
[9]
[10]
[11]
[12]
[13]
[14]
[15]
[16]
[17]
[18]
[19]
[20]
[21]
[22]
[23]
[24]
[25]
[26]
[{"$f":"SUM(A111+1)","v":27}]
[28]
[29]
[30]
[31]
[32]
[33]
[34]
[35]
[36]
[37]
[38]
[39]
[{"$f":"SUM(A124+1)","v":40}]
[41]
[42]
[43]
[44]
[45]
[46]
[47]
[48]
[49]
[50]
[51]
[null,null,{"$f":"SUM(C86:C136)","v":0},{"$f":"SUM(D86:D136)","v":0},{"$f":"SUM(E86:E136)","v":0}]
[null,null,{"$f":"SUM(C137/(E137/100))","v":{"$error":"#DIV/0!"}},{"$f":"SUM(100-C138)","v":{"$error":"#DIV/0!"}}]
[]
[null,"SCRATCH PASSAGERS"]
[null,null,"FMB","Hors-FMB","Total","Conf.","Conc.","Hors"]
[1]
[{"$f":"SUM(A142+1)","v":2}]
[3]
[4]
[5]
[6]
[7]
[8]
[9]
[10]
[11]
[12]
[13]
[14]
[15]
[16]
[17]
[18]
[null,null,{"$f":"SUM(C142:C159)","v":0},{"$f":"SUM(D142:D159)","v":0},{"$f":"SUM(E142:E159)","v":0}]
[null,null,{"$f":"SUM(C160/(E160/100))","v":{"$error":"#DIV/0!"}},{"$f":"SUM(100-C161)","v":{"$error":"#DIV/0!"}}]
[]
[null,"National Passagers","FMB","Hors-FMB","Total","Conf.","Conc.","Hors"]
[1]
[2]
[3]
[4]
[5]
[6]
[7]
[8]
[9]
[10]
[11]
[12]
[13]
[14]
[15]
[16]
[17]
[18]
[null,null,{"$f":"SUM(C164:C181)","v":0},{"$f":"SUM(D164:D181)","v":0},{"$f":"SUM(E164:E181)","v":0}]
[null,null,{"$f":"SUM(C182/(E182/100))","v":{"$error":"#DIV/0!"}},{"$f":"SUM(100-C183)","v":{"$error":"#DIV/0!"}}]
[]
[null,"Inter Passagers","FMB","Hors-FMB","Total","Conf.","Conc.","Hors"]
[1]
[2]
[3]
[4]
[5]
[6]
[7]
[8]
[9]
[10]
[null,null,{"$f":"SUM(C186:C195)","v":0},{"$f":"SUM(D186:D195)","v":0},{"$f":"SUM(E186:E195)","v":0}]
[null,null,{"$f":"SUM(C196/(E196/100))","v":{"$error":"#DIV/0!"}},{"$f":"SUM(100-C197)","v":{"$error":"#DIV/0!"}}]

{"sheet":"Numéro licences","index":9,"n_rows":62,"n_cols":15,"rows_kept":62,"cut":false,"hidden":true,"merged":[[0,1,0,3]]}
[null,"LISTE DES NUMEROS DE LICENCE (713/)",null,null,null,null,null,null,"LISTE DES NUMEROS DE LICENCE (713/)"]
[]
[null,"NOM","NUMERO","TYPE","Anciens membres 2014",null,null,null,"NOM","NUMERO","TYPE",null,"ALAIMO Rosa","NON","PAS"]
[1,"BRIATTE Joëlle",18595,"PAS","Magenta 3",null,null,1,"BALFROID Pierre","21948/Sp.","PIL",null,"BALFROID Pierre","21948/Sp.","PIL"]
[2,"DEL FABBRO Laurence","NON","PAS",null,null,null,2,"BALLION Pierre","NON","PIL",null,"BALLION Pierre","NON","PIL"]
[3,"ERVEN France",19712,"PAS",null,null,null,3,"BERDOYES Bruno",19582,"PIL",null,"BERDOYES Bruno",19582,"PIL"]
[4,"FIEVET Nathalie","NON","PAS",null,null,null,4,"BERDOYES Yannick",19037,"PIL",null,"BERDOYES Yannick",19037,"PIL"]
[5,"GIAUX Annie",20811,"PAS",null,null,null,5,"BRUNEAU Denis-Claude","NON","PIL",null,"BRIATTE Joëlle",18595,"PAS"]
[6,"GOFFIN Guillaume","NON","PAS",null,null,null,6,"DAVIN Philippe",19631,"PIL",null,"BRUNEAU Denis-Claude","NON","PIL"]
[7,"GREGORICS Kathy","NON","PAS",null,null,null,7,"DE SCHEPPERS Jean-Claude",19516,"PIL",null,"CAPPE Murielle","NON","---"]
[8,"GRIGNET Audrey","NON","PAS",null,null,null,8,"DECUYPER Frédéric","NON","PIL",null,"DAVIN Philippe",19631,"PIL"]
[9,"LAMBILLON Anne","NON","PAS",null,null,null,9,"DEWAERSEGHERS Francis",20162,"PIL",null,"DECUYPER Frédéric","NON","PIL"]
[10,"LAMIROY Anne","NON","PAS",null,null,null,10,"DHONDT Jerry","NON","PIL",null,"DEWAERSEGHERS Francis",20162,"PIL"]
[11,"LEROY Laure",18484,"PAS",null,null,null,11,"DONY Marc",20151,"PIL",null,"DE SCHEPPERS Jean-Claude",19516,"PIL"]
[12,"NICLOUX Christine","21949/Sp.","PAS",null,null,null,12,"DUMONT Christophe","NON","PIL",null,"DEL FABBRO Laurence","NON","PAS"]
[13,"PONT Patricia",19634,"PAS",null,null,null,13,"FAVRESSSE René",18519,"PIL",null,"DHONDT Jerry","NON","PIL"]
[14,"THOMAS Isabelle",21966,"PAS",null,null,null,14,"GOFFIN Amaury",18593,"PIL",null,"DONY Marc",20151,"PIL"]
[15,null,"NON","PAS",null,null,null,15,"JAMOTTE Jean",18669,"PIL",null,"DUMONT Christophe","NON","PIL"]
[16,null,"NON","PAS",null,null,null,16,"LAMBOTTE Didier","NON","PIL",null,"ERVEN France",19712,"PAS"]
[17,null,null,null,null,null,null,17,"LEFEVRE Francis",22964,"PIL",null,"FAVRESSSE René",18519,"PIL"]
[18,null,null,null,null,null,null,18,"LESCAL Thierry",19633,"PIL",null,"FIEVET Nathalie","NON","PAS"]
[19,null,null,null,null,null,null,19,"MALLIEN Philippe",18532,"PIL",null,"GIAUX Annie",20811,"PAS"]
[20,null,null,null,null,null,null,20,"MARIEL Didier",18589,"PIL",null,"GOFFIN Amaury",18593,"PIL"]
[21,null,null,null,null,null,null,21,"MILET Benoit",18739,"PIL",null,"GOFFIN Guillaume","NON","PAS"]
[22,null,null,null,null,null,null,22,"NIHOUL Dany",18497,"PIL",null,"GREGORICS Kathy","NON","PAS"]
[23,null,null,null,null,null,null,23,"OVAERE Jimmy","21448/Sp.","PIL",null,"GRIGNET Audrey","NON","PAS"]
[24,null,null,null,null,null,null,24,"PARMENTIER Dominique",18521,"PIL",null,"GUILLAUME Philippe","19769/Sp.","PIL"]
[25,null,null,null,null,null,null,25,"POCHET Jean-Dominique","NON","PIL",null,"INGELS Chantal","NON","PAS"]
[26,null,null,null,null,null,null,26,"POMPIER Philippe",19048,"PIL",null,"JAMOTTE Jean",18669,"PIL"]
[27,null,null,null,null,null,null,27,"RAMEAU Didier","NON","PIL",null,"LAMBILLON Anne","NON","PAS"]
[28,null,null,null,null,null,null,28,"SPITAELS Bernard",19708,"PIL",null,"LAMBOTTE Didier","NON","PIL"]
[29,null,null,null,null,null,null,29,"TERWAGNE Freddy","NON","PIL",null,"LAMIROY Anne","NON","PAS"]
[30,null,null,null,null,null,null,30,"TERWAGNE Julien",21003,"PIL",null,"LEFEVRE Francis",22964,"PIL"]
[31,null,null,null,null,null,null,31,"THOMAS Isabelle",21966,"PAS",null,"LEROY Laure",18484,"PAS"]
[32,null,null,null,null,null,null,32,"URBAIN Philippe","NON","PIL",null,"LESCAL Thierry",19633,"PIL"]
[33,null,null,null,null,null,null,33,"VANBELLINGEN Jean-Claude",20177,"PIL",null,"MALLIEN Philippe",18532,"PIL"]
[34,null,null,null,null,null,null,34,"VANDEN BOSSCHE Vincent",20746,"PIL",null,"MARIEL Didier",18589,"PIL"]
[35,null,null,null,null,null,null,35,"VANDEN WAEYENBERGH Michel","19407/Sp.","PIL",null,"MILET Benoit",18739,"PIL"]
[36,null,null,null,null,null,null,36,"VANSTEYVOORT André",19366,"PIL",null,"NICLOUX Christine","21949/Sp.","PAS"]
[37,null,null,null,null,null,null,37,"WOUTERS Olivier",19074,"PIL",null,"NIHOUL Dany",18497,"PIL"]
[38,null,null,null,null,null,null,38,"DEMETS Eric",null,null,null,"OVAERE Jimmy","21448/Sp.","PIL"]
[39,null,null,null,null,null,null,39,"DECELLE Hubert",null,null,null,"PARMENTIER Dominique",18521,"PIL"]
[40,null,null,null,null,null,null,40,null,null,null,null,"PIRLOT Francis","NON","---"]
[41,null,null,null,null,null,null,41,null,null,null,null,"POCHET Jean-Dominique","NON","PIL"]
[42,null,null,null,null,null,null,42,null,null,null,null,"POMPIER Philippe",19048,"PIL"]
[43,null,null,null,null,null,null,43,null,null,null,null,"PONT Patricia",19634,"PAS"]
[44,null,null,null,null,null,null,44,null,null,null,null,"RAMEAU Didier","NON","PIL"]
[null,null,null,null,null,null,null,45,null,null,null,null,"SPITAELS Bernard",19708,"PIL"]
[null,null,null,null,null,null,null,46,null,null,null,null,"STRYPSTEIN Nicolas","NON","PIL"]
[null,null,null,null,null,null,null,47,null,null,null,null,"TERWAGNE Freddy","NON","PIL"]
[null,null,null,null,null,null,null,48,null,null,null,null,"TERWAGNE Julien",21003,"PIL"]
[null,null,null,null,null,null,null,49,null,null,null,null,"THOMAS Isabelle",21966,"PAS"]
[null,null,null,null,null,null,null,50,null,null,null,null,"URBAIN Philippe","NON","PIL"]
[null,null,null,null,null,null,null,51,null,null,null,null,"VANBELLINGEN Jean-Claude",20177,"PIL"]
[null,null,null,null,null,null,null,52,null,null,null,null,"VANDEN BOSSCHE Vincent",20746,"PIL"]
[null,null,null,null,null,null,null,53,null,null,null,null,"VANDEN WAEYENBERGH Michel","19407/Sp.","PIL"]
[null,null,null,null,null,null,null,54,null,null,null,null,"VANSTEYVOORT André",19366,"PIL"]
[null,null,null,null,null,null,null,55,null,null,null,null,"WOUTERS Olivier",19074,"PIL"]
[null,null,null,null,null,null,null,56]
[null,null,null,null,null,null,null,57]
[null,null,null,null,null,null,null,58]
[null,null,null,null,null,null,null,59]

{"sheet":"2020-02-28","index":10,"n_rows":65,"n_cols":8,"rows_kept":65,"cut":false,"hidden":true,"merged":[[66,0,66,3],[0,0,3,0],[0,7,3,7],[5,0,6,1],[5,3,6,3],[5,4,6,5],[64,0,64,3]]}
[null,null,null,"Récapitulatif des licenciés 2020"]
[]
[null,null,null,"Liste mise à jour au 28/02/2020"]
[null,null,null,"Moto Club Saint Servais   713"]
[]
["Nom - Prénom",null,null,"Adresse","Localité"]
[null,null,"Date naiss"]
[]
["Alaimo","Rose","1969-02-11"," Carrer Llorers , 26","E.08800","Vilanova I La Geltru",null,1]
["Balfroid","Pierre","1962-01-22","Rue Les Fonds , 97",5340,"Gesves",null,1]
["Ballion","Pierre","1978-06-24","Rue de Mosanville , 20",5101,"Namur",null,1]
["Berdoyes","Bruno","1957-05-26","Rue Lambot , 155",6250,"Aiseau Presles",null,1]
["Berdoyes","Yannick","1965-12-24","Impasse d'une personne,7",6200,"Chatelet",null,1]
["Briatte","Joelle","1977-11-11","Rue des Forges , 42",1480,"Tubize",null,1]
["Bruneau","Denis Claude","1967-12-17","Rue du Rempart , 55","F.59300","Valencienne"]
["Cappe","Murielle",null,"Chaussée de Louvain, 599",5020,"Champion"]
["Conrad","Lionel","1976-11-09","Route de Gésara , 4",6720,"Habay La Neuve"]
["Dandoy","Antoine","1966-02-08","Rue Muzet , 13",5002,"Saint Servais"]
["Davin","Philippe","1955-02-09","Rue L et V Barre , 47 Bte3",5500,"Dinant",null,1]
["De Schepper","Jean Claude","1948-01-17","Avenue des Mésanges , 21",1410,"Waterloo",null,1]
["Del Fabbro","Laurence","1970-10-01","Rue du Rempart , 55","F.59300","Valencienne"]
["Dewaerseghers","Francis",null,"Rue des Aulnes , 21",1435,"Mont St Guibert",null,1]
["Dhondt","Jeremy","1961-03-26","Allée du petit Paris , 27",1410,"Waterloo",null,1]
["Dony","Marc","1958-03-25","A Cense Colombier , 35",1400,"Nivelles",null,1]
["Dumont ","Christophe",null,"Rue de la Station , 66A",1360,"Perwez",null,1]
["Dury","Agnès","1960-02-14","Grand Route , 97",5380,"Fernelmont"]
["Favresse","René","1964-07-02","Grand Place, 10",1360,"Perwez"]
["Fievet","Nathalie","1975-11-07","Rue du Samson , 16",5300,"Thon",null,1]
["Franquet","Francoise","1968-06-01","Rue de la Station ,67",5680,"Matagne La Grande",null,1]
["Giaux ","Annie","1958-02-07","Trou Renard , 36",5340,"Faulx les Tombes",null,1]
["Goffin","Amaury","1981-05-10","Rue des Forges , 42",1480,"Tubize",null,1]
["Goffin ","Guillaume",null,"Rue des Forges , 42",1480,"Tubize",null,1]
["Gregorics","Katty",null,"Rue Fonds des Marechaux,9",5024,"Marche-L-Dames",null,1]
["Grignet","Audrey",null,"Rue de la Station , 66A",1360,"Perwez",null,1]
["Guillaume ","Philippe","1960-05-13","Trou Renard , 36",5340,"Faulx les Tombes",null,1]
["Ingels","Chantal","1950-11-03","Avenue des Mésanges , 21",1410,"Waterloo",null,1]
["Jamotte ","Jean","1958-12-09","Chaussée de Namur , 78",5030,"Gembloux",null,1]
["Lambillon ","Anne","1950-12-07","Rue Arnould, 82",5001,"Belgrade",null,1]
["Lambotte ","Didier","1960-05-25","Route de Huy , 22B",5351,"Haillot",null,1]
["Lamiroy"," Anne","1964-02-28","Hotel des Vignes – Les Capitans","F.69840","Julienas",null,1]
["Lefevre","Francis",null,"Rue Grogerie , 75",6120,"Nalinnes",null,1]
["Leroy","Laure","1948-12-18","Zuidlaan, 27",1560,"Hoeilaart",null,1]
["Lescal","Thierry","1962-07-14","Rue Gaston Ragon , 14",5170,"Profondeville",null,1]
["Mallien ","Philippe","1967-11-20","Rue du Samson,16",5300,"Thon",null,1]
["Mariel","Didier","1963-10-07","Rue de L'Eglise , 65",5030,"Gembloux",null,1]
["Milet","Benoit","1964-11-06","Hotel des Vignes – Les Capitans","F.69840","Julienas",null,1]
["Nicloux ","Christine","1964-11-12","Rue Les Fonds , 97",5340,"Gesves",null,1]
["Nihoul ","Dany","1963-06-12","Rue Fonds des Marechaux,9",5024,"Marche-L-Dames",null,1]
["Ovaere","Jimmy","1982-01-06","Place de la Chapelle , 8",7540,"Tournai",null,1]
["Parmentier","Dominique","1957-12-01","Rue Arnould, 82",5001,"Belgrade",null,1]
["Pirlot"," Francis",null,"Chaussée de Louvain, 599",5020,"Champion"]
["Pompier","Philippe","1952-08-16","Rue de la Morava, 21",5001,"Belgrade",null,1]
["Pont","Patricia","1965-04-02","Rue Gaston Ragon , 14",5170,"Profondeville",null,1]
["Strypstein","Nicolas","1965-03-26"," Carrer Llorers , 26","E.08800","Vilanova I La Geltru",null,1]
["Terwagne","Julien","1985-10-25","Rue du Grenadier , 74",5032,"Corroy le Chateau",null,1]
["Thomas","Isabelle",null,"Rue Grogerie , 75",6120,"Nalinnes",null,1]
["Urbain ","Philippe","1973-07-20","Rue Dourlet,83 bte2",6000,"Charleroi",null,1]
["Vanbellingen","Jean-Claude","1948-01-12","Zuidlaan, 27",1560,"Hoeilaart",null,1]
["Vanden Bossche","Vincent",null,"Chemin des Anglais , 8",7642,"Calonne",null,1]
["Vanden Waeyenbergh","Michel",null,"Chemin Bernard Croix , 49",1325,"Chaumont Gistoux",null,1]
["Vandervelden","Robert","1964-11-22","Rue de la Station ,67",5680,"Matagne La Grande",null,1]
["Vansteyvoort","Andre","1957-01-28","Av. Pois de Senteur , 14",1020,"Bruxelles",null,1]
["Wouters","Olivier","1970-02-14","Av. Alph Allard , 245",1420,"Braine L'Alleud",null,1]
[]
["N° compte F.M.W.B. asbl: 068-2292695-30",null,null,null,null,null,null,{"$f":"SUM(H9:H64)","v":47}]

{"sheet":"A","index":11,"n_rows":31,"n_cols":10,"rows_kept":31,"cut":false,"hidden":true,"merged":[]}
[null,null,null,null,null,null,null,null,"2020-02-28"]
[null,null,"Licences des membres du club"]
["N° M.","Nom prénom","lic. Type","Discipline","Niveau","Catégorie","Classe","N° départ","Valable du","Jusqu'au"]
[21448,"OVAERE Jimmy","LIC. YEAR","VIT","EUR","JUN","OBCSS",58,"2020-01-10","2020-12-31"]
[21448,"OVAERE Jimmy","LIC. YEAR","VIT","EUR","JUN","END",888,"2020-01-10","2020-12-31"]
[20746,"VANDEN BOSSCHE VINCENT","LIC. YEAR","VIT","EUR","JUN","OBCSS",38,"2020-01-02","2020-12-31"]
[20746,"VANDEN BOSSCHE VINCENT","LIC. YEAR","VIT","EUR","JUN","END",35,"2020-01-02","2020-12-31"]
[19407,"VANDEN WAEYENBERGH Michel Joseph","LIC. YEAR","VIT","EUR","JUN","END",38,"2020-02-28","2020-12-31"]
[19582,"BERDOYES Bruno","LIC. TOUR","TOUR","NAT","PIL","***",0,"2020-02-10","2020-12-31"]
[19037,"BERDOYES Yannick","LIC. TOUR","TOUR","NAT","PIL","***",0,"2020-01-21","2020-12-31"]
[19631,"DAVIN PHILIPPE","LIC. TOUR","TOUR","NAT","PIL","***",0,"2020-01-08","2020-12-31"]
[20162,"DEWAERSEGHERS FRANCIS","LIC. TOUR","TOUR","NAT","PIL","***",0,"2020-01-21","2020-12-31"]
[20151,"DONY MARC","LIC. TOUR","TOUR","NAT","PIL","***",0,"2020-02-04","2020-12-31"]
[18593,"GOFFIN Amaury Jean","LIC. TOUR","TOUR","NAT","PIL","***",0,"2020-01-02","2020-12-31"]
[18669,"JAMOTTE Jean","LIC. TOUR","TOUR","NAT","PIL","***",0,"2020-01-09","2020-12-31"]
[19633,"LESCAL THIERRY","LIC. TOUR","TOUR","NAT","PIL","***",0,"2020-01-02","2020-12-31"]
[18532,"MALLIEN Philippe Alfred","LIC. TOUR","TOUR","NAT","PIL","***",0,"2020-01-03","2020-12-31"]
[18589,"MARIEL Didier","LIC. TOUR","TOUR","NAT","PIL","***",0,"2020-01-14","2020-12-31"]
[18739,"MILET Benoît Jean","LIC. TOUR","TOUR","NAT","PIL","***",0,"2020-02-10","2020-12-31"]
[18497,"NIHOUL Dany Christian","LIC. TOUR","TOUR","NAT","PIL","***",0,"2020-01-14","2020-12-31"]
[18521,"PARMENTIER Dominique Philippe","LIC. TOUR","TOUR","NAT","PIL","***",0,"2020-01-09","2020-12-31"]
[21003,"TERWAGNE Julien Thomas","LIC. TOUR","TOUR","NAT","PIL","***",0,"2020-02-10","2020-12-31"]
[22710,"URBAIN Philippe","LIC. TOUR","TOUR","NAT","PIL","***",0,"2020-01-03","2020-12-31"]
[20177,"VANBELLINGEN Jean-Claude","LIC. TOUR","TOUR","NAT","PIL","***",0,"2020-01-03","2020-12-31"]
["18519","FAVRESSE René Claude","LIC.TOUR","TOUR","NAT","PIL","***",0,"2020-02-28","2020-12-21"]
[19074,"WOUTERS OLIVIER","LIC. TOUR","TOUR","NAT","PIL","***",0,"2020-01-23","2020-12-31"]
[18484,"LEROY Laure Marie","LIC. TOUR","TOUR","NAT","PASS","***",0,"2020-01-03","2020-12-31"]
[19634,"PONT PATRICIA","LIC. TOUR","TOUR","NAT","PASS","***",0,"2020-01-02","2020-12-31"]
[21448,"OVAERE Jimmy","LIC. YEAR","CLASSIC","EUR","VIT","***",25,"2020-01-10","2020-12-31"]
["Nombre de lignes :",25,null,null,null,null,"Powered by Magelan Software (www.magelan.be)"]
[null,null,null,null,null,null,null,1]

{"sheet":"Numéro licences (2)","index":12,"n_rows":50,"n_cols":6,"rows_kept":50,"cut":false,"hidden":true,"merged":[[0,1,0,4]]}
[null,"LISTE DES NUMEROS DE LICENCE (713/)"]
["Colonne1","NOM","Num. Membre","Num. Licence","TYPE"]
[1,"ALAIMO Rosa","NON",null,"PAS","Anciens membres 2017"]
[2,"ALBERTY Corentin",19038,null,"PIL","Magenta 3"]
[3,"BALLION Pierre","NON",null,"PIL"]
[4,"BERDOYES Bruno",19582,"85-1101","PIL"]
[5,"BERDOYES Eric",null,null,"PIL"]
[6,"BERDOYES Yannick",19037,"85-898","PIL"]
[7,"BRIATTE Joëlle",18595,"85-107","PAS"]
[8,"BRUNEAU Denis-Claude","NON",null,"PIL"]
[9,"CAPPE Murielle","NON",null,"---"]
[10,"DAVIN Philippe",19631,"85-1143","PIL"]
[11,"DE SCHEPPERS Jean-Claude",19516,null,"PIL"]
[13,"DECELLE Hubert","NON",null,"PIL"]
[12,"DEL FABBRO Laurence","NON",null,"PAS"]
[14,"DONY Marc",null,null,"PIL"]
[15,"ERVEN France",19712,"85-1215","PAS"]
[16,"FAVRESSSE René",18519,"85-51","PIL"]
[17,"FIEVET Nathalie","NON",null,"PAS"]
[19,"GOFFIN Amaury",18593,"85-105","PIL"]
[20,"GREGORICS Kathy","NON",null,"PAS"]
[21,"GUILLAUME Philippe","Licence sportive",null,"PIL"]
[22,"INGELS Chantal","NON",null,"PAS"]
[23,"JAMOTTE Jean",18669,"85-198","PIL"]
[24,"LAMBILLON Anne","NON",null,"PAS"]
[25,"LAMBOTTE Didier","NON",null,"PIL"]
[26,"LAMIROY Anne","NON",null,"PAS"]
[27,"LEROY Laure",18484,"85-33","PAS"]
[28,"LEROY Michel",null,null,"PIL"]
[29,"LESCAL Thierry",19633,"85-1145","PIL"]
[30,"LINCLAU Sandrine","NON",null,"PAS"]
[31,"MALLIEN Philippe",18532,"85-60","PIL"]
[32,"MARIEL Didier",18589,"85-111","PIL"]
[33,"MILET Benoit",18739,"85-266","PIL"]
[34,"NIHOUL Dany",18497,"85-40","PIL"]
[35,"ORRU Marildo",19525,"85-1021","PIL"]
[36,"OVAERE Jimmy","19427 / Sportive","21-1116/17/18","PIL"]
[37,"PARMENTIER Dominique",18521,"85-52","PIL"]
[38,"PIRLOT Francis","NON",null,"---"]
[39,"POMPIER Philippe",19048,"85-524","PIL"]
[40,"PONT Patricia",19634,"85-1146","PAS"]
[42,"SPITAELS Bernard",19708,"85-1213","PIL"]
[43,"STRYPSTEIN Nicolas","NON",null,"PIL"]
[44,"TERWAGNE Julien","NON",null,"PIL"]
[45,"URBAIN Philippe","NON",null,"PIL"]
[46,"VANBELLINGEN Jean-Claude",18480,"85-29","PIL"]
[48,"VANSTEYVOORT André",19366,"85-861","PIL"]
[49,"WOUTERS Olivier",19074,"85-544","PIL"]
[18]
[47]

{"sheet":"Numéro licences (3)","index":13,"n_rows":51,"n_cols":5,"rows_kept":51,"cut":false,"hidden":true,"merged":[[0,1,0,3]]}
[null,"LISTE DES NUMEROS DE LICENCE (713/)"]
[null,"NOM","Num. Licence","TYPE"]
[null,"ALAIMO Rosa","NON","PAS","Anciens membres 2018"]
[1,"BALLION Pierre","NON","PIL","Magenta 3"]
[2,"BERDOYES Bruno","19582/713","PIL"]
[3,"BERDOYES Eric","20186/713","PIL","Membres pas encore"]
[4,"BERDOYES Yannick","19037/713","PIL","en ordre d'affiliation club"]
[5,"BRIATTE Joëlle","18595/713","PAS"]
[6,"BRUNEAU Denis-Claude","NON","PIL"]
[7,"CAPPE Murielle","NON","---"]
[8,"CONRAD Lionel","21061/713","PIL"]
[9,"DAVIN Philippe","19631/713","PIL"]
[10,"DE SCHEPPERS Jean-Claude","19516/713","PIL"]
[11,"DECELLE Hubert","NON","PIL"]
[12,"DEL FABBRO Laurence","NON","PAS"]
[13,"DONY Marc","20151/713","PIL"]
[14,"ERVEN France","19712/713","PAS"]
[15,"FAVRESSSE René","18519/713","PIL"]
[16,"FIEVET Nathalie","NON","PAS"]
[17,"GIAUX Annie","20811/713","PAS"]
[18,"GOFFIN Amaury","18593/713","PIL"]
[19,"GREGORICS Kathy","NON","PAS"]
[20,"GUILLAUME Philippe","19769/713/Sportive","PIL"]
[21,"INGELS Chantal","NON","PAS"]
[22,"JAMOTTE Jean","18669/713","PIL"]
[23,"LAMBILLON Anne","NON","PAS"]
[24,"LAMBOTTE Didier","NON","PIL"]
[25,"LAMIROY Anne","NON","PAS"]
[26,"LEROY Laure","18484/713","PAS"]
[27,"LESCAL Thierry","19633/713","PIL"]
[28,"MALLIEN Philippe","18532/713","PIL"]
[29,"MARIEL Didier","18589/713","PIL"]
[30,"MILET Benoit","18739/713","PIL"]
[31,"NIHOUL Dany","18497/713","PIL"]
[32,"ORRU Marildo","19525/713","PIL"]
[33,"OVAERE Jimmy","21448/713/Sportive","PIL"]
[34,"PARMENTIER Dominique","18521/713","PIL"]
[35,"PIRLOT Francis","NON","---"]
[36,"POMPIER Philippe","19048/713","PIL"]
[37,"PONT Patricia","19634/713","PAS"]
[38,"SPITAELS Bernard","19708/713","PIL"]
[39,"STRYPSTEIN Nicolas","NON","PIL"]
[40,"TERWAGNE Julien","21003/713","PIL"]
[41,"URBAIN Philippe","NON","PIL"]
[42,"VANBELLINGEN Jean-Claude","20177/713","PIL"]
[43,"VANDEN BOSSCHE Vincent","20746/713","PIL"]
[44,"VANSTEYVOORT André","19366/713","PIL"]
[45,"WOUTERS Olivier","19074/713","PIL"]
[46]
[47]
[48]

{"sheet":"Kilomètre AR","index":14,"n_rows":68,"n_cols":8,"rows_kept":68,"cut":false,"hidden":true,"merged":[]}
[0,"RONDE FMB",0,0,null,"Club","A","AR"]
[103,"KAMC HERENTALS",95,190,null,"103  KAMC HERENTALS",95,190]
[126,"MTC TOERVRIENDEN  Brasschaat",109,218,null,"126  MTC TOERVRIENDEN  Brasschaat",109,218]
[136,"MTC AMIGO'S   Schoten",104,208,null,"136  MTC AMIGO'S   Schoten",104,208]
[137,"MTC YELLS ARMY   Berchem",96,192,null,"137  MTC YELLS ARMY   Berchem",96,192]
[138,"MC TIGRIS PANTERA  Brasschaat",109,218,null,"138  MC TIGRIS PANTERA  Brasschaat",109,218]
[206,"MC L'EQUIPE  Bruxelles",58,116,null,"206  MC L'EQUIPE  Bruxelles",58,116]
[223,"RMU WAVRIEN",34,68,null,"223  RMU WAVRIEN",34,68]
[228,"RMC PIERREUX  Mt St Guibert",28,56,null,"228  RMC PIERREUX  Mt St Guibert",28,56]
[243,"MACADAM BOYS    Bruxelles",58,116,null,"243  MACADAM BOYS    Bruxelles",58,116]
[306,"CIRCUIT DE CHIMAY",74,148,null,"306  CIRCUIT DE CHIMAY",74,148]
[312,"MC RESSAIX",52,104,null,"312  MC RESSAIX",52,104]
[317,"MC CADRE BLANC HAUTRAGE",81,162,null,"317  MC CADRE BLANC HAUTRAGE",81,162]
[332,"MC BUTZ BIKERS 95   Ecaussinnes",54,108,null,"332  MC BUTZ BIKERS 95   Ecaussinnes",54,108]
[406,"RAMC EUPEN",97,194,null,"406  RAMC EUPEN",97,194]
[417,"AMC RAC JUNIOR  Liège",62,124,null,"417  AMC RAC JUNIOR  Liège",62,124]
[419,"AMC ST VITH",131,262,null,"419  AMC ST VITH",131,262]
[422,"MC THEUX-FRANCHIMONT",83,166,null,"422  MC THEUX-FRANCHIMONT",83,166]
[424,"RMC VERVIETOIS",88,176,null,"424  RMC VERVIETOIS",88,176]
[426,"MTC WELKENRAEDT",93,186,null,"426  MTC WELKENRAEDT",93,186]
[427,"MC ZEBUS  Flémalle",52,104,null,"427  MC ZEBUS  Flémalle",52,104]
[438,"MC DUREN   Elsenborn",127,254,null,"438  MC DUREN   Elsenborn",127,254]
[445,"MC INDIAN SPIRIT BELGIUM Cheratte",70,140,null,"445  MC INDIAN SPIRIT BELGIUM Cheratte",70,140]
[454,"MC ARIZONABIKERS  Andrimont",90,180,null,"454  MC ARIZONABIKERS  Andrimont",90,180]
[508,"AMC KOERSEL",88,176,null,"508  AMC KOERSEL",88,176]
[516,"MC LOTUS  Bilzen",74,148,null,"516  MC LOTUS  Bilzen",74,148]
[531,"MC HOESELT",70,140,null,"531  MC HOESELT",70,140]
[533,"MTC 13  Leopoldsburg",92,184,null,"533  MTC 13  Leopoldsburg",92,184]
[549,"MTC WELLEN   Wellen",65,130,null,"549  MTC WELLEN   Wellen",65,130]
[614,"MC CHEVY RACING   Libramont-Chevigny",81,162,null,"614  MC CHEVY RACING   Libramont-Chevigny",81,162]
[617,"MC GRANDS DUCS   Martelange",109,218,null,"617  MC GRANDS DUCS   Martelange",109,218]
[703,"R CINEY MC",30,60,null,"703  R CINEY MC",30,60]
[705,"MC DINANT",30,60,null,"705  MC DINANT",30,60]
[709,"RUMESM METTET",27,54,null,"709  RUMESM METTET",27,54]
[710,"MC MOLIGNARD  Warnant",26,52,null,"710  MC MOLIGNARD  Warnant",26,52]
[712,"AMC EAU NOIRE  Nismes",63,126,null,"712  AMC EAU NOIRE  Nismes",63,126]
[713,"MC ST SERVAIS",0,0,null,"713  MC ST SERVAIS",0,0]
[716,"AMC FLOREFFE",10,20,null,"716  AMC FLOREFFE",10,20]
[721,"MC LES PETITS GRIS   Warisoulx",10,20,null,"721  MC LES PETITS GRIS   Warisoulx",10,20]
[726,"MC BIKE AND TRIKE BELGIUM  Dhuy",17,34,null,"726  MC BIKE AND TRIKE BELGIUM  Dhuy",17,34]
[729,"VIROINVAL MOTOR SPORT Dourbes",62,124,null,"729  VIROINVAL MOTOR SPORT Dourbes",62,124]
[730,"MC LES 4 & CO  Assesse",19,38,null,"730  MC LES 4 & CO  Assesse",19,38]
[806,"MC SCHELDELAND  Wichelen",97,194,null,"806  MC SCHELDELAND  Wichelen",97,194]
[810,"BMW MC VLAANDEREN  Lede",92,184,null,"810  BMW MC VLAANDEREN  Lede",92,184]
[813,"MOTORSPORT   Aalst",88,176,null,"813  MOTORSPORT   Aalst",88,176]
[818,"MTC VLAANDEREN   Aalst",88,176,null,"818  MTC VLAANDEREN   Aalst",88,176]
[900,"Randonnée Amitié","?",null,null,"Randonnée Amitié","?"]
[902,"AMC GIJVERINKHOVE",190,380,null,"902  AMC GIJVERINKHOVE",190,380]
[903,"AMSC LEIELAND  Wervik",148,296,null,"903  AMSC LEIELAND  Wervik",148,296]
[904,"KAMC MENEN",148,296,null,"904  KAMC MENEN",148,296]
[907,"KV OSTEND MS",172,344,null,"907  KV OSTEND MS",172,344]
[908,"AMC POPERINGE",178,356,null,"908  AMC POPERINGE",178,356]
[910,"AMC EENDRACHT TORHOUT",162,324,null,"910  AMC EENDRACHT TORHOUT",162,324]
[912,"MTC ZEDELGEM",156,312,null,"912  MTC ZEDELGEM",156,312]
[920,"WESTHOEK BIKERS  Houtem",193,386,null,"920  WESTHOEK BIKERS  Houtem",193,386]
[921,"MTC VRIJBOS   Houthulst",172,344,null,"921  MTC VRIJBOS   Houthulst",172,344]
[922,"MTC REDBONE  Wevezele",146,292,null,"922  MTC REDBONE  Wevezele",146,292]
[1000,"FREE",1000,null,null,null,null,0]
[2000,null,null,null,null,null,null,0]
[null,null,null,null,null,null,null,0]
[null,null,null,null,null,null,null,0]
[null,null,null,null,null,null,null,0]
[null,null,null,null,null,null,null,0]
[null,null,null,null,null,null,null,0]
[null,null,null,null,null,null,null,0]
[null,null,null,null,null,null,null,0]
[null,null,null,null,null,null,null,0]
[null,null,null,null,null,null,null,0]